Elementary Multiperspective Material Ontology (EMMO)
type: Ontology
version IRI: 1.0.0-rc3
contributor: FrancescaBleken
contributor: FrancescoZaccarini
contributor: GeorgSchmitz
contributor: OtelloRoscioni
contributor: SimonClark
creator: https://orcid.org/0000-0003-4065-9742
creator: AdhamHashibon
creator: EmanueleGhedini
creator: GerhardGoldbeck
creator: JesperFriis
has format: turtle
publisher: emmc.eu
abstract: Elementary Multiperspective Material Ontology (EMMO) EMMO is a multidisciplinary effort to develop a standard representational framework (the ontology) based on current materials modelling knowledge, including physical sciences, analytical philosophy and information and communication technologies. It provides the connection between the physical world, materials characterisation world and materials modelling world. EMMO is released under a Creative Commons license Attribution 4.0 International (CC BY 4.0).
alternative: EMMO
bibliographic citation: F. A. Zaccarini, C. Masolo, E. Ghedini, and S. Borgo. From Causation (and Parthood) to Time: The Case of EMMO (2023) doi: 10.3233/FAIA231120
created: 2024-03
issued: 2018-05-03
license: https://creativecommons.org/licenses/by/4.0/legalcode
modified: 2024-03
source: European Commission, Directorate-General for Research and Innovation, Baas, A., What makes a material function? - Let me compute the ways - Modelling in H2020 LEIT-NMBP programme materials and nanotechnology projects -Sixth version - Short version, Baas, A.(editor), Publications Office of the European Union, 2017, https://data.europa.eu/doi/10.2777/404734
source: CWA 17815, Materials characterisation - Terminology, metadata and classification. Led by EMMC. 2017. https://www.cencenelec.eu/media/CEN-CENELEC/CWAs/ICT/cwa17815.pdf
doi: 10.5281/zenodo.6528495
status: First release candidate for v1.0.0 of the top-level ontology.
preferred namespace prefix: emmo
comment: The EMMO should be reasoned in order to visualize all inferences and class hierarchy in Protege (ctrl+R hotkey). It is tested with both the HermiT (preferred) and HermiT reasoners.
prior version: 1.0.0-beta7
version info: 1.0.0-rc3

hasUnitSymbol
type: ObjectProperty
comment: Relates a prefixed unit to its unit symbol part.
EMMO 967080e5 2f42 4eb2 a3a9 c58143e835f9: Relates a prefixed unit to its unit symbol part.

precedes
type: ObjectProperty
type: AsymmetricProperty
type: IrreflexiveProperty
comment: A temporal relation between two entities occurs when the two entities are in a one directional causality relation. The idea is that a temporal relation always implies a one-directional causality between two entities, leading to a asymmetric relation. This means that the causing entity can be in direct and optionally indirect causality relation with the effect entity. On the contrary, the effect entity cannot be in any causal relation (direct or indirect) with the causing entity.
comment: A time contact occurs when x isDirectCause y and not(y isCauseOf x).
comment: Each pair of entities in direct causality relation is either in hasNext or hasTwoWayCauseWith relation. The two are mutually exclusive.
alternative label: foregoes
alternative label: hasNext
alternative label: isBefore
example: My life between 18-24 years has next my life between 24-32 years.
example: The raw sample has next the treated sampled, which has next the examined sample. In this sense the whole sample is made of three states, connected by the has next relation, following its evolution in time.
EMMO 31252f35 c767 4b97 a877 1235076c3e13: A temporal relation between two entities occurs when the two entities are in a one directional causality relation. The idea is that a temporal relation always implies a one-directional causality between two entities, leading to a asymmetric relation. This means that the causing entity can be in direct and optionally indirect causality relation with the effect entity. On the contrary, the effect entity cannot be in any causal relation (direct or indirect) with the causing entity.
EMMO 967080e5 2f42 4eb2 a3a9 c58143e835f9: A time contact occurs when x isDirectCause y and not(y isCauseOf x).
EMMO c7b62dd7 063a 4c2a 8504 42f7264ba83f: Each pair of entities in direct causality relation is either in hasNext or hasTwoWayCauseWith relation. The two are mutually exclusive.
EMMO c7b62dd7 063a 4c2a 8504 42f7264ba83f: This relation is asymmetric and irreflexive.

directlyCauses
type: ObjectProperty
type: IrreflexiveProperty
comment: A causal relation between the causing and the effected entities occurring without intermediaries.
comment: Direct causality is a concept that captures the idea of direct interaction between two entities, given the fact that there are no causal intermediaries between them. It requires that at least a quantum of the causing entity is direct cause of a quantum of the caused entity. It does not exclude the possibility of other indirect causal routes between some proper parts of the two entities. The direct causality in a 4D ontology covers both time-like causal interaction (when causality is one-way from one entity to another) and space-like causal interaction (when causality is two-way between two entities).
comment: Direct cause is irreflexive.
alternative label: isDirectCauseOf
EMMO 31252f35 c767 4b97 a877 1235076c3e13: Direct causality is a concept that captures the idea of direct interaction between two entities, given the fact that there are no causal intermediaries between them. It requires that at least a quantum of the causing entity is direct cause of a quantum of the caused entity. It does not exclude the possibility of other indirect causal routes between some proper parts of the two entities. The direct causality in a 4D ontology covers both time-like causal interaction (when causality is one-way from one entity to another) and space-like causal interaction (when causality is two-way between two entities).
EMMO 967080e5 2f42 4eb2 a3a9 c58143e835f9: A causal relation between the causing and the effected entities occurring without intermediaries.
EMMO c7b62dd7 063a 4c2a 8504 42f7264ba83f: Direct cause is irreflexive.
EMMO c7b62dd7 063a 4c2a 8504 42f7264ba83f: Direct cause provides the edges for the transitive restriction of the direct acyclic causal graph whose nodes are the quantum entities.

isBefore
type: ObjectProperty
type: AsymmetricProperty
type: IrreflexiveProperty
comment: A relation between entities that are only one-directionally causally connected.
comment: A relation jointly covered by hasNext and hasSuccessor relations, which are mutually exclusive.
alternative label: isTemporallyBefore
EMMO 70fe84ff 99b6 4206 a9fc 9a8931836d84: A relation jointly covered by hasNext and hasSuccessor relations, which are mutually exclusive.
EMMO 967080e5 2f42 4eb2 a3a9 c58143e835f9: A relation between entities that are only one-directionally causally connected.

follows
type: ObjectProperty
type: AsymmetricProperty
type: IrreflexiveProperty
alternative label: isNextOf
alternative label: succeeds

contacts
type: ObjectProperty
type: SymmetricProperty
type: IrreflexiveProperty
comment: A spatial contact between two entities occurs when the two entities are in an interaction relation whose causal structure is a representation of the fundamental interactions between elementary particles (Feynman diagrams). It means that if two entities are in contact, then there is at least a couple of elementary particles, one part of the first and one part of the second, interacting according to one of the fundamental interactions through virtual particles. This kind of connection is space-like (i.e. interconnecting force carrier particle is offshelf). Contacts between two entities exclude the possibility of other causal relations that are not included in a fundamental space-like interaction.
comment: An interaction that is the sum of direct causality relations between two entities that are interpretable as fundamental physical interactions.
comment: Spatial contact is symmetric and irreflexive.
alternative label: adjacentWith
alternative label: hasSpatialnteractionWith
alternative label: touches
example: An elementary electron is in contact with another elementary electron in a scattering process.
example: The laptop is in contact with the desk, since there is a double-directional causality.
EMMO 31252f35 c767 4b97 a877 1235076c3e13: A spatial contact between two entities occurs when the two entities are in an interaction relation whose causal structure is a representation of the fundamental interactions between elementary particles (Feynman diagrams). It means that if two entities are in contact, then there is at least a couple of elementary particles, one part of the first and one part of the second, interacting according to one of the fundamental interactions through virtual particles. This kind of connection is space-like (i.e. interconnecting force carrier particle is offshelf). Contacts between two entities exclude the possibility of other causal relations that are not included in a fundamental space-like interaction.
EMMO 967080e5 2f42 4eb2 a3a9 c58143e835f9: An interaction that is the sum of direct causality relations between two entities that are interpretable as fundamental physical interactions.
EMMO c7b62dd7 063a 4c2a 8504 42f7264ba83f: Spatial contact is symmetric and irreflexive.
EMMO c7b62dd7 063a 4c2a 8504 42f7264ba83f: The contact relation is not an ordering relation since is symmetric.

isAfter
type: ObjectProperty
type: AsymmetricProperty
type: IrreflexiveProperty
alternative label: isTemporallyAfter

isCausedBy
type: ObjectProperty
type: IrreflexiveProperty

hasRedundantPart
type: ObjectProperty
comment: A part is always distinct xor redundant.
comment: The superproperty of the all object property relations between a whole and its mereological parts of the same type.
comment: RP(x, y) ≡ PP(x, y) ∧ ∃φ(φ(x) ∧ φ(y))
example: A volume of water has redundand parts other volumes of water. All this volumes have holistic parts some water molecules.
EMMO 70fe84ff 99b6 4206 a9fc 9a8931836d84: RP(x, y) ≡ PP(x, y) ∧ ∃φ(φ(x) ∧ φ(y))
EMMO 967080e5 2f42 4eb2 a3a9 c58143e835f9: The superproperty of the all object property relations between a whole and its mereological parts of the same type.
EMMO c7b62dd7 063a 4c2a 8504 42f7264ba83f: A part is always distinct xor redundant.

hasProperPart
type: ObjectProperty
type: AsymmetricProperty
type: IrreflexiveProperty
comment: The proper part relation has the following pair-covering sub-relations: - hasMembers xor hasPiece - hasPortionPart xor hasGatheredPart . hasItemPart xor hasScatteredPart
comment: The relation between an entity and one of its parts, when both entities are distinct.
EMMO 967080e5 2f42 4eb2 a3a9 c58143e835f9: The relation between an entity and one of its parts, when both entities are distinct.
EMMO c7b62dd7 063a 4c2a 8504 42f7264ba83f: The proper part relation has the following pair-covering sub-relations: - hasMembers xor hasPiece - hasPortionPart xor hasGatheredPart . hasItemPart xor hasScatteredPart

isRedundantPartOf
type: ObjectProperty

hasSign
type: ObjectProperty

hasChemicalSymbol
type: ObjectProperty
comment: The chemical symbol of an atomic element.
EMMO 967080e5 2f42 4eb2 a3a9 c58143e835f9: The chemical symbol of an atomic element.

semiotical
type: ObjectProperty
comment: The generic EMMO semiotical relation.
EMMO 967080e5 2f42 4eb2 a3a9 c58143e835f9: The generic EMMO semiotical relation.

EMMORelation
type: ObjectProperty
sub property of: topObjectProperty
comment: The superclass for all relations used by the EMMO.
EMMO 967080e5 2f42 4eb2 a3a9 c58143e835f9: The superclass for all relations used by the EMMO.

hasDirectPart
type: ObjectProperty
comment: Direct parthood is the non transitive version of parthood enabling the establishment of hierarchy of granularities, starting with an entity and providing several granularity levels of parthood.
comment: The non-transitive version of proper parthood property.
alternative label: hasImmediatePart
EMMO 31252f35 c767 4b97 a877 1235076c3e13: Direct parthood is the non transitive version of parthood enabling the establishment of hierarchy of granularities, starting with an entity and providing several granularity levels of parthood.
EMMO 967080e5 2f42 4eb2 a3a9 c58143e835f9: The non-transitive version of proper parthood property.

isDirectPartOf
type: ObjectProperty

hasSpatialTile
type: ObjectProperty
type: AsymmetricProperty
type: IrreflexiveProperty
comment: A relation between the whole and one of its tiles, where the tile is only spatially connected with the other tiles forming the tessellation.
alternative label: hasSpatialDirectPart
EMMO 967080e5 2f42 4eb2 a3a9 c58143e835f9: A relation between the whole and one of its tiles, where the tile is only spatially connected with the other tiles forming the tessellation.

indirectlyCausedBy
type: ObjectProperty
type: IrreflexiveProperty
alternative label: hasIndirectCause

indirectlyCauses
type: ObjectProperty
type: IrreflexiveProperty
comment: A causal relation between the effected and the causing entities with intermediaries.
comment: An indirect cause is a relation between two entities that is mediated by a intermediate entity. In other words, there are no quantum parts of the causing entity that are direct cause of quantum parts of the caused entity.
alternative label: influences
alternative label: isIndirectCauseOf
EMMO 31252f35 c767 4b97 a877 1235076c3e13: An indirect cause is a relation between two entities that is mediated by a intermediate entity. In other words, there are no quantum parts of the causing entity that are direct cause of quantum parts of the caused entity.
EMMO 967080e5 2f42 4eb2 a3a9 c58143e835f9: A causal relation between the effected and the causing entities with intermediaries.

isInterpretedBy
type: ObjectProperty
comment: A relation connecting a sign to the interpreter in a semiotic process.
EMMO 967080e5 2f42 4eb2 a3a9 c58143e835f9: A relation connecting a sign to the interpreter in a semiotic process.

hasSingleMember
type: ObjectProperty
type: AsymmetricProperty
comment: The relation between a collection and one of its item members.
alternative label: hasMember
EMMO 967080e5 2f42 4eb2 a3a9 c58143e835f9: The relation between a collection and one of its item members.

hasMember
type: ObjectProperty
comment: A maximal part is a proper part that is not connected with the rest of the whole.
comment: A proper part which is not connected with the rest of the whole.
comment: The relation between individuals representing a collection and one or more of its members.
alternative label: hasMaximalPart
EMMO 70fe84ff 99b6 4206 a9fc 9a8931836d84: A proper part which is not connected with the rest of the whole.
EMMO 967080e5 2f42 4eb2 a3a9 c58143e835f9: The relation between individuals representing a collection and one or more of its members.
EMMO c7b62dd7 063a 4c2a 8504 42f7264ba83f: A maximal part is a proper part that is not connected with the rest of the whole.

hasMultipleMembers
type: ObjectProperty
comment: A sub collection relation where the proper part is fully encompasses some of the members of the collection.
EMMO 967080e5 2f42 4eb2 a3a9 c58143e835f9: A sub collection relation where the proper part is fully encompasses some of the members of the collection.

hasConvention
type: ObjectProperty
comment: A semiotic relation that connects a declared semiotic object to a conventional sign in a declaration process.
EMMO 967080e5 2f42 4eb2 a3a9 c58143e835f9: A semiotic relation that connects a declared semiotic object to a conventional sign in a declaration process.

isRepresentedBy
type: ObjectProperty
comment: A relation that connects the semiotic object to the sign in a semiotic process.
EMMO 967080e5 2f42 4eb2 a3a9 c58143e835f9: A relation that connects the semiotic object to the sign in a semiotic process.

notOverlaps
type: ObjectProperty
type: SymmetricProperty
type: IrreflexiveProperty
comment: The relation between individuals representing non-overlapping entities (i.e. that have no parts in common).
comment: Dxy ≡ ¬Oxy.
alternative label: disjointWith
EMMO 70fe84ff 99b6 4206 a9fc 9a8931836d84: Dxy ≡ ¬Oxy.
EMMO 967080e5 2f42 4eb2 a3a9 c58143e835f9: The relation between individuals representing non-overlapping entities (i.e. that have no parts in common).

overlaps
type: ObjectProperty
type: SymmetricProperty
comment: The relation between two individuals representing entities that share at least one of their parts.
comment: Oxy ≡ ∃z(Pzx ∧ Pzy)
EMMO 70fe84ff 99b6 4206 a9fc 9a8931836d84: Oxy ≡ ∃z(Pzx ∧ Pzy)
EMMO 967080e5 2f42 4eb2 a3a9 c58143e835f9: The relation between two individuals representing entities that share at least one of their parts.

isDescriptionFor
type: ObjectProperty
comment: A semiotic relation that connects a description to a declared semiotic objec in a declaration process.
EMMO 967080e5 2f42 4eb2 a3a9 c58143e835f9: A semiotic relation that connects a description to a declared semiotic objec in a declaration process.

isConventionFor
type: ObjectProperty

hasMeasurementUnit
type: ObjectProperty
comment: A conventional semiotic relation that relates a physical quantity to its unit.
example: Length hasUnit only LengthUnit

providesInterpretation
type: ObjectProperty
comment: A relation that connects the interpreter to the semiotic object in a semiotic process.
EMMO 967080e5 2f42 4eb2 a3a9 c58143e835f9: A relation that connects the interpreter to the semiotic object in a semiotic process.

hasSpatioTemporalTile
type: ObjectProperty
type: AsymmetricProperty
type: IrreflexiveProperty
comment: A tile that is connected with other tiles with bi-directional causal relations that fall under hasNext (or its inverse) or hasContact.
comment: This owl:ObjectProperty is, like its super property, a mere collector of direct parthoods that manifest a spatiotemporal meaningful shape.
alternative label: hasWellFormedTile
EMMO 967080e5 2f42 4eb2 a3a9 c58143e835f9: A tile that is connected with other tiles with bi-directional causal relations that fall under hasNext (or its inverse) or hasContact.
EMMO c7b62dd7 063a 4c2a 8504 42f7264ba83f: This owl:ObjectProperty is, like its super property, a mere collector of direct parthoods that manifest a spatiotemporal meaningful shape.

directlyCausedBye
type: ObjectProperty
alternative label: hasDirectCause

coexistsWith
type: ObjectProperty
type: SymmetricProperty
type: IrreflexiveProperty
comment: A relation jointly covered by Contact and InteractWith relations, which are mutually exclusive.
comment: Spatial relations between entities are represented in the EMMO as bidirectional causality, meaning that both entities are at the beginning and at the end of causal paths connecting them. This type of relation represent the coexistence of two entities in the a spatial arrangement. The symmetric characteristic of this relation implies that it is not possible to order them and is related to the arbitrary choice of reference frames. Subclasses of spatial relations may be defined as asymmetric and introduce a spatial order, for example est to west, or internal to external layer..
comment: The relation between entities that express a mutual causation.
alternative label: isSpatiallyRelatedWith
EMMO 31252f35 c767 4b97 a877 1235076c3e13: Spatial relations between entities are represented in the EMMO as bidirectional causality, meaning that both entities are at the beginning and at the end of causal paths connecting them. This type of relation represent the coexistence of two entities in the a spatial arrangement. The symmetric characteristic of this relation implies that it is not possible to order them and is related to the arbitrary choice of reference frames. Subclasses of spatial relations may be defined as asymmetric and introduce a spatial order, for example est to west, or internal to external layer..
EMMO 70fe84ff 99b6 4206 a9fc 9a8931836d84: A relation jointly covered by Contact and InteractWith relations, which are mutually exclusive.
EMMO 967080e5 2f42 4eb2 a3a9 c58143e835f9: The relation between entities that express a mutual causation.

isCauseOf
type: ObjectProperty
type: IrreflexiveProperty
comment: A relation between an entity that causally affects another.
comment: Each pair of causally connected entities is either in isDirectCauseOf or isIndirectCauseOf relation. The two are mutually exclusive.
comment: We say that an entity causes another if there is a quantum part of the first that is in causal relation with a quantum parts of the second. More formally, causality is defined as a relation between individuals x and y that holds if and only if: a) x having a part that is causing an effect on a part of y b) x and y are non-overlapping An entity cannot cause itself or a part of itself. For this reasons causality between entities excludes reflexivity and prevents them to overlap. The existence of one-directional of bi-directional causality relations between two entities is what reconstruct time-like and space-like relations, respectively.
alternative label: causes
example: John yesterday is the cause of John today, is an example of temporal-like causality. The desk supporting my laptop is a space-like causality.
EMMO 31252f35 c767 4b97 a877 1235076c3e13: We say that an entity causes another if there is a quantum part of the first that is in causal relation with a quantum parts of the second. More formally, causality is defined as a relation between individuals x and y that holds if and only if: a) x having a part that is causing an effect on a part of y b) x and y are non-overlapping An entity cannot cause itself or a part of itself. For this reasons causality between entities excludes reflexivity and prevents them to overlap. The existence of one-directional of bi-directional causality relations between two entities is what reconstruct time-like and space-like relations, respectively.
EMMO 967080e5 2f42 4eb2 a3a9 c58143e835f9: A relation between an entity that causally affects another.
EMMO c7b62dd7 063a 4c2a 8504 42f7264ba83f: Each pair of causally connected entities is either in isDirectCauseOf or isIndirectCauseOf relation. The two are mutually exclusive.
EMMO c7b62dd7 063a 4c2a 8504 42f7264ba83f: The OWL 2 DL version of the EMMO introduces this object property as primitive causal relation. It refers to the macro causality relation mC(x,y), defined in the EMMO FOL version. While the EMMO FOL introduces the quantum causality relation C(x,y) as primitive, the OWL 2 DL version of the EMMO substantially simplifies the theory, neglecting these lower level relations that are well above DL expressivity. For this reason the EMMO OWL 2 DL will only deal with macro causality relations, sacrificing the full FOL theory expressivity for the sake of simplicity.
EMMO c7b62dd7 063a 4c2a 8504 42f7264ba83f: The cause relation applies to both quantums and macro-entities (entities made of more than one quantum). It is admissible for two entities to be one the cause of the other, excepts when they are both quantums.

hasDeduced
type: ObjectProperty
comment: A semiotic relation connecting a deducing interpreter to the "deduced" semiotic object in a deduction process.
EMMO 967080e5 2f42 4eb2 a3a9 c58143e835f9: A semiotic relation connecting a deducing interpreter to the "deduced" semiotic object in a deduction process.

isDeducedBy
type: ObjectProperty

foreruns
type: ObjectProperty
type: AsymmetricProperty
type: IrreflexiveProperty
comment: A causal relation between the y effected and the x causing entities with intermediaries, where x isCauseOf y and not(y isCauseOf x).
comment: Transitivity is implemented at A-Box level with a SWRL rule.
alternative label: hasSuccessor
alternative label: isAntecedentOf
alternative label: predecessorOf
example: My life between 18-24 years has successor my life between 32-40 years, since there is an intermediary (i.e. my life between 25-32 years).
EMMO 967080e5 2f42 4eb2 a3a9 c58143e835f9: A causal relation between the y effected and the x causing entities with intermediaries, where x isCauseOf y and not(y isCauseOf x).
EMMO c7b62dd7 063a 4c2a 8504 42f7264ba83f: Transitivity is implemented at A-Box level with a SWRL rule.

hasReferent
type: ObjectProperty

hasDatum
type: ObjectProperty
comment: Relates a dataset to its datum.
EMMO 967080e5 2f42 4eb2 a3a9 c58143e835f9: Relates a dataset to its datum.

hasPortionPart
type: ObjectProperty
type: AsymmetricProperty
comment: A part of an item is always non-maximal, meaning that is causally connected with the rest.
comment: A proper part relation with domain restricted to items.
EMMO 70fe84ff 99b6 4206 a9fc 9a8931836d84: A proper part relation with domain restricted to items.
EMMO c7b62dd7 063a 4c2a 8504 42f7264ba83f: A part of an item is always non-maximal, meaning that is causally connected with the rest.

hasConventionalProperty
type: ObjectProperty
comment: Assigns a quantity to an object by convention.
comment: An object can be represented by a quantity for the fact that it has been recognized to belong to a specific class. The quantity is selected without an observation aimed to measure its actual value, but by convention.
example: An Hydrogen atom has the quantity atomic number Z = 1 as its conventional property.
EMMO 967080e5 2f42 4eb2 a3a9 c58143e835f9: Assigns a quantity to an object by convention.

hasObjectiveProperty
type: ObjectProperty
comment: Relates an object to a quantity describing a quantifiable property of the object obtained via a well-defined procedure.

partakesIn
type: ObjectProperty

properOverlaps
type: ObjectProperty
type: SymmetricProperty
type: IrreflexiveProperty
comment: The relation between two entities that overlaps and neither of both is part of the other.
EMMO 967080e5 2f42 4eb2 a3a9 c58143e835f9: The relation between two entities that overlaps and neither of both is part of the other.

causal
type: ObjectProperty
comment: Causality in the EMMO is intended as physical causation and not counter-factual. Meaning that causality is an expression of actual physical interactions, and not of a counterfactual depence such as “I didn't water the flowers, hence, I'm the cause of their death”.
comment: Causality is the fundamental concept describing how entities affect each other, and conceptually precedes time and space relations. In the EMMO causality is the foundation for space and time relations. Embracing a strong reductionistic view, causality originates at quantum entities level, meaning that causal relations between macroscopic entities is simply the sum of quantum level causality relations.
comment: The superclass of all causal EMMO relations.
EMMO 31252f35 c767 4b97 a877 1235076c3e13: Causality is the fundamental concept describing how entities affect each other, and conceptually precedes time and space relations. In the EMMO causality is the foundation for space and time relations. Embracing a strong reductionistic view, causality originates at quantum entities level, meaning that causal relations between macroscopic entities is simply the sum of quantum level causality relations.
EMMO 967080e5 2f42 4eb2 a3a9 c58143e835f9: The superclass of all causal EMMO relations.
EMMO c7b62dd7 063a 4c2a 8504 42f7264ba83f: Causality in the EMMO is intended as physical causation and not counter-factual. Meaning that causality is an expression of actual physical interactions, and not of a counterfactual depence such as “I didn't water the flowers, hence, I'm the cause of their death”.
EMMO c7b62dd7 063a 4c2a 8504 42f7264ba83f: Each pair of entities is either in isCauseOf or isNotCauseOf relation. The two are mutually exclusive.

isInterpretantFor
type: ObjectProperty

semioticOvercrossedBy
type: ObjectProperty

successorOf
type: ObjectProperty
type: AsymmetricProperty
type: IrreflexiveProperty
alternative label: isAncestorOf

hasIcon
type: ObjectProperty
comment: A semiotic relation that connects a recognised semiotic object to an icon in a cognition process.
EMMO 967080e5 2f42 4eb2 a3a9 c58143e835f9: A semiotic relation that connects a recognised semiotic object to an icon in a cognition process.

isIconFor
type: ObjectProperty

hasInterpretant
type: ObjectProperty
comment: A relation that connects a semiotic object to the interpretant in a semiotic process.
EMMO 967080e5 2f42 4eb2 a3a9 c58143e835f9: A relation that connects a semiotic object to the interpretant in a semiotic process.

disappearsInto
type: ObjectProperty
comment: The relation between a process P that proper overlaps an object O, where the non overlapping part of P is cause of O.
EMMO 967080e5 2f42 4eb2 a3a9 c58143e835f9: The relation between a process P that proper overlaps an object O, where the non overlapping part of P is cause of O.

affects
type: ObjectProperty
comment: The relation between a process P that proper overlaps an object O.
EMMO 967080e5 2f42 4eb2 a3a9 c58143e835f9: The relation between a process P that proper overlaps an object O.

hasModelledProperty
type: ObjectProperty
comment: Assigns a quantity to an object via a well-defined modelling procedure.
EMMO 967080e5 2f42 4eb2 a3a9 c58143e835f9: Assigns a quantity to an object via a well-defined modelling procedure.

hasTile
type: ObjectProperty
type: AsymmetricProperty
type: IrreflexiveProperty
comment: The relation grouping all direct parthood relations used in the reductionistic perspective.
comment: This relation is not antitransitive, to enable partitioning of a causal structure with more than one tiling scheme (e.g. time and space partitioning).
comment: Tiling parthood enables the establishment of hierarchy of granularities, starting with an entity and providing several tessellation levels according to specific criteria. The criteria are implemented in specialised versions of the tiling parthood relation (e.g., metrological direct part, XML format direct part). The tiles and the tessellated entity (tessellation) are causally self connected (i.e., items), coherently with the concept behind the definition of the reductionistic perspective. The tiles of specific granularity level provide a covering for the whole and are mutually non-overlapping, as the label "tile" suggests.
alternative label: hasDirectPart
EMMO 31252f35 c767 4b97 a877 1235076c3e13: Tiling parthood enables the establishment of hierarchy of granularities, starting with an entity and providing several tessellation levels according to specific criteria. The criteria are implemented in specialised versions of the tiling parthood relation (e.g., metrological direct part, XML format direct part). The tiles and the tessellated entity (tessellation) are causally self connected (i.e., items), coherently with the concept behind the definition of the reductionistic perspective. The tiles of specific granularity level provide a covering for the whole and are mutually non-overlapping, as the label "tile" suggests.
EMMO 967080e5 2f42 4eb2 a3a9 c58143e835f9: The relation grouping all direct parthood relations used in the reductionistic perspective.
EMMO c7b62dd7 063a 4c2a 8504 42f7264ba83f: This relation is not antitransitive, to enable partitioning of a causal structure with more than one tiling scheme (e.g. time and space partitioning).
EMMO c7b62dd7 063a 4c2a 8504 42f7264ba83f: This relation is a simple collector of all relations inverse functional direct parthoods that can be defined in specialised theories using reductionism.

hasPart
type: ObjectProperty
comment: All other mereology relations can be defined in FOL using hasPart as primitive.
comment: The primitive relation that express the concept of an entity being part of another one.
EMMO 967080e5 2f42 4eb2 a3a9 c58143e835f9: The primitive relation that express the concept of an entity being part of another one.
EMMO c7b62dd7 063a 4c2a 8504 42f7264ba83f: All other mereology relations can be defined in FOL using hasPart as primitive.

standsFor
type: ObjectProperty

isRemovedFrom
type: ObjectProperty
comment: The relation between an object O1 and a object O2 that proper overlap, where the non overapping part of O2 is caused by O1.
EMMO 967080e5 2f42 4eb2 a3a9 c58143e835f9: The relation between an object O1 and a object O2 that proper overlap, where the non overapping part of O2 is caused by O1.

isPartOf
type: ObjectProperty
comment: Reflexivity: Pxx Transitivity: (Pxy ∧ Pyz) → Pxz Antisymmetry: (Pxy ∧ Pyx) → x=y.
comment: The inverse relation of hasPart.
EMMO 70fe84ff 99b6 4206 a9fc 9a8931836d84: Reflexivity: Pxx Transitivity: (Pxy ∧ Pyz) → Pxz Antisymmetry: (Pxy ∧ Pyx) → x=y.
EMMO 967080e5 2f42 4eb2 a3a9 c58143e835f9: The inverse relation of hasPart.

isProcessedTo
type: ObjectProperty

contributesTo
type: ObjectProperty
comment: The relation between a process P1 that proper overlaps a process P2.
EMMO 967080e5 2f42 4eb2 a3a9 c58143e835f9: The relation between a process P1 that proper overlaps a process P2.

isProperPartOf
type: ObjectProperty
type: AsymmetricProperty
type: IrreflexiveProperty
comment: PP(x, y) ≡ P(x, y) ∧ ¬x=y
comment: The inverse relation for hasProperPart.
EMMO 70fe84ff 99b6 4206 a9fc 9a8931836d84: PP(x, y) ≡ P(x, y) ∧ ¬x=y
EMMO 967080e5 2f42 4eb2 a3a9 c58143e835f9: The inverse relation for hasProperPart.

hasMetricPrefix
type: ObjectProperty
comment: Relates a prefixed unit to its metric prefix part.

hasMetrologicalReference
type: ObjectProperty
type: InverseFunctionalProperty
type: AsymmetricProperty
type: IrreflexiveProperty
comment: Relates a quantity to its metrological reference through a semiotic process.
version info: In EMMO version 1.0.0-rc3, physical quantities used the hasMetrologicalReference object property to relate them to their units via physical dimensionality. This was simplified in 1.0.0-alpha3 in order to make reasoning faster. The restriction (e.g. for the physical quantity Length) Length hasMetrologicalReference only (hasPhysicsDimension only LengthDimension) was in 1.0.0-alpha3 changed to Length hasPhysicsDimension some LengthDimension Likewise were the universal restrictions on the corresponding unit changed to excistential. E.g. Metre hasPhysicsDimension only LengthDimension was changed to Metre hasPhysicsDimension some LengthDimension The label of this class was also changed from PhysicsDimension to PhysicalDimension.

hasIterativeTask
type: ObjectProperty

hasTask
type: ObjectProperty
comment: The holistic relation connecting a workflow with one of its tasks.
EMMO 31252f35 c767 4b97 a877 1235076c3e13: The holistic relation connecting a workflow with one of its tasks.

hasSpatialPart
type: ObjectProperty
comment: A proper part of a whole, whose parts always cover the full temporal extension of the whole within a spatial interval.
comment: In EMMO FOL this is a defined property. In OWL temporal relations are primitive.
EMMO 967080e5 2f42 4eb2 a3a9 c58143e835f9: A proper part of a whole, whose parts always cover the full temporal extension of the whole within a spatial interval.
EMMO c7b62dd7 063a 4c2a 8504 42f7264ba83f: In EMMO FOL this is a defined property. In OWL temporal relations are primitive.
EMMO c7b62dd7 063a 4c2a 8504 42f7264ba83f: The part is connected with the rest item or members with hasContact relations only (no hasNext).

hasOutput
type: ObjectProperty
comment: The outcome of a process.
EMMO 967080e5 2f42 4eb2 a3a9 c58143e835f9: The outcome of a process.

hasUnitNonPrefixPart
type: ObjectProperty
comment: Relates a prefixed unit to its non-prefixed part.
example: For example the unit CentiNewtonMetre has prefix "Centi" and non-prefix part "NewtonMetre".
EMMO 967080e5 2f42 4eb2 a3a9 c58143e835f9: Relates a prefixed unit to its non-prefixed part.

isDeclarerFor
type: ObjectProperty

interprets
type: ObjectProperty

hasDeclarer
type: ObjectProperty
comment: A semiotic relation connecting a conventional sign to the interpreter (declarer) in a declaration process.
EMMO 967080e5 2f42 4eb2 a3a9 c58143e835f9: A semiotic relation connecting a conventional sign to the interpreter (declarer) in a declaration process.

hasStatus
type: ObjectProperty

hasTemporalPart
type: ObjectProperty
comment: A relation that identify a proper item part of the whole, whose parts always cover the full spatial extension of the whole within a time interval.
comment: A temporal part of an item cannot both cause and be caused by any other proper part of the item. A temporal part is not constraint to be causally self-connected, i.e. it can be either an item or a collection. We therefore introduce two subproperties in order to distinguish between both cases.
EMMO 967080e5 2f42 4eb2 a3a9 c58143e835f9: A relation that identify a proper item part of the whole, whose parts always cover the full spatial extension of the whole within a time interval.
EMMO c7b62dd7 063a 4c2a 8504 42f7264ba83f: A temporal part of an item cannot both cause and be caused by any other proper part of the item. A temporal part is not constraint to be causally self-connected, i.e. it can be either an item or a collection. We therefore introduce two subproperties in order to distinguish between both cases.
EMMO c7b62dd7 063a 4c2a 8504 42f7264ba83f: In EMMO FOL this is a defined property. In OWL temporal relations are primitive.

isOvercrossedBy
type: ObjectProperty
type: IrreflexiveProperty
comment: The inverse relation for overcrosses.
EMMO 967080e5 2f42 4eb2 a3a9 c58143e835f9: The inverse relation for overcrosses.

hasDescription
type: ObjectProperty
comment: A semiotic relation that connects a declared semiotic object to a description in a declaration process.
EMMO 967080e5 2f42 4eb2 a3a9 c58143e835f9: A semiotic relation that connects a declared semiotic object to a description in a declaration process.

hasQualifiedRole
type: ObjectProperty
alternative label: hasQualifiedPart

hasDistinctPart
type: ObjectProperty
comment: A part is always distinct xor redundant.
comment: The superproperty of all object property relations between an entity and one of its proper parts that belongs to different taxonomical branch.
comment: DP(x, y) ≡ PP(x, y) ∧ ∃φ[φ(x) ↔ ¬φ(y)]
example: A molecule is a distinct part of a fluid.
EMMO 70fe84ff 99b6 4206 a9fc 9a8931836d84: DP(x, y) ≡ PP(x, y) ∧ ∃φ[φ(x) ↔ ¬φ(y)]
EMMO 967080e5 2f42 4eb2 a3a9 c58143e835f9: The superproperty of all object property relations between an entity and one of its proper parts that belongs to different taxonomical branch.
EMMO c7b62dd7 063a 4c2a 8504 42f7264ba83f: A part is always distinct xor redundant.

hasComponent
type: ObjectProperty

hasConstituent
type: ObjectProperty
comment: The relation between an object and one of its holistic part that contributes to the object under some spatial-based criteria.
EMMO 967080e5 2f42 4eb2 a3a9 c58143e835f9: The relation between an object and one of its holistic part that contributes to the object under some spatial-based criteria.

hasAgent
type: ObjectProperty
comment: The relation within a process and an agengt participant.
EMMO 967080e5 2f42 4eb2 a3a9 c58143e835f9: The relation within a process and an agengt participant.

hasRole
type: ObjectProperty
comment: The relation between the whole and a proper part of the whole that scale down to the point which it lose the characteristics of the whole and become something else.
alternative label: hasHolisticPart
example: An holistic part of water fluid is a water molecule.
EMMO 967080e5 2f42 4eb2 a3a9 c58143e835f9: The relation between the whole and a proper part of the whole that scale down to the point which it lose the characteristics of the whole and become something else.

hasParticipant
type: ObjectProperty
comment: Participation is a parthood relation: you must be part of the process to contribute to it. A participant whose 4D extension is totally contained within the process. Participation is not under direct parthood since a process is not strictly related to reductionism, but it's a way to categorise temporal regions by the interpreters.
comment: The relation between a process and an object participating to it, i.e. that is relevant to the process itself.
EMMO 967080e5 2f42 4eb2 a3a9 c58143e835f9: The relation between a process and an object participating to it, i.e. that is relevant to the process itself.

hasNonTemporalPart
type: ObjectProperty
comment: The part is connected with the rest item or members with a combination of hasNext (or its inverse) or hasContact relations.
EMMO 967080e5 2f42 4eb2 a3a9 c58143e835f9: The part is connected with the rest item or members with a combination of hasNext (or its inverse) or hasContact relations.

hasJunctionTile
type: ObjectProperty
type: AsymmetricProperty
type: IrreflexiveProperty
comment: A relation between the whole and one of its tiles, where the tile is both spatially and temporally connected with the other tiles forming the tessellation.
EMMO 967080e5 2f42 4eb2 a3a9 c58143e835f9: A relation between the whole and one of its tiles, where the tile is both spatially and temporally connected with the other tiles forming the tessellation.

emergesFrom
type: ObjectProperty
comment: The relation between a process P that proper overlaps an object O , where the non overapping part of P is caused by O.
EMMO 967080e5 2f42 4eb2 a3a9 c58143e835f9: The relation between a process P that proper overlaps an object O , where the non overapping part of P is caused by O.

isInternalRepresentationBy
type: ObjectProperty

hasInternalRepresentation
type: ObjectProperty
comment: The relation between the interpreter and the interpretant, being its internal representation.
EMMO 967080e5 2f42 4eb2 a3a9 c58143e835f9: The relation between the interpreter and the interpretant, being its internal representation.

hasReferencePart
type: ObjectProperty
comment: Relates a quantity to its reference unit through spatial direct parthood.
EMMO 967080e5 2f42 4eb2 a3a9 c58143e835f9: Relates a quantity to its reference unit through spatial direct parthood.

hasBeginTile
type: ObjectProperty
type: AsymmetricProperty
type: IrreflexiveProperty
comment: The relation between the whole and a temporal tile that has only outgoing temporal connections.
alternative label: hasTemporalFirst
EMMO 967080e5 2f42 4eb2 a3a9 c58143e835f9: The relation between the whole and a temporal tile that has only outgoing temporal connections.

hasTemporalTile
type: ObjectProperty
type: AsymmetricProperty
type: IrreflexiveProperty
comment: A relation that establishes for the whole a univocal tessellation in temporal parts forming the tessellation.
alternative label: hasTemporalDirectPart
EMMO 967080e5 2f42 4eb2 a3a9 c58143e835f9: A relation that establishes for the whole a univocal tessellation in temporal parts forming the tessellation.

hasBeginTask
type: ObjectProperty
comment: The relation identifying the tasks of a workflow that are not causally temporally dependent by other parts of the workflow.
EMMO 967080e5 2f42 4eb2 a3a9 c58143e835f9: The relation identifying the tasks of a workflow that are not causally temporally dependent by other parts of the workflow.

hasTaskTile
type: ObjectProperty

hasProperty
type: ObjectProperty
comment: A semiotic relation that connects a semiotic object to a property in a declaration process.
EMMO 967080e5 2f42 4eb2 a3a9 c58143e835f9: A semiotic relation that connects a semiotic object to a property in a declaration process.

participatesTo
type: ObjectProperty
comment: The relation between a process P and an object O that partially overlaps and the intersection between P and O is a participant of P.
EMMO 967080e5 2f42 4eb2 a3a9 c58143e835f9: The relation between a process P and an object O that partially overlaps and the intersection between P and O is a participant of P.

isAddedTo
type: ObjectProperty
comment: The relation between an object O1 and a object O2 that proper overlap, and the overlapping part of O1 is: a) next of the non overlapping part and b) a constituent of O2.
EMMO 967080e5 2f42 4eb2 a3a9 c58143e835f9: The relation between an object O1 and a object O2 that proper overlap, and the overlapping part of O1 is: a) next of the non overlapping part and b) a constituent of O2.

semioticOvercrosses
type: ObjectProperty
comment: The superproperties for overcrossing relations between semiotic entities.
EMMO 967080e5 2f42 4eb2 a3a9 c58143e835f9: The superproperties for overcrossing relations between semiotic entities.

hasManufacturedOutput
type: ObjectProperty

hasProductOutput
type: ObjectProperty

hasVariable
type: ObjectProperty

hasPiece
type: ObjectProperty
comment: A non-maximal part is a proper part that is connected with the rest of the whole.
comment: The relation between two individuals representing an entity and a non-maximal proper part, meaning the the latter is connected with the rest of the whole.
alternative label: hasNotMaximalPart
EMMO 967080e5 2f42 4eb2 a3a9 c58143e835f9: The relation between two individuals representing an entity and a non-maximal proper part, meaning the the latter is connected with the rest of the whole.
EMMO c7b62dd7 063a 4c2a 8504 42f7264ba83f: A non-maximal part is a proper part that is connected with the rest of the whole.

isSignificationFor
type: ObjectProperty

hasEndTile
type: ObjectProperty
type: AsymmetricProperty
type: IrreflexiveProperty
comment: The relation between the whole and a temporal tile that has only ingoing temporal connections.
alternative label: hasTemporalLast
EMMO 967080e5 2f42 4eb2 a3a9 c58143e835f9: The relation between the whole and a temporal tile that has only ingoing temporal connections.

mereological
type: ObjectProperty
comment: The EMMO adheres to Atomistic General Extensional Mereology (AGEM).
comment: The superclass of all mereological EMMO relations.
EMMO 967080e5 2f42 4eb2 a3a9 c58143e835f9: The superclass of all mereological EMMO relations.
EMMO c7b62dd7 063a 4c2a 8504 42f7264ba83f: The EMMO adheres to Atomistic General Extensional Mereology (AGEM).

isReferentFor
type: ObjectProperty

hasInput
type: ObjectProperty
comment: The input of a process.
EMMO 967080e5 2f42 4eb2 a3a9 c58143e835f9: The input of a process.

hasNumericalPart
type: ObjectProperty
type: InverseFunctionalProperty
type: AsymmetricProperty
type: IrreflexiveProperty
comment: Relates a quantity to its numerical value through spatial direct parthood.

hasBehaviour
type: ObjectProperty

hasMetrologicalUncertainty
type: ObjectProperty
comment: Assigns a quantifiable uncertainty to an objective property through a well-defined procecure.
comment: Since measurement uncertainty is a subclass of objective property, this relation can also describe the uncertainty of an measurement uncertainty.
EMMO 967080e5 2f42 4eb2 a3a9 c58143e835f9: Assigns a quantifiable uncertainty to an objective property through a well-defined procecure.
EMMO c7b62dd7 063a 4c2a 8504 42f7264ba83f: Since measurement uncertainty is a subclass of objective property, this relation can also describe the uncertainty of an measurement uncertainty.

isObjectInputOf
type: ObjectProperty
comment: The relation between an object O that proper overlaps a process P, where the non overapping part of P is caused by O.
EMMO 967080e5 2f42 4eb2 a3a9 c58143e835f9: The relation between an object O that proper overlaps a process P, where the non overapping part of P is caused by O.

isInputOf
type: ObjectProperty
comment: The relation between an entity X that proper overlaps a process P, where the non overapping part of P is caused by X.
EMMO 967080e5 2f42 4eb2 a3a9 c58143e835f9: The relation between an entity X that proper overlaps a process P, where the non overapping part of P is caused by X.

hasEndTask
type: ObjectProperty
comment: The relation identifying the tasks of a workflow that are not a temporal cause of other parts of the workflow.
EMMO 967080e5 2f42 4eb2 a3a9 c58143e835f9: The relation identifying the tasks of a workflow that are not a temporal cause of other parts of the workflow.

hasInterpreter
type: ObjectProperty

alongsideWith
type: ObjectProperty
type: SymmetricProperty
type: IrreflexiveProperty
comment: The relation between two causally reachable entities through a path of contacts relations (i.e. representing physical interactions).
alternative label: coexistsWith
alternative label: concurrentWith
alternative label: interactsWith
example: I'm interacting with another tennis player through a ball. Or, two people in a webconference are interacting using a mediator which is the network signal.
EMMO 967080e5 2f42 4eb2 a3a9 c58143e835f9: The relation between two causally reachable entities through a path of contacts relations (i.e. representing physical interactions).

hasCogniser
type: ObjectProperty
comment: A semiotic relation connecting an icon to a interpreter (cogniser) in a cognition process.
EMMO 967080e5 2f42 4eb2 a3a9 c58143e835f9: A semiotic relation connecting an icon to a interpreter (cogniser) in a cognition process.

isCogniserFor
type: ObjectProperty

isFragmentOf
type: ObjectProperty

isPieceOf
type: ObjectProperty

hasQuantity
type: ObjectProperty
comment: Relates the result of a semiotic process to ont of its optained quantities.
EMMO 967080e5 2f42 4eb2 a3a9 c58143e835f9: Relates the result of a semiotic process to ont of its optained quantities.

isReferredBy
type: ObjectProperty

hasServiceOutput
type: ObjectProperty

isNotCauseOf
type: ObjectProperty
comment: x isNotCauseOf y iff not(x isCauseOf y)
EMMO 70fe84ff 99b6 4206 a9fc 9a8931836d84: x isNotCauseOf y iff not(x isCauseOf y)

isNotCausedBy
type: ObjectProperty

isSignFor
type: ObjectProperty

overcrosses
type: ObjectProperty
type: IrreflexiveProperty
comment: The relation between an entity that overlaps another without being its part.
comment: OX(x, y) ≡ O(x, y) ∧ ¬P(x,y)
EMMO 70fe84ff 99b6 4206 a9fc 9a8931836d84: OX(x, y) ≡ O(x, y) ∧ ¬P(x,y)
EMMO 967080e5 2f42 4eb2 a3a9 c58143e835f9: The relation between an entity that overlaps another without being its part.

isPortionPartOf
type: ObjectProperty

hasDeducer
type: ObjectProperty
comment: A semiotic relation connecting an index sign to the interpreter (deducer) in a deduction process.
EMMO 967080e5 2f42 4eb2 a3a9 c58143e835f9: A semiotic relation connecting an index sign to the interpreter (deducer) in a deduction process.

isDeducerFor
type: ObjectProperty

hasPortion
type: ObjectProperty
comment: The relation between a object whole and its spatial part of the same type.
example: A volume of 1 cc of milk within a 1 litre can be considered still milk as a whole. If you scale down to a cluster of molecules, than the milk cannot be considered a fluid no more (and then no more a milk).
EMMO 967080e5 2f42 4eb2 a3a9 c58143e835f9: The relation between a object whole and its spatial part of the same type.

hasResourceIdentifier
type: ObjectProperty
comment: Relates a resource to its identifier.
EMMO 967080e5 2f42 4eb2 a3a9 c58143e835f9: Relates a resource to its identifier.

isSignifiedBy
type: ObjectProperty

hasCharacteriser
type: ObjectProperty

hasCharacterised
type: ObjectProperty

hasDeclared
type: ObjectProperty
comment: A semiotic relation connecting a declaring interpreter to the "declared" semiotic object in a declaration process.
EMMO 967080e5 2f42 4eb2 a3a9 c58143e835f9: A semiotic relation connecting a declaring interpreter to the "declared" semiotic object in a declaration process.

hasJunctionPart
type: ObjectProperty
comment: The part is connected with the rest item or members with both hasNext (or its inverse) and hasContact relations.
alternative label: hasSpatioTemporalPart
EMMO 967080e5 2f42 4eb2 a3a9 c58143e835f9: The part is connected with the rest item or members with both hasNext (or its inverse) and hasContact relations.

isInterpretationAccordingTo
type: ObjectProperty

isDeclaredBy
type: ObjectProperty

isMemberOf
type: ObjectProperty

isPropertyFor
type: ObjectProperty

isProcessInputOf
type: ObjectProperty
comment: The relation between a process P1 that proper overlaps a process P2, where the non overlapping part of P1 is causing P2.
EMMO 967080e5 2f42 4eb2 a3a9 c58143e835f9: The relation between a process P1 that proper overlaps a process P2, where the non overlapping part of P1 is causing P2.

hasStage
type: ObjectProperty

IsIndexFor
type: ObjectProperty

hasIndex
type: ObjectProperty
comment: A semiotic relation that connects a deduced semiotic object to an index in a deduction process.
EMMO 967080e5 2f42 4eb2 a3a9 c58143e835f9: A semiotic relation that connects a deduced semiotic object to an index in a deduction process.

hasInterval
type: ObjectProperty
comment: The relation between a process whole and a temporal part of the same type.
EMMO 967080e5 2f42 4eb2 a3a9 c58143e835f9: The relation between a process whole and a temporal part of the same type.

hasFragment
type: ObjectProperty
comment: The relation between two individuals representing a collection and a non-maximal proper part, meaning the the latter is connected with the rest of the whole.
EMMO 967080e5 2f42 4eb2 a3a9 c58143e835f9: The relation between two individuals representing a collection and a non-maximal proper part, meaning the the latter is connected with the rest of the whole.

refersTo
type: ObjectProperty

hasConstitutiveProcess
type: ObjectProperty

hasSubProcess
type: ObjectProperty
comment: The relation between a process and one of its process parts.
EMMO 967080e5 2f42 4eb2 a3a9 c58143e835f9: The relation between a process and one of its process parts.

hasCognised
type: ObjectProperty
comment: A semiotic relation connecting a recogniting interpreter to the "cognised" semiotic object in a cognition process.
EMMO 967080e5 2f42 4eb2 a3a9 c58143e835f9: A semiotic relation connecting a recogniting interpreter to the "cognised" semiotic object in a cognition process.

isCognisedBy
type: ObjectProperty

isOutputOf
type: ObjectProperty

isInterpreterFor
type: ObjectProperty

hasSerialTask
type: ObjectProperty

isDistinctPartOf
type: ObjectProperty

isObjectOutputOf
type: ObjectProperty

equalsTo
type: ObjectProperty
type: SymmetricProperty
comment: Equality is here defined following a mereological approach.
comment: The relation between two individuals representing the same entity.
EMMO 967080e5 2f42 4eb2 a3a9 c58143e835f9: The relation between two individuals representing the same entity.
EMMO c7b62dd7 063a 4c2a 8504 42f7264ba83f: Equality is here defined following a mereological approach.

isProcessOutputOf
type: ObjectProperty
comment: The relation between a process P1 that proper overlaps a process P2, where the non overlapping part of P1 is caused by P2.
EMMO 967080e5 2f42 4eb2 a3a9 c58143e835f9: The relation between a process P1 that proper overlaps a process P2, where the non overlapping part of P1 is caused by P2.

hasModel
type: ObjectProperty

hasSubObject
type: ObjectProperty

hasMeasuredProperty
type: ObjectProperty
comment: Assigns a quantity to an object via a well-defined measurement procedure.
EMMO 967080e5 2f42 4eb2 a3a9 c58143e835f9: Assigns a quantity to an object via a well-defined measurement procedure.

hasSIConversionOffset
type: DatatypeProperty
range: double
comment: Conversion formula: nonsi_coherent_unit = si_coherent_unit * multiplier + offset
comment: Number to add to a SI coherent unit when converting to a given non-SI coherent unit.
EMMO 967080e5 2f42 4eb2 a3a9 c58143e835f9: Number to add to a SI coherent unit when converting to a given non-SI coherent unit.
EMMO c7b62dd7 063a 4c2a 8504 42f7264ba83f: Conversion formula: nonsi_coherent_unit = si_coherent_unit * multiplier + offset

hasDataValue
type: DatatypeProperty
sub property of: topDataProperty
comment: The owl:dataProperty that provides a serialisation of an EMMO data entity.
comment: This is the superproperty of all data properties used to serialise a fundamental data type in the EMMO Data perspective. An entity can have only one data value expressing its serialisation (e.g. a Real entity cannot have two different real values).
EMMO 967080e5 2f42 4eb2 a3a9 c58143e835f9: The owl:dataProperty that provides a serialisation of an EMMO data entity.
EMMO c7b62dd7 063a 4c2a 8504 42f7264ba83f: This is the superproperty of all data properties used to serialise a fundamental data type in the EMMO Data perspective. An entity can have only one data value expressing its serialisation (e.g. a Real entity cannot have two different real values).

hasSIConversionMultiplier
type: DatatypeProperty
range: double
comment: Conversion formula: nonsi_coherent_unit = si_coherent_unit * multiplier + offset
comment: Number to multiply a SI coherent unit with when converting to a given non-SI coherent unit.
EMMO 967080e5 2f42 4eb2 a3a9 c58143e835f9: Number to multiply a SI coherent unit with when converting to a given non-SI coherent unit.
EMMO c7b62dd7 063a 4c2a 8504 42f7264ba83f: Conversion formula: nonsi_coherent_unit = si_coherent_unit * multiplier + offset

hasPrefixMultiplier
type: DatatypeProperty
range: double
comment: Relates a SI prefixed unit to the multiplication factor corresponding to the prefix.
EMMO 967080e5 2f42 4eb2 a3a9 c58143e835f9: Relates a SI prefixed unit to the multiplication factor corresponding to the prefix.

hasDimensionString
type: DatatypeProperty
type: FunctionalProperty
range: string
comment: Relates a SI dimensional unit to a dimension string.
EMMO 967080e5 2f42 4eb2 a3a9 c58143e835f9: Relates a SI dimensional unit to a dimension string.

hasNumberValue
type: DatatypeProperty
type: FunctionalProperty
comment: The owl:dataProperty that provides a serialisation of an EMMO numerical data entity.
EMMO c7b62dd7 063a 4c2a 8504 42f7264ba83f: The owl:dataProperty that provides a serialisation of an EMMO numerical data entity.

hasAtomicNumber
type: DatatypeProperty
range: integer
comment: The atomic number of an atomic element.
comment: This is a convenient shortcut for the conventional declaration process of assigning an atomic number to an atom subclass.
EMMO 967080e5 2f42 4eb2 a3a9 c58143e835f9: The atomic number of an atomic element.

hasIUPAC2016AtomicMass
type: DatatypeProperty
range: decimal
comment: The mass of an atomic element according to IUPAC 2016.
comment: This is a convenient shortcut for the measurement process process of the atomic mass reported by IUPAC2016.
EMMO 967080e5 2f42 4eb2 a3a9 c58143e835f9: The mass of an atomic element according to IUPAC 2016.

unitSymbolValue
type: DatatypeProperty

hasSymbolValue
type: DatatypeProperty
type: FunctionalProperty
domain: Class
comment: The owl:dataProperty that provides a serialisation of an EMMO symbol data entity.
EMMO c7b62dd7 063a 4c2a 8504 42f7264ba83f: The owl:dataProperty that provides a serialisation of an EMMO symbol data entity.

hasStringValue
type: DatatypeProperty
type: FunctionalProperty
range: string
comment: The owl:dataProperty that provides a serialisation of an EMMO string data entity.
EMMO c7b62dd7 063a 4c2a 8504 42f7264ba83f: The owl:dataProperty that provides a serialisation of an EMMO string data entity.

chemicalSymbolValue
type: DatatypeProperty

hasPrefixSymbol
type: DatatypeProperty
range: string
comment: Relates a SI prefixed unit to the prefix symbol.
deprecated: true
EMMO 967080e5 2f42 4eb2 a3a9 c58143e835f9: Relates a SI prefixed unit to the prefix symbol.

mathematicalSymbolValue
type: DatatypeProperty

hasORCID
type: DatatypeProperty
range: anyURI
comment: Relates an individual to an ORCID that identifies the individual.
comment: The domain is not provided to not impose restrictions on the individual carrying the ORCID. Typically it will be a person (maximal) or a temporal part of a person.

hasURLValue
type: DatatypeProperty

hasURIValue
type: DatatypeProperty
range: anyURI

hasURNValue
type: DatatypeProperty

hasSIQuantityValue
type: DatatypeProperty
sub property of: topDataProperty
comment: Relates a physical quantity to its value specified as a string consisting of a numerical, a separator and a unit.
comment: Using hasSIQuantityValue is a convenient, but less semantic, alternative to specify value and unit of a physical quantity compared to using the 'hasNumericalPart' and 'hasReferencePart'/'hasMetrologicalReference' relations. The unit should be a valid, possible prefixed, derived SI unit.
example: Example showing how to specify the value of a physical quantity in turtle using hasSIQuantityValue: height1 a emmo:Height ; hasSIQuantityValue "3 cm"^^emmo:SIQuantityDatatype .
EMMO 967080e5 2f42 4eb2 a3a9 c58143e835f9: Relates a physical quantity to its value specified as a string consisting of a numerical, a separator and a unit.
EMMO c7b62dd7 063a 4c2a 8504 42f7264ba83f: Using hasSIQuantityValue is a convenient, but less semantic, alternative to specify value and unit of a physical quantity compared to using the 'hasNumericalPart' and 'hasReferencePart'/'hasMetrologicalReference' relations. The unit should be a valid, possible prefixed, derived SI unit.

IEVReference
type: AnnotationProperty
sub property of: seeAlso
comment: URL for the entry in the International Electrotechnical Vocabulary (IEV).
EMMO 967080e5 2f42 4eb2 a3a9 c58143e835f9: URL for the entry in the International Electrotechnical Vocabulary (IEV).

definition
type: AnnotationProperty
sub property of: comment
comment: A definition univocally determines a OWL entity using necessary and sufficient conditions referring to other OWL entities.
comment: Precise and univocal description of an ontological entity in the framework of an axiomatic system.
EMMO 967080e5 2f42 4eb2 a3a9 c58143e835f9: Precise and univocal description of an ontological entity in the framework of an axiomatic system.
EMMO c7b62dd7 063a 4c2a 8504 42f7264ba83f: A definition univocally determines a OWL entity using necessary and sufficient conditions referring to other OWL entities.

illustration
type: AnnotationProperty
sub property of: seeAlso
range: anyURI
comment: A link to a graphical representation aimed to facilitate understanding of the concept, or of an annotation.
EMMO 967080e5 2f42 4eb2 a3a9 c58143e835f9: A link to a graphical representation aimed to facilitate understanding of the concept, or of an annotation.

uneceCommonCode
type: AnnotationProperty
range: string
comment: The UN/CEFACT Recommendation 20 provides three character alphabetic and alphanumeric codes for representing units of measurement for length, area, volume/capacity, mass (weight), time, and other quantities used in international trade. The codes are intended for use in manual and/or automated systems for the exchange of information between participants in international trade.
EMMO 967080e5 2f42 4eb2 a3a9 c58143e835f9: The UN/CEFACT Recommendation 20 provides three character alphabetic and alphanumeric codes for representing units of measurement for length, area, volume/capacity, mass (weight), time, and other quantities used in international trade. The codes are intended for use in manual and/or automated systems for the exchange of information between participants in international trade.

metrologicalReference
type: AnnotationProperty
sub property of: seeAlso

comment
type: AnnotationProperty
sub property of: comment
comment: A comment can be addressed to facilitate interpretation, to suggest possible usage, to clarify the concepts behind each entity with respect to other ontological apporaches.
comment: A text that add some information about the entity.
EMMO 967080e5 2f42 4eb2 a3a9 c58143e835f9: A text that add some information about the entity.
EMMO c7b62dd7 063a 4c2a 8504 42f7264ba83f: A comment can be addressed to facilitate interpretation, to suggest possible usage, to clarify the concepts behind each entity with respect to other ontological apporaches.

conceptualisation
type: AnnotationProperty
sub property of: comment
comment: A conceptualisation is the preliminary step behind each theory, preceding each logical formalisation. The readers approaching an ontology entity should first read the conceptualisation annotation to clearly understand "what we are talking about" and the accompanying terminology, and then read the elucidation.
comment: The conceptualisation annotation is a comment that helps the reader to understand how the world has been conceptualised by the ontology authors.
EMMO 967080e5 2f42 4eb2 a3a9 c58143e835f9: The conceptualisation annotation is a comment that helps the reader to understand how the world has been conceptualised by the ontology authors.
EMMO c7b62dd7 063a 4c2a 8504 42f7264ba83f: A conceptualisation is the preliminary step behind each theory, preceding each logical formalisation. The readers approaching an ontology entity should first read the conceptualisation annotation to clearly understand "what we are talking about" and the accompanying terminology, and then read the elucidation.
EMMO c7b62dd7 063a 4c2a 8504 42f7264ba83f: An elucidation can provide references to external knowledge sources (i.e. ISO, Goldbook, RoMM).

contact
type: AnnotationProperty
sub property of: comment
comment: A person or organisation acting as a contact point for enquiries about the ontology resource
comment: The annotation should include an email address.
EMMO 967080e5 2f42 4eb2 a3a9 c58143e835f9: A person or organisation acting as a contact point for enquiries about the ontology resource
EMMO c7b62dd7 063a 4c2a 8504 42f7264ba83f: The annotation should include an email address.

etymology
type: AnnotationProperty
sub property of: comment
comment: Definitions are usually taken from Wiktionary.
comment: The etymology annotation explains the origin of a word and the historical development of its meaning.
EMMO 967080e5 2f42 4eb2 a3a9 c58143e835f9: The etymology annotation explains the origin of a word and the historical development of its meaning.
EMMO c7b62dd7 063a 4c2a 8504 42f7264ba83f: Definitions are usually taken from Wiktionary.
EMMO c7b62dd7 063a 4c2a 8504 42f7264ba83f: The etymology annotation is usually applied to rdfs:label entities, to better understand the connection between a label and the concept it concisely represents.

elucidation
type: AnnotationProperty
sub property of: comment
comment: An elucidation should address the real world entities using the concepts introduced by the conceptualisation annotation.
comment: Short enlightening explanation aimed to facilitate the user in drawing the connection (interpretation) between a OWL entity and the real world object(s) for which it stands.
EMMO 967080e5 2f42 4eb2 a3a9 c58143e835f9: Short enlightening explanation aimed to facilitate the user in drawing the connection (interpretation) between a OWL entity and the real world object(s) for which it stands.
EMMO c7b62dd7 063a 4c2a 8504 42f7264ba83f: An elucidation should address the real world entities using the concepts introduced by the conceptualisation annotation.

ISO80000Reference
type: AnnotationProperty
sub property of: seeAlso
comment: Corresponding item number in ISO 80 000.
example: 3-1.1 (ISO80000 reference to length)
EMMO 967080e5 2f42 4eb2 a3a9 c58143e835f9: Corresponding item number in ISO 80 000.

smileReference
type: AnnotationProperty
sub property of: seeAlso
comment: OpenSMILE representation of a molecular structure.
comment: OpenSMILES is an open specification of the SMILE language for specifying molecular structures, which has become a defacto standard for exchange of molecular structures.
EMMO 967080e5 2f42 4eb2 a3a9 c58143e835f9: OpenSMILE representation of a molecular structure.
EMMO c7b62dd7 063a 4c2a 8504 42f7264ba83f: OpenSMILES is an open specification of the SMILE language for specifying molecular structures, which has become a defacto standard for exchange of molecular structures.

wikidataReference
type: AnnotationProperty
sub property of: seeAlso
comment: URL corresponding to entry in Wikidata.
EMMO 967080e5 2f42 4eb2 a3a9 c58143e835f9: URL corresponding to entry in Wikidata.

wikipediaReference
type: AnnotationProperty
sub property of: seeAlso
range: anyURI
comment: URL to corresponding Wikipedia entry.
EMMO 967080e5 2f42 4eb2 a3a9 c58143e835f9: URL to corresponding Wikipedia entry.

…
type: AnnotationProperty
sub property of: example
comment: Will be removed with 1.0.0 release due to duplicated scope of emmo:example with respect to skos:example
deprecated: true

ucumCode
type: AnnotationProperty
range: string
comment: The Unified Code for Units of Measure (UCUM) is a code system intended to include all units of measures being contemporarily used in international science, engineering, and business. The purpose is to facilitate unambiguous electronic communication of quantities together with their units.
comment: Unified Code for Units of Measure (UCUM).
EMMO 967080e5 2f42 4eb2 a3a9 c58143e835f9: Unified Code for Units of Measure (UCUM).
EMMO c7b62dd7 063a 4c2a 8504 42f7264ba83f: The Unified Code for Units of Measure (UCUM) is a code system intended to include all units of measures being contemporarily used in international science, engineering, and business. The purpose is to facilitate unambiguous electronic communication of quantities together with their units.

iupacReference
type: AnnotationProperty
sub property of: seeAlso
range: anyURI
comment: DOI to corresponding concept in IUPAC

qudtReference
type: AnnotationProperty
comment: URL to corresponing entity in QUDT.
EMMO 967080e5 2f42 4eb2 a3a9 c58143e835f9: URL to corresponing entity in QUDT.

dbpediaReference
type: AnnotationProperty
sub property of: seeAlso
range: anyURI
comment: URL to corresponding dpbedia entry.
EMMO 967080e5 2f42 4eb2 a3a9 c58143e835f9: URL to corresponding dpbedia entry.

VIMTerm
type: AnnotationProperty
sub property of: isDefinedBy
comment: The term in the International vocabulary of metrology (VIM) (JCGM 200:2008) that corresponds to the annotated term in EMMO.
example: quantity value (term in VIM that corresponds to Quantity in EMMO)
EMMO c7b62dd7 063a 4c2a 8504 42f7264ba83f: The term in the International vocabulary of metrology (VIM) (JCGM 200:2008) that corresponds to the annotated term in EMMO.

OWL2DLRestrictedAxiom
type: AnnotationProperty
sub property of: comment
comment: Axiom not included in the theory because of OWL 2 DL global restrictions for decidability.
EMMO 967080e5 2f42 4eb2 a3a9 c58143e835f9: Axiom not included in the theory because of OWL 2 DL global restrictions for decidability.

inchiKey
type: AnnotationProperty
sub property of: seeAlso
comment: A hash of the full International Chemical Identifier (InChi) for a chemical substance.
comment: The InChiKey is a hash of the full InChi identifier using the SHA-256 algorithm, designed to allow for easy web searches of chemical compounds.
EMMO 967080e5 2f42 4eb2 a3a9 c58143e835f9: A hash of the full International Chemical Identifier (InChi) for a chemical substance.
EMMO c7b62dd7 063a 4c2a 8504 42f7264ba83f: The InChiKey is a hash of the full InChi identifier using the SHA-256 algorithm, designed to allow for easy web searches of chemical compounds.

omReference
type: AnnotationProperty
comment: IRI to corresponding concept in the Ontology of units of Measure.
EMMO 967080e5 2f42 4eb2 a3a9 c58143e835f9: IRI to corresponding concept in the Ontology of units of Measure.

OWLRL2DLAxioms
type: AnnotationProperty
sub property of: comment
comment: Axioms to add to the OWL 2 RL version of the ontology to reach DL expressivity.
EMMO 967080e5 2f42 4eb2 a3a9 c58143e835f9: Axioms to add to the OWL 2 RL version of the ontology to reach DL expressivity.

unitSymbol
type: AnnotationProperty
sub property of: comment
range: string
comment: A unit symbol may be a symbolic construct (e.g. km) or a symbol (e.g. m).
comment: The standard symbol for a unit.
EMMO 967080e5 2f42 4eb2 a3a9 c58143e835f9: The standard symbol for a unit.
EMMO c7b62dd7 063a 4c2a 8504 42f7264ba83f: A unit symbol may be a symbolic construct (e.g. km) or a symbol (e.g. m).

ISO14040Reference
type: AnnotationProperty
sub property of: isDefinedBy

ISO9000Reference
type: AnnotationProperty
sub property of: isDefinedBy

Understanding
type: Class
comment: A semiosis where the interpreter perceives a sign, that generates the interpretant as interpreter's internal representation, leading to potential interpretations.
EMMO 967080e5 2f42 4eb2 a3a9 c58143e835f9: A semiosis where the interpreter perceives a sign, that generates the interpretant as interpreter's internal representation, leading to potential interpretations.

PartialSemiosis
type: Class
comment: A semiosis where the triangle of relation is not completely developed.
EMMO 967080e5 2f42 4eb2 a3a9 c58143e835f9: A semiosis where the triangle of relation is not completely developed.

ObjectiveProperty
type: Class
comment: A quantity that is obtained from a well-defined procedure.
comment: Subclasses of 'ObjectiveProperty' classify objects according to the type semiosis that is used to connect the property to the object (e.g. by measurement, by convention, by modelling).
comment: The word objective does not mean that each observation will provide the same results. It means that the observation followed a well defined procedure. This class refers to what is commonly known as physical property, i.e. a measurable property of physical system, whether is quantifiable or not.
alternative label: PhysicalProperty
alternative label: QuantitativeProperty
EMMO 967080e5 2f42 4eb2 a3a9 c58143e835f9: A quantity that is obtained from a well-defined procedure.
EMMO c7b62dd7 063a 4c2a 8504 42f7264ba83f: The word objective does not mean that each observation will provide the same results. It means that the observation followed a well defined procedure. This class refers to what is commonly known as physical property, i.e. a measurable property of physical system, whether is quantifiable or not.

Objective
type: Class
comment: A coded conventional that is determined by each interpeter following a well defined determination procedure through a specific perception channel.
comment: The word objective does not mean that each observation will provide the same results. It means that the observation followed a well defined procedure. This class refers to what is commonly known as physical property, i.e. a measurable property of physical system, whether is quantifiable or not.
EMMO 967080e5 2f42 4eb2 a3a9 c58143e835f9: A coded conventional that is determined by each interpeter following a well defined determination procedure through a specific perception channel.

QuantityBySubjectivity
type: Class

Metre
type: Class
subclass of: Restriction
  has value: m
comment: The metre, symbol m, is the SI unit of length. It is defined by taking the fixed numerical value of the speed of light in vacuum c to be 299792458 when expressed in the unit m s−1, where the second is defined in terms of ∆νCs.
alternative label: Meter
EMMO 0b1cbe60 d380 4787 b92e be26bdacf2c2: MTR
EMMO 1f1b164d ec6a 4faa 8d5e 88bda62316cc: http://qudt.org/vocab/unit/M
EMMO 33ae2d07 5526 4555 a0b4 8f4c031b5652: m
EMMO 6dd685dd 1895 46e4 b227 be9f7d643c25: http://dbpedia.org/resource/Metre
EMMO 70fe84ff 99b6 4206 a9fc 9a8931836d84: The metre, symbol m, is the SI unit of length. It is defined by taking the fixed numerical value of the speed of light in vacuum c to be 299792458 when expressed in the unit m s−1, where the second is defined in terms of ∆νCs.
EMMO c84c6752 6d64 48cc 9500 e54a3c34898d: http://en.wikipedia.org/wiki/Metre
EMMO fe015383 afb3 44a6 ae86 043628697aa2: https://doi.org/10.1351/goldbook.M03884

PicoAmpere
type: Class
subclass of: Restriction
  some values from: Ampere
subclass of: Restriction
  has value: 1e-12
subclass of: Restriction
  has value: 0.0
alternative label: picoampere
EMMO 1f1b164d ec6a 4faa 8d5e 88bda62316cc: http://qudt.org/vocab/unit/PicoA
EMMO 33ae2d07 5526 4555 a0b4 8f4c031b5652: pA
EMMO 7f1dec83 d85e 4e1b b7bd c9442d4f5a64: pA

PicoPrefixedUnit
type: Class
subclass of: Restriction
subclass of: Restriction
  has value: 1e-12
comment: Superclass for all units prefixed with "pico" (1e-12).
EMMO 967080e5 2f42 4eb2 a3a9 c58143e835f9: Superclass for all units prefixed with "pico" (1e-12).

SIMetricPrefixedUnit
type: Class
comment: A SI base unit or SI derived unit with a metric prefix.

ElectricCurrentUnit
type: Class
subclass of: Restriction
  has value: T0 L0 M0 I+1 Θ0 N0 J0
comment: The class of units with dimensionality 'ElectricCurrent'.
EMMO 967080e5 2f42 4eb2 a3a9 c58143e835f9: The class of units with dimensionality 'ElectricCurrent'.

MilliAmpere
type: Class
subclass of: Restriction
  some values from: Ampere
subclass of: Restriction
  has value: 0.001
subclass of: Restriction
  has value: 0.0
comment: A milliampere is 0.001 A
alternative label: milliampere
EMMO 1f1b164d ec6a 4faa 8d5e 88bda62316cc: http://qudt.org/vocab/unit/MilliA
EMMO 33ae2d07 5526 4555 a0b4 8f4c031b5652: mA
EMMO 7f1dec83 d85e 4e1b b7bd c9442d4f5a64: mA
EMMO 967080e5 2f42 4eb2 a3a9 c58143e835f9: A milliampere is 0.001 A

MilliPrefixedUnit
type: Class
subclass of: Restriction
subclass of: Restriction
  has value: 0.001
comment: Superclass for all units prefixed with "milli" (1e-3).
EMMO 967080e5 2f42 4eb2 a3a9 c58143e835f9: Superclass for all units prefixed with "milli" (1e-3).

RadiumAtom
type: Class
subclass of: Restriction
subclass of: Restriction
  has value: 226.02541
subclass of: Restriction
  has value: 88
comment: Atom subclass for radium.
EMMO 967080e5 2f42 4eb2 a3a9 c58143e835f9: Atom subclass for radium.

Referent
type: Class
subclass of: Restriction
comment: Here is assumed that the concept of 'object' is always relative to a 'semiotic' process. An 'object' does not exists per se, but it's always part of an interpretation. The EMMO relies on strong reductionism, i.e. everything real is a formless collection of elementary particles: we give a meaning to real world entities only by giving them boundaries and defining them using 'sign'-s. In this way the 'sign'-ed entity becomes an 'object', and the 'object' is the basic entity needed in order to apply a logical formalism to the real world entities (i.e. we can speak of it through its sign, and use logics on it through its sign).
comment: The object, in Peirce semiotics, as participant to a semiotic process.
alternative label: Object
alternative label: SemioticObject
EMMO 967080e5 2f42 4eb2 a3a9 c58143e835f9: The object, in Peirce semiotics, as participant to a semiotic process.
EMMO c7b62dd7 063a 4c2a 8504 42f7264ba83f: Here is assumed that the concept of 'object' is always relative to a 'semiotic' process. An 'object' does not exists per se, but it's always part of an interpretation. The EMMO relies on strong reductionism, i.e. everything real is a formless collection of elementary particles: we give a meaning to real world entities only by giving them boundaries and defining them using 'sign'-s. In this way the 'sign'-ed entity becomes an 'object', and the 'object' is the basic entity needed in order to apply a logical formalism to the real world entities (i.e. we can speak of it through its sign, and use logics on it through its sign).

Atom
type: Class
subclass of: Restriction
comment: A standalone atom has direct part one 'nucleus' and one 'electron_cloud'. An O 'atom' within an O₂ 'molecule' is an 'e-bonded_atom'. In this material branch, H atom is a particular case, with respect to higher atomic number atoms, since as soon as it shares its electron it has no nucleus entangled electron cloud. We cannot say that H₂ molecule has direct part two H atoms, but has direct part two H nucleus.
comment: An 'atom' is a 'nucleus' surrounded by an 'electron_cloud', i.e. a quantum system made of one or more bounded electrons.
alternative label: ChemicalElement
EMMO 967080e5 2f42 4eb2 a3a9 c58143e835f9: A standalone atom has direct part one 'nucleus' and one 'electron_cloud'. An O 'atom' within an O₂ 'molecule' is an 'e-bonded_atom'. In this material branch, H atom is a particular case, with respect to higher atomic number atoms, since as soon as it shares its electron it has no nucleus entangled electron cloud. We cannot say that H₂ molecule has direct part two H atoms, but has direct part two H nucleus.
EMMO c7b62dd7 063a 4c2a 8504 42f7264ba83f: An 'atom' is a 'nucleus' surrounded by an 'electron_cloud', i.e. a quantum system made of one or more bounded electrons.

HeatCapacity
type: Class
subclass of: Restriction
comment: Examples of condition might be constant volume or constant pressure for a gas.
comment: Quantity C = dQ/dT, when the thermodynamic temperature of a system is increased by dT as a result of the addition of a amount of heat dQ, under given condition.
EMMO 1f1b164d ec6a 4faa 8d5e 88bda62316cc: https://qudt.org/vocab/quantitykind/HeatCapacity
EMMO 26bf1bef d192 4da6 b0eb d2209698fb54: https://www.wikidata.org/wiki/Q179388
EMMO 50c298c2 55a2 4068 b3ac 4e948c33181f: https://www.electropedia.org/iev/iev.nsf/display
EMMO 6dd685dd 1895 46e4 b227 be9f7d643c25: https://dbpedia.org/page/Heat_capacity
EMMO 8de5d5bf db1c 40ac b698 095ba3b18578: 5-15
EMMO 967080e5 2f42 4eb2 a3a9 c58143e835f9: Quantity C = dQ/dT, when the thermodynamic temperature of a system is increased by dT as a result of the addition of a amount of heat dQ, under given condition.
EMMO c84c6752 6d64 48cc 9500 e54a3c34898d: https://en.wikipedia.org/wiki/Heat_capacity
EMMO fe015383 afb3 44a6 ae86 043628697aa2: https://doi.org/10.1351/goldbook.H02753

ISQDerivedQuantity
type: Class
comment: Derived quantities defined in the International System of Quantities (ISQ).
EMMO 967080e5 2f42 4eb2 a3a9 c58143e835f9: Derived quantities defined in the International System of Quantities (ISQ).

ThermodynamicalQuantity
type: Class
comment: Quantities categorised according to ISO 80000-5.
EMMO 967080e5 2f42 4eb2 a3a9 c58143e835f9: Quantities categorised according to ISO 80000-5.

BindingFraction
type: Class
comment: The ratio of the binding energy of a nucleus to the atomic mass number.
EMMO 1f1b164d ec6a 4faa 8d5e 88bda62316cc: https://qudt.org/vocab/quantitykind/BindingFraction
EMMO 26bf1bef d192 4da6 b0eb d2209698fb54: https://www.wikidata.org/wiki/Q98058362
EMMO 8de5d5bf db1c 40ac b698 095ba3b18578: 10-23.2
EMMO 967080e5 2f42 4eb2 a3a9 c58143e835f9: The ratio of the binding energy of a nucleus to the atomic mass number.

AtomicAndNuclearPhysicsQuantity
type: Class
comment: Quantities categorised according to ISO 80000-10.
EMMO 967080e5 2f42 4eb2 a3a9 c58143e835f9: Quantities categorised according to ISO 80000-10.

ISQDimensionlessQuantity
type: Class
subclass of: Restriction
comment: A quantity to which no physical dimension is assigned and with a corresponding unit of measurement in the SI of the unit one.
EMMO 1f1b164d ec6a 4faa 8d5e 88bda62316cc: http://qudt.org/vocab/quantitykind/Dimensionless
EMMO 967080e5 2f42 4eb2 a3a9 c58143e835f9: A quantity to which no physical dimension is assigned and with a corresponding unit of measurement in the SI of the unit one.
EMMO c84c6752 6d64 48cc 9500 e54a3c34898d: https://en.wikipedia.org/wiki/Dimensionless_quantity
EMMO fe015383 afb3 44a6 ae86 043628697aa2: https://doi.org/10.1351/goldbook.D01742

SecondAxialMomentOfArea
type: Class
subclass of: Restriction
comment: A geometrical property of an area which reflects how its points are distributed with regard to an arbitrary axis.
EMMO 1f1b164d ec6a 4faa 8d5e 88bda62316cc: https://qudt.org/vocab/quantitykind/SecondAxialMomentOfArea
EMMO 26bf1bef d192 4da6 b0eb d2209698fb54: https://www.wikidata.org/wiki/Q91405496
EMMO 50c298c2 55a2 4068 b3ac 4e948c33181f: https://www.electropedia.org/iev/iev.nsf/display
EMMO 8de5d5bf db1c 40ac b698 095ba3b18578: 4-21.1
EMMO 967080e5 2f42 4eb2 a3a9 c58143e835f9: A geometrical property of an area which reflects how its points are distributed with regard to an arbitrary axis.

MechanicalQuantity
type: Class
comment: Quantities categorised according to ISO 80000-4.
EMMO 967080e5 2f42 4eb2 a3a9 c58143e835f9: Quantities categorised according to ISO 80000-4.

DegreeCelsius
type: Class
subclass of: Restriction
  has value: °C
comment: Celsius, also known as centigrade, is a scale and unit of measurement for temperature. It can refer to a specific temperature on the Celsius scale as well as a unit to indicate a temperature interval, a difference between two temperatures or an uncertainty. This definition fixes the magnitude of both the degree Celsius and the kelvin as precisely 1 part in 273.16 (approximately 0.00366) of the difference between absolute zero and the triple point of water. Thus, it sets the magnitude of one degree Celsius and that of one kelvin as exactly the same. Additionally, it establishes the difference between the two scales' null points as being precisely 273.15 °C. -- QUDT
comment: Measurement unit for Celsius temperature. This unit can only be used for expressing temperature differences.
EMMO 0b1cbe60 d380 4787 b92e be26bdacf2c2: CEL
EMMO 1f1b164d ec6a 4faa 8d5e 88bda62316cc: http://qudt.org/vocab/unit/DEG_C
EMMO 33ae2d07 5526 4555 a0b4 8f4c031b5652: Cel
EMMO 6dd685dd 1895 46e4 b227 be9f7d643c25: http://dbpedia.org/resource/Celsius
EMMO 967080e5 2f42 4eb2 a3a9 c58143e835f9: Measurement unit for Celsius temperature. This unit can only be used for expressing temperature differences.
EMMO c7b62dd7 063a 4c2a 8504 42f7264ba83f: Celsius, also known as centigrade, is a scale and unit of measurement for temperature. It can refer to a specific temperature on the Celsius scale as well as a unit to indicate a temperature interval, a difference between two temperatures or an uncertainty. This definition fixes the magnitude of both the degree Celsius and the kelvin as precisely 1 part in 273.16 (approximately 0.00366) of the difference between absolute zero and the triple point of water. Thus, it sets the magnitude of one degree Celsius and that of one kelvin as exactly the same. Additionally, it establishes the difference between the two scales' null points as being precisely 273.15 °C. -- QUDT
EMMO c84c6752 6d64 48cc 9500 e54a3c34898d: http://en.wikipedia.org/wiki/Celsius
EMMO fe015383 afb3 44a6 ae86 043628697aa2: https://doi.org/10.1351/goldbook.D01561

TemperatureUnit
type: Class
subclass of: Restriction
  has value: T0 L0 M0 I0 Θ+1 N0 J0
comment: The class of units with dimensionality 'Temperature'.
EMMO 967080e5 2f42 4eb2 a3a9 c58143e835f9: The class of units with dimensionality 'Temperature'.

SISpecialUnit
type: Class
disjoint union of: Becquerel
disjoint union of: Coulomb
disjoint union of: DegreeCelsius
disjoint union of: Farad
disjoint union of: Gray
disjoint union of: Henry
disjoint union of: Hertz
disjoint union of: Joule
disjoint union of: Katal
disjoint union of: Lumen
disjoint union of: Lux
disjoint union of: Newton
disjoint union of: Ohm
disjoint union of: Pascal
disjoint union of: Radian
disjoint union of: Siemens
disjoint union of: Sievert
disjoint union of: Steradian
disjoint union of: Tesla
disjoint union of: Volt
disjoint union of: Watt
disjoint union of: Weber
comment: The 22 derived units that are given a special name in the SI system that stands for units derived by SI base units.
comment: These units are SI coherent by definition.
EMMO 967080e5 2f42 4eb2 a3a9 c58143e835f9: The 22 derived units that are given a special name in the SI system that stands for units derived by SI base units.
EMMO c7b62dd7 063a 4c2a 8504 42f7264ba83f: These units are SI coherent by definition.
EMMO c84c6752 6d64 48cc 9500 e54a3c34898d: https://en.wikipedia.org/wiki/International_System_of_Units#Derived_units

SpecialUnit
type: Class
comment: A unit symbol that stands for a derived unit.
comment: Special units are semiotic shortcuts to more complex composed symbolic objects.
example: Pa stands for N/m2 J stands for N m
EMMO 967080e5 2f42 4eb2 a3a9 c58143e835f9: A unit symbol that stands for a derived unit.

DerivedUnit
type: Class
comment: A measurement unit for a derived quantity. -- VIM
comment: Derived units are defined as products of powers of the base units corresponding to the relations defining the derived quantities in terms of the base quantities.
EMMO 967080e5 2f42 4eb2 a3a9 c58143e835f9: Derived units are defined as products of powers of the base units corresponding to the relations defining the derived quantities in terms of the base quantities.
EMMO bb49844b 45d7 4f0d 8cae 8e552cbc20d6: derived unit
EMMO c7b62dd7 063a 4c2a 8504 42f7264ba83f: A measurement unit for a derived quantity. -- VIM

UnitSymbol
type: Class
equivalent class: Class
comment: A symbol that stands for a single unit.
example: Some examples are "Pa", "m" and "J".
EMMO 8a137e9f 579c 4e28 baca e8980eb0c3db: DisjointUnionOf: SpecialUnit, BaseUnit
EMMO 967080e5 2f42 4eb2 a3a9 c58143e835f9: A symbol that stands for a single unit.

BaseUnit
type: Class
subclass of: Restriction
comment: A set of units that correspond to the base quantities in a system of units.
EMMO 967080e5 2f42 4eb2 a3a9 c58143e835f9: A set of units that correspond to the base quantities in a system of units.
EMMO bb49844b 45d7 4f0d 8cae 8e552cbc20d6: base unit

BerkeliumAtom
type: Class
subclass of: Restriction
subclass of: Restriction
  has value: 247.07031
subclass of: Restriction
  has value: 97
comment: Atom subclass for berkelium.
EMMO 967080e5 2f42 4eb2 a3a9 c58143e835f9: Atom subclass for berkelium.

LiquidAerosol
type: Class
comment: An aerosol composed of liquid droplets in air or another gas.
EMMO 967080e5 2f42 4eb2 a3a9 c58143e835f9: An aerosol composed of liquid droplets in air or another gas.

Aerosol
type: Class
comment: A colloid composed of fine solid particles or liquid droplets in air or another gas.
EMMO 967080e5 2f42 4eb2 a3a9 c58143e835f9: A colloid composed of fine solid particles or liquid droplets in air or another gas.

Array3D
type: Class
subclass of: Restriction
comment: 3-dimensional array who's spatial direct parts are matrices.
alternative label: 3DArray
EMMO 967080e5 2f42 4eb2 a3a9 c58143e835f9: 3-dimensional array who's spatial direct parts are matrices.

Array
type: Class
comment: Array subclasses with a specific shape can be constructed with cardinality restrictions. See Shape4x3Matrix as an example.
comment: Arrays are ordered mathematical objects who's elementary spatial parts are numbers. Their dimensionality is constructed with spatial direct parthood, where 1-dimensional arrays have spatial direct parts Number and n-dimensional array have spatial direct parts (n-1)-dimensional arrays.
comment: Arrays are ordered objects, since they are a subclasses of Arrangement.
example: A Vector is a 1-dimensional Array with Number as spatial direct parts, a Matrix is a 2-dimensional Array with Vector as spatial direct parts, an Array3D is a 3-dimensional Array with Matrix as spatial direct parts, and so forth...
EMMO 967080e5 2f42 4eb2 a3a9 c58143e835f9: Arrays are ordered mathematical objects who's elementary spatial parts are numbers. Their dimensionality is constructed with spatial direct parthood, where 1-dimensional arrays have spatial direct parts Number and n-dimensional array have spatial direct parts (n-1)-dimensional arrays.

SpatioTemporalTessellation
type: Class
subclass of: Restriction
comment: The superclass for all tessellations in which all tiles are connected through spatiotemporal relations hasNext or contacts.
alternative label: WellFormedTessellation
EMMO 8a137e9f 579c 4e28 baca e8980eb0c3db: EquivalentTo: MixedTiling or SpatialTiling or TemporalTiling
EMMO 967080e5 2f42 4eb2 a3a9 c58143e835f9: The superclass for all tessellations in which all tiles are connected through spatiotemporal relations hasNext or contacts.

StandardEquilibriumConstant
type: Class
comment: Constant of a chemical reaction. It is the value of its reaction quotient at chemical equilibrium, a state approached by a dynamic chemical system after sufficient time has elapsed at which its composition has no measurable tendency towards further change.
alternative label: ThermodynamicEquilibriumConstant
EMMO 26bf1bef d192 4da6 b0eb d2209698fb54: https://www.wikidata.org/wiki/Q95993378
EMMO 8de5d5bf db1c 40ac b698 095ba3b18578: 9-32
EMMO 967080e5 2f42 4eb2 a3a9 c58143e835f9: Constant of a chemical reaction. It is the value of its reaction quotient at chemical equilibrium, a state approached by a dynamic chemical system after sufficient time has elapsed at which its composition has no measurable tendency towards further change.
EMMO fe015383 afb3 44a6 ae86 043628697aa2: https://doi.org/10.1351/goldbook.S05915

EquilibriumConstant
type: Class
comment: The physical dimension can change based on the stoichiometric numbers of the substances involved.
comment: for solutions, product for all substances B of concentration c_B of substance B in power of its stoichiometric number v_B: K_p = \sum_B{c_B^{v_B}}.
alternative label: EquilibriumConstantConcentrationBasis
EMMO 1f1b164d ec6a 4faa 8d5e 88bda62316cc: https://qudt.org/vocab/quantitykind/EquilibriumConstant
EMMO 26bf1bef d192 4da6 b0eb d2209698fb54: https://www.wikidata.org/wiki/Q857809
EMMO 967080e5 2f42 4eb2 a3a9 c58143e835f9: for solutions, product for all substances B of concentration c_B of substance B in power of its stoichiometric number v_B: K_p = \sum_B{c_B^{v_B}}.
EMMO c84c6752 6d64 48cc 9500 e54a3c34898d: https://en.wikipedia.org/wiki/Equilibrium_constant
EMMO fe015383 afb3 44a6 ae86 043628697aa2: https://doi.org/10.1351/goldbook.E02177

Area
type: Class
subclass of: Restriction
comment: Extent of a surface.
EMMO 1f1b164d ec6a 4faa 8d5e 88bda62316cc: http://qudt.org/vocab/quantitykind/Area
EMMO 8de5d5bf db1c 40ac b698 095ba3b18578: 3-3
EMMO 967080e5 2f42 4eb2 a3a9 c58143e835f9: Extent of a surface.
EMMO fe015383 afb3 44a6 ae86 043628697aa2: https://doi.org/10.1351/goldbook.A00429

Extensive
type: Class
comment: A quantity whose magnitude is additive for subsystems.
comment: Note that not all physical quantities can be categorised as being either intensive or extensive. For example the square root of the mass.
example: Mass Volume Entropy
EMMO 967080e5 2f42 4eb2 a3a9 c58143e835f9: A quantity whose magnitude is additive for subsystems.

SpaceAndTimeQuantity
type: Class
comment: Quantities categorised according to ISO 80000-3.
EMMO 967080e5 2f42 4eb2 a3a9 c58143e835f9: Quantities categorised according to ISO 80000-3.

NonNegativeIntegerData
type: Class
comment: A data representing an integer number >= 0.
EMMO 8a137e9f 579c 4e28 baca e8980eb0c3db: EquivalentTo: hasDataValue some xsd:nonNegativeInteger
EMMO 967080e5 2f42 4eb2 a3a9 c58143e835f9: A data representing an integer number >= 0.

TungstenSymbol
type: Class
subclass of: Restriction
  has value: W
comment: The symbol that stands for the tungsten atom.
EMMO 967080e5 2f42 4eb2 a3a9 c58143e835f9: The symbol that stands for the tungsten atom.

NCNameData
type: Class

NMTOKENData
type: Class

ChemicalElement
type: Class
comment: The IUPAC Gold Book defines the a chemical element both as: - a species of atoms; all atoms with the same number of protons in the atomic nucleus - a pure chemical substance composed of atoms with the same number of protons in the atomic nucleus This qualifies a chemical element as a name and not a matter obejct that can stand for an atom or a substance.
comment: The symbol for a specific chemical element, that can stand both for an atom or a substance.
EMMO 967080e5 2f42 4eb2 a3a9 c58143e835f9: The symbol for a specific chemical element, that can stand both for an atom or a substance.
EMMO fe015383 afb3 44a6 ae86 043628697aa2: https://doi.org/10.1351/goldbook.C01022

LanguageData
type: Class

CoulombSquareMetrePerVolt
type: Class
subclass of: Restriction
  has value: 1.0
subclass of: Restriction
  has value: 0.0
comment: Coulomb Square Meter (C-m2-per-volt) is a unit in the category of Electric polarizability. -- QUDT
alternative label: Coulomb Square Metre Per Volt
EMMO 1f1b164d ec6a 4faa 8d5e 88bda62316cc: http://qudt.org/vocab/unit/C-M2-PER-V
EMMO 33ae2d07 5526 4555 a0b4 8f4c031b5652: C.m2.V-1
EMMO 33ae2d07 5526 4555 a0b4 8f4c031b5652: C.m2/V
EMMO 7f1dec83 d85e 4e1b b7bd c9442d4f5a64: C⋅m²/V
EMMO 967080e5 2f42 4eb2 a3a9 c58143e835f9: Coulomb Square Meter (C-m2-per-volt) is a unit in the category of Electric polarizability. -- QUDT

SICoherentDerivedUnit
type: Class
comment: A SI derived unit whos numerical factor in front of the product of SI base units is one.
comment: This class collects all units that are products or powers of SI base or SI special units only.
example: m/s kg/m^3
EMMO 967080e5 2f42 4eb2 a3a9 c58143e835f9: A SI derived unit whos numerical factor in front of the product of SI base units is one.

SquareCurrentQuarticTimePerMassUnit
type: Class
subclass of: Restriction
  has value: T+4 L0 M-1 I+2 Θ0 N0 J0
comment: The class of units with dimensionality 'SquareCurrentQuarticTimePerMass'.
EMMO 967080e5 2f42 4eb2 a3a9 c58143e835f9: The class of units with dimensionality 'SquareCurrentQuarticTimePerMass'.

VoltPerSecond
type: Class
subclass of: Restriction
  has value: 1.0
subclass of: Restriction
  has value: 0.0
comment: 'Volt per Second' is a unit of magnetic flux equaling one weber. This is the flux passing through a conducting loop and reduced to zero at a uniform rate in one second inducing an electric potential of one volt in the loop. -- QUDT
alternative label: Volt per second
EMMO 1f1b164d ec6a 4faa 8d5e 88bda62316cc: http://qudt.org/vocab/unit/V-PER-SEC
EMMO 33ae2d07 5526 4555 a0b4 8f4c031b5652: V.s-1
EMMO 7f1dec83 d85e 4e1b b7bd c9442d4f5a64: V/s
EMMO 967080e5 2f42 4eb2 a3a9 c58143e835f9: 'Volt per Second' is a unit of magnetic flux equaling one weber. This is the flux passing through a conducting loop and reduced to zero at a uniform rate in one second inducing an electric potential of one volt in the loop. -- QUDT

ElectricPotentialPerTimeUnit
type: Class
subclass of: Restriction
  has value: T-4 L+2 M+1 I-1 Θ0 N0 J0
comment: The class of units with dimensionality 'ElectricPotentialPerTime'.
EMMO 967080e5 2f42 4eb2 a3a9 c58143e835f9: The class of units with dimensionality 'ElectricPotentialPerTime'.

LongData
type: Class
comment: A data representing 64-bit integer number.
EMMO 8a137e9f 579c 4e28 baca e8980eb0c3db: EquivalentTo: hasDataValue some xsd:long
EMMO 967080e5 2f42 4eb2 a3a9 c58143e835f9: A data representing 64-bit integer number.

GrayPerSecond
type: Class
subclass of: Restriction
  has value: 1.0
subclass of: Restriction
  has value: 0.0
comment: "Gray per Second" is a unit for 'Absorbed Dose Rate' expressed as Gy/s. -- QUDT
alternative label: Gray per Second
EMMO 1f1b164d ec6a 4faa 8d5e 88bda62316cc: http://qudt.org/vocab/unit/GRAY-PER-SEC
EMMO 33ae2d07 5526 4555 a0b4 8f4c031b5652: Gy.s-1
EMMO 7f1dec83 d85e 4e1b b7bd c9442d4f5a64: Gy/s
EMMO 967080e5 2f42 4eb2 a3a9 c58143e835f9: "Gray per Second" is a unit for 'Absorbed Dose Rate' expressed as Gy/s. -- QUDT

AbsorbedDoseRateUnit
type: Class
subclass of: Restriction
  has value: T-3 L+2 M0 I0 Θ0 N0 J0
comment: The class of units with dimensionality 'AbsorbedDoseRate'.
EMMO 967080e5 2f42 4eb2 a3a9 c58143e835f9: The class of units with dimensionality 'AbsorbedDoseRate'.

PicoMolePerMetrePerWattPerSecond
type: Class
subclass of: Restriction
  has value: 1e-12
subclass of: Restriction
  has value: 0.0
alternative label: Picomoles per metre per watt per second
EMMO 1f1b164d ec6a 4faa 8d5e 88bda62316cc: http://qudt.org/vocab/unit/PicoMOL-PER-M-W-SEC
EMMO 33ae2d07 5526 4555 a0b4 8f4c031b5652: pmol.m-1.W-1.s-1
EMMO 7f1dec83 d85e 4e1b b7bd c9442d4f5a64: pmol/(m⋅W⋅s)

AmountSquareTimePerMassVolumeUnit
type: Class
subclass of: Restriction
  has value: T+2 L-3 M-1 I0 Θ0 N+1 J0
comment: The class of units with dimensionality 'AmountSquareTimePerMassVolume'.
EMMO 967080e5 2f42 4eb2 a3a9 c58143e835f9: The class of units with dimensionality 'AmountSquareTimePerMassVolume'.

SourceVoltage
type: Class
comment: Voltage between the two terminals of a voltage source when there is no electric current through the source.
alternative label: SourceTension
EMMO 1f1b164d ec6a 4faa 8d5e 88bda62316cc: https://qudt.org/vocab/quantitykind/SourceVoltage
EMMO 26bf1bef d192 4da6 b0eb d2209698fb54: https://www.wikidata.org/wiki/Q185329
EMMO 8de5d5bf db1c 40ac b698 095ba3b18578: 6-36
EMMO 967080e5 2f42 4eb2 a3a9 c58143e835f9: Voltage between the two terminals of a voltage source when there is no electric current through the source.

Voltage
type: Class
comment: Correspond to the work needed per unit of charge to move a test charge between two points in a static electric field.
comment: The difference in electric potential between two points.
alternative label: ElectricPotentialDifference
alternative label: ElectricTension
EMMO 1f1b164d ec6a 4faa 8d5e 88bda62316cc: http://qudt.org/vocab/quantitykind/Voltage
EMMO 8de5d5bf db1c 40ac b698 095ba3b18578: 6-11.3
EMMO 967080e5 2f42 4eb2 a3a9 c58143e835f9: The difference in electric potential between two points.
EMMO fe015383 afb3 44a6 ae86 043628697aa2: https://doi.org/10.1351/goldbook.V06635
EMMO fe015383 afb3 44a6 ae86 043628697aa2: https://doi.org/10.1351/goldbook.A00424

IonizationEnergy
type: Class
comment: Difference between energy of an electron at rest at infinity and a certain energy level which is the energy of an electron in the interior of a substance.
EMMO 1f1b164d ec6a 4faa 8d5e 88bda62316cc: https://qudt.org/vocab/quantitykind/IonizationEnergy
EMMO 26bf1bef d192 4da6 b0eb d2209698fb54: https://www.wikidata.org/wiki/Q483769
EMMO 50c298c2 55a2 4068 b3ac 4e948c33181f: https://www.electropedia.org/iev/iev.nsf/display
EMMO 8de5d5bf db1c 40ac b698 095ba3b18578: 12-24.2
EMMO 967080e5 2f42 4eb2 a3a9 c58143e835f9: Difference between energy of an electron at rest at infinity and a certain energy level which is the energy of an electron in the interior of a substance.
EMMO fe015383 afb3 44a6 ae86 043628697aa2: https://doi.org/10.1351/goldbook.I03199

Energy
type: Class
subclass of: Restriction
comment: A property of objects which can be transferred to other objects or converted into different forms.
comment: Energy is often defined as "ability of a system to perform work", but it might be misleading since is not necessarily available to do work.
EMMO 1f1b164d ec6a 4faa 8d5e 88bda62316cc: http://qudt.org/vocab/quantitykind/Energy
EMMO 8de5d5bf db1c 40ac b698 095ba3b18578: 5-20-1
EMMO 967080e5 2f42 4eb2 a3a9 c58143e835f9: A property of objects which can be transferred to other objects or converted into different forms.
EMMO fe015383 afb3 44a6 ae86 043628697aa2: https://doi.org/10.1351/goldbook.E02101

CondensedMatterPhysicsQuantity
type: Class
comment: Quantities categorised according to ISO 80000-12.
EMMO 967080e5 2f42 4eb2 a3a9 c58143e835f9: Quantities categorised according to ISO 80000-12.

TemperaturePressurePerTimeUnit
type: Class
subclass of: Restriction
  has value: T-3 L-1 M+1 I0 Θ+1 N0 J0
comment: The class of units with dimensionality 'TemperaturePressurePerTime'.
EMMO 967080e5 2f42 4eb2 a3a9 c58143e835f9: The class of units with dimensionality 'TemperaturePressurePerTime'.

SIDimensionalUnit
type: Class
comment: Dimensional unit with its physical dimensionality described accortind to the International System of Units (SI).
comment: In SI are the physical dimensions of the base quantities time (T), length (L), mass (M), electric current (I), thermodynamic temperature (Θ), amount of substance (N) and luminous intensity (J). In general the dimension of any quantity Q is written in the form of a dimensional product, dim Q = T^α L^β M^γ I^δ Θ^ε N^ζ J^η where the exponents α, β, γ, δ, ε, ζ and η, which are generally small integers, which can be positive, negative, or zero, are called the dimensional exponents. -- SI brouchure The SI dimensional units are equivalent to dimensional strings that uniquely defines their dimensionality by specifying the values of the coefficients α, β, γ, δ, ε, ζ and η. A dimensional string is a space-separated string of the physical dimension symbols followed by the value of the exponent (including it sign). They should always match the following regular expression: ^T([+-][1-9]|0) L([+-][1-9]|0) M([+-][1-9]|0) I([+-][1-9]|0) Θ([+-][1-9]|0) N([+-][1-9]|0) J([+-][1-9]|0)$ Examples of correspondance between dimensional units and their dimensional units are: - AmountOfSubstanceUnit <=> "T0 L0 M0 I0 Θ0 N+1 J0" - TimeUnit <=> "T+1 L0 M0 I0 Θ0 N0 J0" - ElectricCurrentDensityUnit <=> "T0 L-2 M0 I+1 Θ0 N0 J0"
EMMO 967080e5 2f42 4eb2 a3a9 c58143e835f9: Dimensional unit with its physical dimensionality described accortind to the International System of Units (SI).
EMMO c7b62dd7 063a 4c2a 8504 42f7264ba83f: In SI are the physical dimensions of the base quantities time (T), length (L), mass (M), electric current (I), thermodynamic temperature (Θ), amount of substance (N) and luminous intensity (J). In general the dimension of any quantity Q is written in the form of a dimensional product, dim Q = T^α L^β M^γ I^δ Θ^ε N^ζ J^η where the exponents α, β, γ, δ, ε, ζ and η, which are generally small integers, which can be positive, negative, or zero, are called the dimensional exponents. -- SI brouchure The SI dimensional units are equivalent to dimensional strings that uniquely defines their dimensionality by specifying the values of the coefficients α, β, γ, δ, ε, ζ and η. A dimensional string is a space-separated string of the physical dimension symbols followed by the value of the exponent (including it sign). They should always match the following regular expression: ^T([+-][1-9]|0) L([+-][1-9]|0) M([+-][1-9]|0) I([+-][1-9]|0) Θ([+-][1-9]|0) N([+-][1-9]|0) J([+-][1-9]|0)$ Examples of correspondance between dimensional units and their dimensional units are: - AmountOfSubstanceUnit <=> "T0 L0 M0 I0 Θ0 N+1 J0" - TimeUnit <=> "T+1 L0 M0 I0 Θ0 N0 J0" - ElectricCurrentDensityUnit <=> "T0 L-2 M0 I+1 Θ0 N0 J0"

Hyperon
type: Class
subclass of: Restriction
comment: A baryon containing one or more strange quarks, but no charm, bottom, or top quark.
comment: This form of matter may exist in a stable form within the core of some neutron stars.
EMMO 967080e5 2f42 4eb2 a3a9 c58143e835f9: A baryon containing one or more strange quarks, but no charm, bottom, or top quark.
EMMO c7b62dd7 063a 4c2a 8504 42f7264ba83f: This form of matter may exist in a stable form within the core of some neutron stars.
EMMO c84c6752 6d64 48cc 9500 e54a3c34898d: https://en.wikipedia.org/wiki/Hyperon

Baryon
type: Class
subclass of: Restriction
comment: Subatomic particle which contains an odd number of valence quarks, at least 3.
EMMO 967080e5 2f42 4eb2 a3a9 c58143e835f9: Subatomic particle which contains an odd number of valence quarks, at least 3.
EMMO c84c6752 6d64 48cc 9500 e54a3c34898d: https://en.wikipedia.org/wiki/Baryon

Redundant
type: Class
comment: Redundant(x) ≡ ∃φ[φ(x) ∧ ∃yRP⟨φ⟩(y, x)]
comment: The superclass for all classes of entities that have parts of the same type of the whole.
alternative label: NonMaximal
example: A sufficently large volume of liquid water has parts of the same type.
example: An object A which is classified as water-fluid possesses a proper part B which is water itself if the lenght scale of the B is larger than the water intermolecular distance keeping it in the continuum range. In this sense, A is redundant. If A is a water-fluid so small that its every proper part is no more a continuum object (i.e. no more a fluid), then A is fundamental.
EMMO 70fe84ff 99b6 4206 a9fc 9a8931836d84: Redundant(x) ≡ ∃φ[φ(x) ∧ ∃yRP⟨φ⟩(y, x)]
EMMO 967080e5 2f42 4eb2 a3a9 c58143e835f9: The superclass for all classes of entities that have parts of the same type of the whole.

Icon
type: Class
subclass of: Restriction
comment: A sign that stands for an object by resembling or imitating it, in shape, function or by sharing a similar logical structure.
comment: If object and sign belongs to the same class, then the sign is fuctional, diagrammatic and resemblance. For example, when a Boeing 747 is used as a sign for another Boeing 747.
alternative label: Model
alternative label: Simulacrum
example: A picture that reproduces the aspect of a person.
example: An equation that reproduces the logical connection of the properties of a physical entity.
EMMO 8a137e9f 579c 4e28 baca e8980eb0c3db: EquivalentTo: AnalogicalIcon or ResemblanceIcon or FunctionalIcon
EMMO 967080e5 2f42 4eb2 a3a9 c58143e835f9: A sign that stands for an object by resembling or imitating it, in shape, function or by sharing a similar logical structure.
EMMO c7b62dd7 063a 4c2a 8504 42f7264ba83f: If object and sign belongs to the same class, then the sign is fuctional, diagrammatic and resemblance. For example, when a Boeing 747 is used as a sign for another Boeing 747.
EMMO c7b62dd7 063a 4c2a 8504 42f7264ba83f: In Peirce semiotics three subtypes of icon are possible: (a) the image, which depends on a simple quality (e.g. picture) (b) the diagram, whose internal relations, mainly dyadic or so taken, represent by analogy the relations in something (e.g. math formula, geometric flowchart) (c) the metaphor, which represents the representative character of a sign by representing a parallelism in something else [Wikipedia]

SignByReferent
type: Class
comment: Sign classified by how the sign stands for its reference object.
EMMO 967080e5 2f42 4eb2 a3a9 c58143e835f9: Sign classified by how the sign stands for its reference object.

InorganicCompound
type: Class

ChemicalCompound
type: Class
disjoint union of:
  rest:
    rest: nil
comment: A chemical substance composed of many identical molecules (or molecular entities) composed of atoms from more than one element held together by chemical bonds.
EMMO 967080e5 2f42 4eb2 a3a9 c58143e835f9: A chemical substance composed of many identical molecules (or molecular entities) composed of atoms from more than one element held together by chemical bonds.
EMMO c84c6752 6d64 48cc 9500 e54a3c34898d: https://en.wikipedia.org/wiki/Chemical_compound

DiscreteData
type: Class
comment: A discrete schema may be based on a continuum material basis that is filtered according to its variations. For example, a continuous voltage based signal can be considered 1 or 0 according to some threshold. Discrete does not mean that the material basis is discrete, but that the data are encoded according to such step-based rules.
comment: Data whose variations are decoded according to a discrete schema.
example: A text is a collection of discrete symbols. A compact disc is designed to host discrete states in the form of pits and lands.
EMMO 967080e5 2f42 4eb2 a3a9 c58143e835f9: Data whose variations are decoded according to a discrete schema.
EMMO c7b62dd7 063a 4c2a 8504 42f7264ba83f: A discrete schema may be based on a continuum material basis that is filtered according to its variations. For example, a continuous voltage based signal can be considered 1 or 0 according to some threshold. Discrete does not mean that the material basis is discrete, but that the data are encoded according to such step-based rules.

DataByDiscretness
type: Class

KelvinMetrePerWatt
type: Class
subclass of: Restriction
  has value: 1.0
subclass of: Restriction
  has value: 0.0
comment: product of the SI base unit kelvin and the SI base unit metre divided by the derived SI unit watt -- QUDT
alternative label: Kelvin Metre Per Watt
EMMO 1f1b164d ec6a 4faa 8d5e 88bda62316cc: http://qudt.org/vocab/unit/K-M-PER-W
EMMO 1f1b164d ec6a 4faa 8d5e 88bda62316cc: http://qudt.org/vocab/unit/M-K-PER-W
EMMO 33ae2d07 5526 4555 a0b4 8f4c031b5652: K.m.W-1
EMMO 7f1dec83 d85e 4e1b b7bd c9442d4f5a64: K⋅m/W
EMMO 967080e5 2f42 4eb2 a3a9 c58143e835f9: product of the SI base unit kelvin and the SI base unit metre divided by the derived SI unit watt -- QUDT

ThermalResistivityUnit
type: Class
subclass of: Restriction
  has value: T+3 L-1 M-1 I0 Θ+1 N0 J0
comment: The class of units with dimensionality 'ThermalResistivity'.
EMMO 967080e5 2f42 4eb2 a3a9 c58143e835f9: The class of units with dimensionality 'ThermalResistivity'.

WeberMetre
type: Class
subclass of: Restriction
  has value: 1.0
subclass of: Restriction
  has value: 0.0
comment: Weber metre.
EMMO 1f1b164d ec6a 4faa 8d5e 88bda62316cc: http://qudt.org/vocab/unit/WB-M
EMMO 33ae2d07 5526 4555 a0b4 8f4c031b5652: Wb.m
EMMO 7f1dec83 d85e 4e1b b7bd c9442d4f5a64: Wb⋅m
EMMO 967080e5 2f42 4eb2 a3a9 c58143e835f9: Weber metre.

NewtonSquareMetrePerAmpereUnit
type: Class
subclass of: Restriction
  has value: T-2 L+3 M+1 I-1 Θ+1 N0 J0
comment: The class of units with dimensionality 'NewtonSquareMetrePerAmpere'.
EMMO 967080e5 2f42 4eb2 a3a9 c58143e835f9: The class of units with dimensionality 'NewtonSquareMetrePerAmpere'.

AreaPerAmountUnit
type: Class
subclass of: Restriction
  has value: T0 L+2 M0 I0 Θ0 N-1 J0
comment: The class of units with dimensionality 'AreaPerAmount'.
EMMO 967080e5 2f42 4eb2 a3a9 c58143e835f9: The class of units with dimensionality 'AreaPerAmount'.

FermiAnglularWaveNumber
type: Class
comment: Angular wavenumber of electrons in states on the Fermi sphere.
alternative label: FermiAnglularRepetency
EMMO 1f1b164d ec6a 4faa 8d5e 88bda62316cc: https://qudt.org/vocab/quantitykind/FermiAngularWavenumber
EMMO 26bf1bef d192 4da6 b0eb d2209698fb54: https://www.wikidata.org/wiki/Q105554303
EMMO 8de5d5bf db1c 40ac b698 095ba3b18578: 12-9.2
EMMO 967080e5 2f42 4eb2 a3a9 c58143e835f9: Angular wavenumber of electrons in states on the Fermi sphere.

AngularWavenumber
type: Class
comment: Magnitude of the wave vector.
alternative label: AngularRepetency
EMMO 1f1b164d ec6a 4faa 8d5e 88bda62316cc: https://qudt.org/vocab/quantitykind/AngularWavenumber
EMMO 26bf1bef d192 4da6 b0eb d2209698fb54: https://www.wikidata.org/wiki/Q30338487
EMMO 50c298c2 55a2 4068 b3ac 4e948c33181f: https://www.electropedia.org/iev/iev.nsf/display
EMMO 8de5d5bf db1c 40ac b698 095ba3b18578: 3-22
EMMO 967080e5 2f42 4eb2 a3a9 c58143e835f9: Magnitude of the wave vector.

PerMetreNanoMetre
type: Class
subclass of: Restriction
  has value: 1000000000.0
subclass of: Restriction
  has value: 0.0
comment: Per metre and nanometre.
alternative label: ReciprocalMetreNanoMetre
EMMO 1f1b164d ec6a 4faa 8d5e 88bda62316cc: http://qudt.org/vocab/unit/PER-M-NanoM
EMMO 33ae2d07 5526 4555 a0b4 8f4c031b5652: m-1.nm-1
EMMO 7f1dec83 d85e 4e1b b7bd c9442d4f5a64: /(m⋅nm)
EMMO 967080e5 2f42 4eb2 a3a9 c58143e835f9: Per metre and nanometre.

PerAreaUnit
type: Class
subclass of: Restriction
  has value: T0 L-2 M0 I0 Θ0 N0 J0
comment: The class of units with dimensionality 'PerArea'.
EMMO 967080e5 2f42 4eb2 a3a9 c58143e835f9: The class of units with dimensionality 'PerArea'.

SINonCoherentDerivedUnit
type: Class
comment: A derived unit whos numerical factor in front of the product of base units is NOT equal to one.
example: cm/s
EMMO 967080e5 2f42 4eb2 a3a9 c58143e835f9: A derived unit whos numerical factor in front of the product of base units is NOT equal to one.

KiloWeberPerMetre
type: Class
subclass of: Restriction
  some values from: WeberPerMetre
subclass of: Restriction
  has value: 1000.0
subclass of: Restriction
  has value: 0.0
comment: 1 000-fold of the SI derived unit weber divided by the SI base unit metre -- QUDT
alternative label: Kiloweber Per Metre
EMMO 1f1b164d ec6a 4faa 8d5e 88bda62316cc: http://qudt.org/vocab/unit/KiloWB-PER-M
EMMO 33ae2d07 5526 4555 a0b4 8f4c031b5652: kWb.m-1
EMMO 7f1dec83 d85e 4e1b b7bd c9442d4f5a64: kWb/m
EMMO 967080e5 2f42 4eb2 a3a9 c58143e835f9: 1 000-fold of the SI derived unit weber divided by the SI base unit metre -- QUDT

KiloPrefixedUnit
type: Class
subclass of: Restriction
subclass of: Restriction
  has value: 1000.0
comment: Superclass for all units prefixed with "kilo" (1000).
EMMO 967080e5 2f42 4eb2 a3a9 c58143e835f9: Superclass for all units prefixed with "kilo" (1000).

MagneticPotentialUnit
type: Class
subclass of: Restriction
  has value: T-2 L+1 M+1 I-1 Θ0 N0 J0
comment: The class of units with dimensionality 'MagneticPotential'.
EMMO 967080e5 2f42 4eb2 a3a9 c58143e835f9: The class of units with dimensionality 'MagneticPotential'.

Nano
type: Class
subclass of: Restriction
  has value: n
subclass of: Restriction
  has value: 1e-09
comment: SI prefix who's value is 1e-9.
EMMO 967080e5 2f42 4eb2 a3a9 c58143e835f9: SI prefix who's value is 1e-9.

SISubMultiplePrefix
type: Class
comment: SI prefix who's value is 1/N where N is a positive integer larger than 1.
EMMO 967080e5 2f42 4eb2 a3a9 c58143e835f9: SI prefix who's value is 1/N where N is a positive integer larger than 1.

NumericData
type: Class
comment: A symbolic data representing a numerical value.
EMMO 967080e5 2f42 4eb2 a3a9 c58143e835f9: A symbolic data representing a numerical value.

Manufacturer
type: Class
subclass of: Restriction
comment: A fundamental object overcrossing a manufacturing process, the intersection being the agent that participates and drives the manufacturing process.
EMMO 967080e5 2f42 4eb2 a3a9 c58143e835f9: A fundamental object overcrossing a manufacturing process, the intersection being the agent that participates and drives the manufacturing process.

ZettaCoulomb
type: Class
subclass of: Restriction
  some values from: Coulomb
subclass of: Restriction
  has value: 1e+21
subclass of: Restriction
  has value: 0.0
comment: A ZettaCoulomb is 10²¹ C. -- QUDT
EMMO 1f1b164d ec6a 4faa 8d5e 88bda62316cc: http://qudt.org/vocab/unit/ZettaC
EMMO 33ae2d07 5526 4555 a0b4 8f4c031b5652: ZC
EMMO 7f1dec83 d85e 4e1b b7bd c9442d4f5a64: ZC
EMMO 967080e5 2f42 4eb2 a3a9 c58143e835f9: A ZettaCoulomb is 10²¹ C. -- QUDT

ElectricChargeUnit
type: Class
subclass of: Restriction
  has value: T+1 L0 M0 I+1 Θ0 N0 J0
comment: The class of units with dimensionality 'ElectricCharge'.
EMMO 967080e5 2f42 4eb2 a3a9 c58143e835f9: The class of units with dimensionality 'ElectricCharge'.

ZettaPrefixedUnit
type: Class
subclass of: Restriction
subclass of: Restriction
  has value: 1e+21
comment: Superclass for all units prefixed with "zetta" (1e21).
EMMO 967080e5 2f42 4eb2 a3a9 c58143e835f9: Superclass for all units prefixed with "zetta" (1e21).

EnergyPerSquareMagneticFluxDensityUnit
type: Class
subclass of: Restriction
  has value: T+2 L+2 M-1 I+2 Θ0 N0 J0
comment: The class of units with dimensionality 'EnergyPerSquareMagneticFluxDensity'.
EMMO 967080e5 2f42 4eb2 a3a9 c58143e835f9: The class of units with dimensionality 'EnergyPerSquareMagneticFluxDensity'.

Matrix
type: Class
subclass of: Restriction
comment: 2-dimensional array who's spatial direct parts are vectors.
alternative label: 2DArray
EMMO 967080e5 2f42 4eb2 a3a9 c58143e835f9: 2-dimensional array who's spatial direct parts are vectors.

PlatinumAtom
type: Class
subclass of: Restriction
subclass of: Restriction
  has value: 195.084
subclass of: Restriction
  has value: 78
comment: Atom subclass for platinum.
EMMO 967080e5 2f42 4eb2 a3a9 c58143e835f9: Atom subclass for platinum.

AtomicAttenuationCoefficient
type: Class
subclass of: Restriction
comment: Quotient of the linear attenuation coefficient µ and the number density, n, of atoms in the substance.
EMMO 26bf1bef d192 4da6 b0eb d2209698fb54: https://www.wikidata.org/wiki/Q98592911
EMMO 8de5d5bf db1c 40ac b698 095ba3b18578: 10-52
EMMO 967080e5 2f42 4eb2 a3a9 c58143e835f9: Quotient of the linear attenuation coefficient µ and the number density, n, of atoms in the substance.

NickelAtom
type: Class
subclass of: Restriction
subclass of: Restriction
  has value: 58.6934
subclass of: Restriction
  has value: 28
comment: Atom subclass for nickel.
EMMO 967080e5 2f42 4eb2 a3a9 c58143e835f9: Atom subclass for nickel.

PhysicsMathematicalComputation
type: Class
comment: A functional icon that imitates the behaviour of the object through mathematical evaluations of some mathematical construct.
comment: The equation that describes the velocity of a uniform accelerated body v = v0 + a*t is a functional icon. In general every analitical solution of a mathematical model can be considered an icon. A functional icon expresses its similarity with the object when is part of a process the makes it imitate the behavior of the object. In the case of v = v0 + a*t, plotting the velocity over time or listing their values at certain instants is when the icon expresses it functionality.
EMMO 967080e5 2f42 4eb2 a3a9 c58143e835f9: A functional icon that imitates the behaviour of the object through mathematical evaluations of some mathematical construct.
EMMO c7b62dd7 063a 4c2a 8504 42f7264ba83f: The equation that describes the velocity of a uniform accelerated body v = v0 + a*t is a functional icon. In general every analitical solution of a mathematical model can be considered an icon. A functional icon expresses its similarity with the object when is part of a process the makes it imitate the behavior of the object. In the case of v = v0 + a*t, plotting the velocity over time or listing their values at certain instants is when the icon expresses it functionality.

FunctionalIcon
type: Class
comment: An icon that focusing WHAT the object does.
comment: An icon that imitates one representative character of the object. It share external similarities with the object, but not necessarily the same internal logical structure.
example: A data based model is only a functional icon, since it provide the same relations between the properties of the object (e.g., it can predict some properties as function of others) but is not considering the internal mechanisms (i.e., it can ignore the physics).
example: A guinea pig.
EMMO 967080e5 2f42 4eb2 a3a9 c58143e835f9: An icon that imitates one representative character of the object. It share external similarities with the object, but not necessarily the same internal logical structure.
EMMO c7b62dd7 063a 4c2a 8504 42f7264ba83f: An icon that focusing WHAT the object does.
EMMO c7b62dd7 063a 4c2a 8504 42f7264ba83f: This subclass of icon inspired by Peirceian category (c) the metaphor, which represents the representative character of a sign by representing a parallelism in something else.

Computation
type: Class
comment: A procedure that deals with quantitative symbols (i.e. symbols associated with a quantitative oriented language).
example: A mathematician that calculates 2+2. A computation machine that calculate the average value of a dataset.
EMMO 967080e5 2f42 4eb2 a3a9 c58143e835f9: A procedure that deals with quantitative symbols (i.e. symbols associated with a quantitative oriented language).

KiloVoltPerMetre
type: Class
subclass of: Restriction
  some values from: VoltPerMetre
subclass of: Restriction
  has value: 1000.0
subclass of: Restriction
  has value: 0.0
comment: 1 000-fold of the SI derived unit volt divided by the SI base unit metre -- QUDT
alternative label: Kilovolt Per Metre
EMMO 1f1b164d ec6a 4faa 8d5e 88bda62316cc: http://qudt.org/vocab/unit/KiloV-PER-M
EMMO 33ae2d07 5526 4555 a0b4 8f4c031b5652: kV.m-1
EMMO 7f1dec83 d85e 4e1b b7bd c9442d4f5a64: kV/m
EMMO 967080e5 2f42 4eb2 a3a9 c58143e835f9: 1 000-fold of the SI derived unit volt divided by the SI base unit metre -- QUDT

ElectricFieldStrengthUnit
type: Class
subclass of: Restriction
  has value: T-3 L+1 M+1 I-1 Θ0 N0 J0
comment: The class of units with dimensionality 'ElectricFieldStrength'.
EMMO 967080e5 2f42 4eb2 a3a9 c58143e835f9: The class of units with dimensionality 'ElectricFieldStrength'.

RadiusOfCurvature
type: Class
comment: Radius of the osculating circle of a planar curve at a particular point of the curve.
EMMO 50c298c2 55a2 4068 b3ac 4e948c33181f: https://www.electropedia.org/iev/iev.nsf/display
EMMO 6dd685dd 1895 46e4 b227 be9f7d643c25: https://dbpedia.org/page/Radius_of_curvature
EMMO 8de5d5bf db1c 40ac b698 095ba3b18578: 3-1.12
EMMO 967080e5 2f42 4eb2 a3a9 c58143e835f9: Radius of the osculating circle of a planar curve at a particular point of the curve.
EMMO c84c6752 6d64 48cc 9500 e54a3c34898d: https://en.wikipedia.org/wiki/Radius_of_curvature

Radius
type: Class
comment: Distance from the centre of a circle to the circumference.
EMMO 1f1b164d ec6a 4faa 8d5e 88bda62316cc: https://qudt.org/vocab/quantitykind/Radius
EMMO 26bf1bef d192 4da6 b0eb d2209698fb54: https://www.wikidata.org/wiki/Q173817
EMMO 50c298c2 55a2 4068 b3ac 4e948c33181f: https://www.electropedia.org/iev/iev.nsf/display
EMMO 6dd685dd 1895 46e4 b227 be9f7d643c25: https://dbpedia.org/page/Radius
EMMO 8de5d5bf db1c 40ac b698 095ba3b18578: 3-1.6
EMMO 967080e5 2f42 4eb2 a3a9 c58143e835f9: Distance from the centre of a circle to the circumference.
EMMO c84c6752 6d64 48cc 9500 e54a3c34898d: https://en.wikipedia.org/wiki/Radius

PotentialEnergy
type: Class
comment: The energy possessed by a body by virtue of its position or orientation in a potential field.
EMMO 1f1b164d ec6a 4faa 8d5e 88bda62316cc: http://qudt.org/vocab/quantitykind/PotentialEnergy
EMMO 8de5d5bf db1c 40ac b698 095ba3b18578: 4-28.1
EMMO 967080e5 2f42 4eb2 a3a9 c58143e835f9: The energy possessed by a body by virtue of its position or orientation in a potential field.
EMMO fe015383 afb3 44a6 ae86 043628697aa2: https://doi.org/10.1351/goldbook.P04778

SquareMicroMetre
type: Class
subclass of: Restriction
  has value: 1e-12
subclass of: Restriction
  has value: 0.0
comment: 0.000000000001-fold of the power of the SI base unit metre with the exponent 2 -- QUDT
alternative label: Square Micrometre
EMMO 1f1b164d ec6a 4faa 8d5e 88bda62316cc: http://qudt.org/vocab/unit/MicroM2
EMMO 33ae2d07 5526 4555 a0b4 8f4c031b5652: um2
EMMO 7f1dec83 d85e 4e1b b7bd c9442d4f5a64: μm²
EMMO 967080e5 2f42 4eb2 a3a9 c58143e835f9: 0.000000000001-fold of the power of the SI base unit metre with the exponent 2 -- QUDT

AreaUnit
type: Class
subclass of: Restriction
  has value: T0 L+2 M0 I0 Θ0 N0 J0
comment: The class of units with dimensionality 'Area'.
EMMO 967080e5 2f42 4eb2 a3a9 c58143e835f9: The class of units with dimensionality 'Area'.

PlutoniumAtom
type: Class
subclass of: Restriction
subclass of: Restriction
  has value: 244.06421
subclass of: Restriction
  has value: 94
comment: Atom subclass for plutonium.
EMMO 967080e5 2f42 4eb2 a3a9 c58143e835f9: Atom subclass for plutonium.

YottaPrefixedUnit
type: Class
subclass of: Restriction
subclass of: Restriction
  has value: 1e+24
comment: Superclass for all units prefixed with "yotta" (1e24).
EMMO 967080e5 2f42 4eb2 a3a9 c58143e835f9: Superclass for all units prefixed with "yotta" (1e24).

TemperaturePerSquareTimeUnit
type: Class
subclass of: Restriction
  has value: T-2 L0 M0 I0 Θ+1 N0 J0
comment: The class of units with dimensionality 'TemperaturePerSquareTime'.
EMMO 967080e5 2f42 4eb2 a3a9 c58143e835f9: The class of units with dimensionality 'TemperaturePerSquareTime'.

MegaPascalPerKelvin
type: Class
subclass of: Restriction
  some values from: PascalPerKelvin
subclass of: Restriction
  has value: 1000000.0
subclass of: Restriction
  has value: 0.0
comment: 1,000,000-fold of the SI derived unit pascal divided by the SI base unit kelvin -- QUDT
alternative label: Megapascal Per Kelvin
EMMO 1f1b164d ec6a 4faa 8d5e 88bda62316cc: http://qudt.org/vocab/unit/MegaPA-PER-K
EMMO 33ae2d07 5526 4555 a0b4 8f4c031b5652: MPa.K-1
EMMO 7f1dec83 d85e 4e1b b7bd c9442d4f5a64: MPa/K
EMMO 967080e5 2f42 4eb2 a3a9 c58143e835f9: 1,000,000-fold of the SI derived unit pascal divided by the SI base unit kelvin -- QUDT

PressurePerTemperatureUnit
type: Class
subclass of: Restriction
  has value: T-2 L-1 M+1 I0 Θ-1 N0 J0
comment: The class of units with dimensionality 'PressurePerTemperature'.
EMMO 967080e5 2f42 4eb2 a3a9 c58143e835f9: The class of units with dimensionality 'PressurePerTemperature'.

MegaPrefixedUnit
type: Class
subclass of: Restriction
subclass of: Restriction
  has value: 1000000.0
comment: Superclass for all units prefixed with "mega" (1e6).
EMMO 967080e5 2f42 4eb2 a3a9 c58143e835f9: Superclass for all units prefixed with "mega" (1e6).

CentiMetre
type: Class
subclass of: Restriction
  some values from: Metre
subclass of: Restriction
  has value: 0.01
subclass of: Restriction
  has value: 0.0
comment: A centimetre is a unit of length in the metric system, equal to one hundredth of a metre, which is the SI base unit of length. Centi is the SI prefix for a factor of 10. The centimetre is the base unit of length in the now deprecated centimetre-gram-second (CGS) system of units. -- QUDT
EMMO 1f1b164d ec6a 4faa 8d5e 88bda62316cc: http://qudt.org/vocab/unit/CentiM
EMMO 33ae2d07 5526 4555 a0b4 8f4c031b5652: cm
EMMO 7f1dec83 d85e 4e1b b7bd c9442d4f5a64: cm
EMMO 967080e5 2f42 4eb2 a3a9 c58143e835f9: A centimetre is a unit of length in the metric system, equal to one hundredth of a metre, which is the SI base unit of length. Centi is the SI prefix for a factor of 10. The centimetre is the base unit of length in the now deprecated centimetre-gram-second (CGS) system of units. -- QUDT
EMMO c84c6752 6d64 48cc 9500 e54a3c34898d: http://en.wikipedia.org/wiki/Centimetre

LengthUnit
type: Class
subclass of: Restriction
  has value: T0 L+1 M0 I0 Θ0 N0 J0
comment: The class of units with dimensionality 'Length'.
EMMO 967080e5 2f42 4eb2 a3a9 c58143e835f9: The class of units with dimensionality 'Length'.

CentiPrefixedUnit
type: Class
subclass of: Restriction
subclass of: Restriction
  has value: 0.01
comment: Superclass for all units prefixed with "centi" (0.01).
EMMO 967080e5 2f42 4eb2 a3a9 c58143e835f9: Superclass for all units prefixed with "centi" (0.01).

LutetiumSymbol
type: Class
subclass of: Restriction
  has value: Lu
comment: The symbol that stands for the lutetium atom.
EMMO 967080e5 2f42 4eb2 a3a9 c58143e835f9: The symbol that stands for the lutetium atom.

ThermalDiffusivity
type: Class
subclass of: Restriction
comment: Quotient of thermal conductivity and the product of mass density and specific heat capacity.
alternative label: ThermalDiffusionCoefficient
EMMO 1f1b164d ec6a 4faa 8d5e 88bda62316cc: https://qudt.org/vocab/quantitykind/ThermalDiffusivity
EMMO 26bf1bef d192 4da6 b0eb d2209698fb54: https://www.wikidata.org/wiki/Q3381809
EMMO 50c298c2 55a2 4068 b3ac 4e948c33181f: https://www.electropedia.org/iev/iev.nsf/display
EMMO 8de5d5bf db1c 40ac b698 095ba3b18578: 5-14
EMMO 967080e5 2f42 4eb2 a3a9 c58143e835f9: Quotient of thermal conductivity and the product of mass density and specific heat capacity.

SymbolicConstruct
type: Class
comment: A symbolic entity made of other symbolic entities according to a specific spatial configuration.
comment: This class collects individuals that represents arrangements of strings, or other symbolic compositions, without any particular predefined arrangement schema.
EMMO 8a137e9f 579c 4e28 baca e8980eb0c3db: SubClassOf: hasProperPart some Symbolic
EMMO 967080e5 2f42 4eb2 a3a9 c58143e835f9: A symbolic entity made of other symbolic entities according to a specific spatial configuration.
EMMO c7b62dd7 063a 4c2a 8504 42f7264ba83f: This class collects individuals that represents arrangements of strings, or other symbolic compositions, without any particular predefined arrangement schema.

SymbolicByStructure
type: Class

MolarHelmholtzEnergy
type: Class
comment: Helmholtz energy per amount of substance.
EMMO 26bf1bef d192 4da6 b0eb d2209698fb54: https://www.wikidata.org/wiki/Q88862986
EMMO 8de5d5bf db1c 40ac b698 095ba3b18578: 9-6.3
EMMO 967080e5 2f42 4eb2 a3a9 c58143e835f9: Helmholtz energy per amount of substance.

PhysioChemicalQuantity
type: Class
comment: Quantities categorised according to ISO 80000-9.
EMMO 967080e5 2f42 4eb2 a3a9 c58143e835f9: Quantities categorised according to ISO 80000-9.

MolarEnergy
type: Class
subclass of: Restriction
comment: Energy per amount of substance.
EMMO 1f1b164d ec6a 4faa 8d5e 88bda62316cc: https://qudt.org/vocab/quantitykind/MolarEnergy
EMMO 26bf1bef d192 4da6 b0eb d2209698fb54: https://www.wikidata.org/wiki/Q69427512
EMMO 967080e5 2f42 4eb2 a3a9 c58143e835f9: Energy per amount of substance.

OsmiumSymbol
type: Class
subclass of: Restriction
  has value: Os
comment: The symbol that stands for the osmium atom.
EMMO 967080e5 2f42 4eb2 a3a9 c58143e835f9: The symbol that stands for the osmium atom.

PhysicalParticleByBond
type: Class

PhysicalParticle
type: Class
comment: A well defined physical entity, elementary or composite, usually treated as a singular unit, that is found at scales spanning from the elementary particles to molecules, as fundamental constituents of larger scale substances (as the etymology of "particle" suggests).
comment: The scope of the physical particle definition goes from the elementary particles to molecules, as fundamental constituents of substances.
comment: The union of hadron and lepton, or fermion and bosons.
alternative label: Particle
EMMO 70fe84ff 99b6 4206 a9fc 9a8931836d84: The union of hadron and lepton, or fermion and bosons.
EMMO 967080e5 2f42 4eb2 a3a9 c58143e835f9: A well defined physical entity, elementary or composite, usually treated as a singular unit, that is found at scales spanning from the elementary particles to molecules, as fundamental constituents of larger scale substances (as the etymology of "particle" suggests).
EMMO c7b62dd7 063a 4c2a 8504 42f7264ba83f: The scope of the physical particle definition goes from the elementary particles to molecules, as fundamental constituents of substances.

IntermidiateTile
type: Class
comment: A tile that has next and is next of other tiles within the same tessellation.
EMMO 967080e5 2f42 4eb2 a3a9 c58143e835f9: A tile that has next and is next of other tiles within the same tessellation.

SpatioTemporalTileByPosition
type: Class
comment: The superclass for tiles categorized accordingly to their location within a tessellation in terms of causal source, sink or intermediary.
EMMO 967080e5 2f42 4eb2 a3a9 c58143e835f9: The superclass for tiles categorized accordingly to their location within a tessellation in terms of causal source, sink or intermediary.

MilliGramPerCubicMetrePerSecond
type: Class
subclass of: Restriction
  has value: 1e-06
subclass of: Restriction
  has value: 0.0
alternative label: Milligrams per cubic metre per second
EMMO 1f1b164d ec6a 4faa 8d5e 88bda62316cc: http://qudt.org/vocab/unit/MilliGM-PER-M3-SEC
EMMO 33ae2d07 5526 4555 a0b4 8f4c031b5652: mg.m-3.s-1
EMMO 7f1dec83 d85e 4e1b b7bd c9442d4f5a64: mg/(m³⋅s)

MassPerVolumeTimeUnit
type: Class
subclass of: Restriction
  has value: T-1 L-3 M+1 I0 Θ0 N0 J0
comment: The class of units with dimensionality 'MassPerVolumeTime'.
EMMO 967080e5 2f42 4eb2 a3a9 c58143e835f9: The class of units with dimensionality 'MassPerVolumeTime'.

MoleKelvin
type: Class
subclass of: Restriction
  has value: 1.0
subclass of: Restriction
  has value: 0.0
comment: Mole Kelvin is a unit for `Temperature Amount Of Substance` expressed as mol-K. -- QUDT
alternative label: Mole Kelvin
EMMO 1f1b164d ec6a 4faa 8d5e 88bda62316cc: http://qudt.org/vocab/unit/MOL-K
EMMO 33ae2d07 5526 4555 a0b4 8f4c031b5652: mol.K
EMMO 7f1dec83 d85e 4e1b b7bd c9442d4f5a64: mol⋅K
EMMO 967080e5 2f42 4eb2 a3a9 c58143e835f9: Mole Kelvin is a unit for `Temperature Amount Of Substance` expressed as mol-K. -- QUDT

AmountTemperatureUnit
type: Class
subclass of: Restriction
  has value: T0 L0 M0 I0 Θ+1 N+1 J0
comment: The class of units with dimensionality 'AmountTemperature'.
EMMO 967080e5 2f42 4eb2 a3a9 c58143e835f9: The class of units with dimensionality 'AmountTemperature'.

Resolving
type: Class
comment: A semiosis where the interpreter perceives a sign, that generates the interpretant as interpreter's internal representation. Than the interpretant is resolved by the interpreter by identifying the referent, i.e. the entity for which the sign stands for according to the interpreter understanding.
example: Someone says: "Ketchup." (sign). I (interpreter) hear that, elaborate internally the perception by creating an internal representation (interpretant), and then reach for the ketchup bottle (referent).
EMMO 967080e5 2f42 4eb2 a3a9 c58143e835f9: A semiosis where the interpreter perceives a sign, that generates the interpretant as interpreter's internal representation. Than the interpretant is resolved by the interpreter by identifying the referent, i.e. the entity for which the sign stands for according to the interpreter understanding.

FullSemiosis
type: Class
comment: A semiosis where the triangle of relations is completely developed.
EMMO 967080e5 2f42 4eb2 a3a9 c58143e835f9: A semiosis where the triangle of relations is completely developed.

Weber
type: Class
subclass of: Restriction
  has value: Wb
comment: SI unit for magnetic flux.
comment: The SI unit of magnetic flux. "Flux" is the rate (per unit of time) at which something crosses a surface perpendicular to the flow. The weber is a large unit, equal to 10⁸ maxwells, and practical fluxes are usually fractions of one weber. The weber is the magnetic flux which, linking a circuit of one turn, would produce in it an electromotive force of 1 volt if it were reduced to zero at a uniform rate in 1 second. In SI base units, the dimensions of the weber are (kg·m²)/(s²·A). The weber is commonly expressed in terms of other derived units as the Tesla-square meter (T·m²), volt-seconds (V·s), or joules per ampere (J/A).
EMMO 0b1cbe60 d380 4787 b92e be26bdacf2c2: WEB
EMMO 1f1b164d ec6a 4faa 8d5e 88bda62316cc: http://qudt.org/vocab/unit/WB
EMMO 33ae2d07 5526 4555 a0b4 8f4c031b5652: Wb
EMMO 6dd685dd 1895 46e4 b227 be9f7d643c25: http://dbpedia.org/resource/Weber
EMMO 967080e5 2f42 4eb2 a3a9 c58143e835f9: SI unit for magnetic flux.
EMMO c7b62dd7 063a 4c2a 8504 42f7264ba83f: The SI unit of magnetic flux. "Flux" is the rate (per unit of time) at which something crosses a surface perpendicular to the flow. The weber is a large unit, equal to 10⁸ maxwells, and practical fluxes are usually fractions of one weber. The weber is the magnetic flux which, linking a circuit of one turn, would produce in it an electromotive force of 1 volt if it were reduced to zero at a uniform rate in 1 second. In SI base units, the dimensions of the weber are (kg·m²)/(s²·A). The weber is commonly expressed in terms of other derived units as the Tesla-square meter (T·m²), volt-seconds (V·s), or joules per ampere (J/A).
EMMO c84c6752 6d64 48cc 9500 e54a3c34898d: https://en.wikipedia.org/wiki/Weber_(unit)
EMMO fe015383 afb3 44a6 ae86 043628697aa2: https://doi.org/10.1351/goldbook.W06666

MagneticFluxUnit
type: Class
subclass of: Restriction
  has value: T-2 L+2 M+1 I-1 Θ0 N0 J0
comment: The class of units with dimensionality 'MagneticFlux'.
EMMO 967080e5 2f42 4eb2 a3a9 c58143e835f9: The class of units with dimensionality 'MagneticFlux'.

TeraHertz
type: Class
subclass of: Restriction
  some values from: Hertz
subclass of: Restriction
  has value: 1000000000000.0
subclass of: Restriction
  has value: 0.0
comment: 1 000 000 000 000-fold of the SI derived unit hertz -- QUDT
EMMO 1f1b164d ec6a 4faa 8d5e 88bda62316cc: http://qudt.org/vocab/unit/TeraHZ
EMMO 33ae2d07 5526 4555 a0b4 8f4c031b5652: THz
EMMO 7f1dec83 d85e 4e1b b7bd c9442d4f5a64: THz
EMMO 967080e5 2f42 4eb2 a3a9 c58143e835f9: 1 000 000 000 000-fold of the SI derived unit hertz -- QUDT

TeraPrefixedUnit
type: Class
subclass of: Restriction
subclass of: Restriction
  has value: 1000000000000.0
comment: Superclass for all units prefixed with "tera" (1e12).
EMMO 967080e5 2f42 4eb2 a3a9 c58143e835f9: Superclass for all units prefixed with "tera" (1e12).

FrequencyUnit
type: Class
subclass of: Restriction
  has value: T-1 L0 M0 I0 Θ0 N0 J0
comment: The class of units with dimensionality 'Frequency'.
EMMO 967080e5 2f42 4eb2 a3a9 c58143e835f9: The class of units with dimensionality 'Frequency'.

IndiumSymbol
type: Class
subclass of: Restriction
  has value: In
comment: The symbol that stands for the indium atom.
EMMO 967080e5 2f42 4eb2 a3a9 c58143e835f9: The symbol that stands for the indium atom.

MegaJoulePerKelvin
type: Class
subclass of: Restriction
  some values from: JoulePerKelvin
subclass of: Restriction
  has value: 1000000.0
subclass of: Restriction
  has value: 0.0
comment: MegaJoule Per Kelvin (MegaJ/K) is a unit in the category of Entropy. -- QUDT
alternative label: MegaJoule per Kelvin
EMMO 1f1b164d ec6a 4faa 8d5e 88bda62316cc: http://qudt.org/vocab/unit/MegaJ-PER-K
EMMO 33ae2d07 5526 4555 a0b4 8f4c031b5652: MJ.K-1
EMMO 7f1dec83 d85e 4e1b b7bd c9442d4f5a64: MJ/K
EMMO 967080e5 2f42 4eb2 a3a9 c58143e835f9: MegaJoule Per Kelvin (MegaJ/K) is a unit in the category of Entropy. -- QUDT

EntropyUnit
type: Class
subclass of: Restriction
  has value: T-2 L+2 M+1 I0 Θ-1 N0 J0
comment: The class of units with dimensionality 'Entropy'.
EMMO 967080e5 2f42 4eb2 a3a9 c58143e835f9: The class of units with dimensionality 'Entropy'.

Folding
type: Class

FormingJoin
type: Class

SingleComponentComposition
type: Class
subclass of: Restriction

CapacitanceUnit
type: Class
subclass of: Restriction
  has value: T+4 L-2 M-1 I+2 Θ0 N0 J0
comment: The class of units with dimensionality 'Capacitance'.
EMMO 967080e5 2f42 4eb2 a3a9 c58143e835f9: The class of units with dimensionality 'Capacitance'.

TerbiumSymbol
type: Class
subclass of: Restriction
  has value: Tb
comment: The symbol that stands for the terbium atom.
EMMO 967080e5 2f42 4eb2 a3a9 c58143e835f9: The symbol that stands for the terbium atom.

GramPerCubicMetre
type: Class
subclass of: Restriction
  has value: 0.001
subclass of: Restriction
  has value: 0.0
comment: 0,001-fold of the SI base unit kilogram divided by the power of the SI base unit metre with the exponent 3 -- QUDT
alternative label: Gram Per Cubic Metre
EMMO 1f1b164d ec6a 4faa 8d5e 88bda62316cc: http://qudt.org/vocab/unit/GM-PER-M3
EMMO 33ae2d07 5526 4555 a0b4 8f4c031b5652: g.m-3
EMMO 33ae2d07 5526 4555 a0b4 8f4c031b5652: g/m3
EMMO 7f1dec83 d85e 4e1b b7bd c9442d4f5a64: g/m³
EMMO 967080e5 2f42 4eb2 a3a9 c58143e835f9: 0,001-fold of the SI base unit kilogram divided by the power of the SI base unit metre with the exponent 3 -- QUDT

LightAndRadiationQuantity
type: Class
comment: Quantities categorised according to ISO 80000-7.
EMMO 967080e5 2f42 4eb2 a3a9 c58143e835f9: Quantities categorised according to ISO 80000-7.

ISO80000Categorised
type: Class

MilliMetrePerKelvin
type: Class
subclass of: Restriction
  some values from: MetrePerKelvin
subclass of: Restriction
  has value: 0.001
subclass of: Restriction
  has value: 0.0
comment: 0.001-fold of the SI base unit metre divided by the SI base unit kelvin -- QUDT
alternative label: Millimetre Per Kelvin
EMMO 1f1b164d ec6a 4faa 8d5e 88bda62316cc: http://qudt.org/vocab/unit/MilliM-PER-K
EMMO 33ae2d07 5526 4555 a0b4 8f4c031b5652: mm.K-1
EMMO 7f1dec83 d85e 4e1b b7bd c9442d4f5a64: mm/K
EMMO 967080e5 2f42 4eb2 a3a9 c58143e835f9: 0.001-fold of the SI base unit metre divided by the SI base unit kelvin -- QUDT

LengthPerTemperatureUnit
type: Class
subclass of: Restriction
  has value: T0 L+1 M0 I0 Θ-1 N0 J0
comment: The class of units with dimensionality 'LengthPerTemperature'.
EMMO 967080e5 2f42 4eb2 a3a9 c58143e835f9: The class of units with dimensionality 'LengthPerTemperature'.

Item
type: Class
comment: A world entity is direct causally self-connected if any two parts that make up the whole are direct causally connected to each other. In the EMMO, topological connectivity is based on causality. All physical objects, i.e. entities whose behaviour is explained by physics laws, are represented only by items. In other words, a physical object part is embedded in a direct causal graph that provides always a path between two of its parts. Members of a collection lack such direct causality connection, i.e. they do not constitute a physical object. Following graph theory concepts, the quantums of an item are all connected together within a network of causal relations, forming a connected causal graph. A collection is then a set of disconnected graphs.
comment: The class of individuals standing for quantum or causally self-connected world entities.
comment: The disjoint union of Particle and CausalStructure classes.
comment: The concept of self-connectivity is applied using a 4D approach. Given that, the entity made of an electron and a proton that travel, interact, and then depart from each other is an item, since we don't focus only on the beginning or the end stage but to the overall 4D entity, being the interaction the connectivity bridge between the two particles.
alternative label: CausalObject
example: A person life, an interval of a person life. The lifetime of two components, from the production in separate manufacturing lines, their being connected components in a device, including their eparation and decommissioning.
EMMO 31252f35 c767 4b97 a877 1235076c3e13: A world entity is direct causally self-connected if any two parts that make up the whole are direct causally connected to each other. In the EMMO, topological connectivity is based on causality. All physical objects, i.e. entities whose behaviour is explained by physics laws, are represented only by items. In other words, a physical object part is embedded in a direct causal graph that provides always a path between two of its parts. Members of a collection lack such direct causality connection, i.e. they do not constitute a physical object. Following graph theory concepts, the quantums of an item are all connected together within a network of causal relations, forming a connected causal graph. A collection is then a set of disconnected graphs.
EMMO 70fe84ff 99b6 4206 a9fc 9a8931836d84: The disjoint union of Particle and CausalStructure classes.
EMMO 8a137e9f 579c 4e28 baca e8980eb0c3db: EquivalentTo: CausalParticle or CausalStructure
EMMO 967080e5 2f42 4eb2 a3a9 c58143e835f9: The class of individuals standing for quantum or causally self-connected world entities.
EMMO c7b62dd7 063a 4c2a 8504 42f7264ba83f: The concept of self-connectivity is applied using a 4D approach. Given that, the entity made of an electron and a proton that travel, interact, and then depart from each other is an item, since we don't focus only on the beginning or the end stage but to the overall 4D entity, being the interaction the connectivity bridge between the two particles.

BetaDisintegrationEnergy
type: Class
comment: Sum of the maximum beta-particle kinetic energy and the recoil energy of the atom produced in a reference frame in which the emitting nucleus is at rest before its disintegration.
EMMO 26bf1bef d192 4da6 b0eb d2209698fb54: https://www.wikidata.org/wiki/Q98148340
EMMO 8de5d5bf db1c 40ac b698 095ba3b18578: 10-34
EMMO 967080e5 2f42 4eb2 a3a9 c58143e835f9: Sum of the maximum beta-particle kinetic energy and the recoil energy of the atom produced in a reference frame in which the emitting nucleus is at rest before its disintegration.

NewtonMetrePerMetrePerRadian
type: Class
subclass of: Restriction
  has value: 1.0
subclass of: Restriction
  has value: 0.0
comment: Newton metre per metre and radian.
EMMO 1f1b164d ec6a 4faa 8d5e 88bda62316cc: http://qudt.org/vocab/unit/N-M-PER-M-RAD
EMMO 7f1dec83 d85e 4e1b b7bd c9442d4f5a64: N⋅m/(m⋅rad)
EMMO 967080e5 2f42 4eb2 a3a9 c58143e835f9: Newton metre per metre and radian.

ForceUnit
type: Class
subclass of: Restriction
  has value: T-2 L+1 M+1 I0 Θ0 N0 J0
comment: The class of units with dimensionality 'Force'.
EMMO 967080e5 2f42 4eb2 a3a9 c58143e835f9: The class of units with dimensionality 'Force'.

PerPicoMetre
type: Class
subclass of: Restriction
  has value: 1000000000000.0
subclass of: Restriction
  has value: 0.0
comment: Per Picoometer Unit is a denominator unit with dimensions /pm. -- QUDT
alternative label: ReciprocalPicoMetre
EMMO 1f1b164d ec6a 4faa 8d5e 88bda62316cc: http://qudt.org/vocab/unit/PER-PicoM
EMMO 33ae2d07 5526 4555 a0b4 8f4c031b5652: /pm
EMMO 33ae2d07 5526 4555 a0b4 8f4c031b5652: pm-1
EMMO 7f1dec83 d85e 4e1b b7bd c9442d4f5a64: /pm
EMMO 967080e5 2f42 4eb2 a3a9 c58143e835f9: Per Picoometer Unit is a denominator unit with dimensions /pm. -- QUDT

ReciprocalLengthUnit
type: Class
subclass of: Restriction
  has value: T0 L-1 M0 I0 Θ0 N0 J0
comment: The class of units with dimensionality 'ReciprocalLength'.
EMMO 967080e5 2f42 4eb2 a3a9 c58143e835f9: The class of units with dimensionality 'ReciprocalLength'.

VacuumElectricPermittivity
type: Class
comment: The DBpedia definition (http://dbpedia.org/page/Vacuum_permittivity) is outdated since May 20, 2019. It is now a measured constant.
comment: The value of the absolute dielectric permittivity of classical vacuum.
alternative label: PermittivityOfVacuum
EMMO 1f1b164d ec6a 4faa 8d5e 88bda62316cc: http://qudt.org/vocab/constant/PermittivityOfVacuum
EMMO 8de5d5bf db1c 40ac b698 095ba3b18578: 6-14.1
EMMO 967080e5 2f42 4eb2 a3a9 c58143e835f9: The value of the absolute dielectric permittivity of classical vacuum.
EMMO fe015383 afb3 44a6 ae86 043628697aa2: https://doi.org/10.1351/goldbook.P04508

Permittivity
type: Class
subclass of: Restriction
comment: Measure for how the polarization of a material is affected by the application of an external electric field.
EMMO 1f1b164d ec6a 4faa 8d5e 88bda62316cc: http://qudt.org/vocab/quantitykind/Permittivity
EMMO 8de5d5bf db1c 40ac b698 095ba3b18578: 6-14.1
EMMO 8de5d5bf db1c 40ac b698 095ba3b18578: 6-14.2
EMMO 967080e5 2f42 4eb2 a3a9 c58143e835f9: Measure for how the polarization of a material is affected by the application of an external electric field.
EMMO fe015383 afb3 44a6 ae86 043628697aa2: https://doi.org/10.1351/goldbook.P04507

MeasuredConstant
type: Class
comment: For a given unit system, measured constants are physical constants that are not used to define the unit system. Hence, these constants have to be measured and will therefore be associated with an uncertainty.
EMMO 967080e5 2f42 4eb2 a3a9 c58143e835f9: For a given unit system, measured constants are physical constants that are not used to define the unit system. Hence, these constants have to be measured and will therefore be associated with an uncertainty.

FreeForming
type: Class
comment: Free forming is pressure forming with tools that do not or only partially contain the shape of the workpiece and move against each other.
comment: Non la metterei
comment: Printing forms with tools that do not or only partially contain the shape of the workpiece and move against each other. The workpiece shape is created by free or fixed relative movement between the tool and the workpiece (kinematic shape generation).

MetrologicalConstruct
type: Class
equivalent class: Class
comment: A symbolic construct used within the discipline of metrology.
EMMO 967080e5 2f42 4eb2 a3a9 c58143e835f9: A symbolic construct used within the discipline of metrology.

Metrological
type: Class
comment: A language entity used in the metrology discipline.
comment: Metrology is the science of measurement and its application and includes all theoretical and practical aspects of measurement, whatever the measurement uncertainty and field of application (VIM3 2.2)
EMMO 967080e5 2f42 4eb2 a3a9 c58143e835f9: A language entity used in the metrology discipline.
EMMO c7b62dd7 063a 4c2a 8504 42f7264ba83f: Metrology is the science of measurement and its application and includes all theoretical and practical aspects of measurement, whatever the measurement uncertainty and field of application (VIM3 2.2)

Conventional
type: Class
subclass of: Restriction
comment: A 'Sign' that stands for an 'Object' through convention, norm or habit, without any resemblance to it.
comment: In Peirce semiotics this kind of sign category is called symbol. However, since symbol is also used in formal languages, the name is changed in conventional.
EMMO 8a137e9f 579c 4e28 baca e8980eb0c3db: EquivalentTo: Uncoded or Coded
EMMO 967080e5 2f42 4eb2 a3a9 c58143e835f9: A 'Sign' that stands for an 'Object' through convention, norm or habit, without any resemblance to it.
EMMO c7b62dd7 063a 4c2a 8504 42f7264ba83f: In Peirce semiotics this kind of sign category is called symbol. However, since symbol is also used in formal languages, the name is changed in conventional.

Rotation
type: Class
comment: Number of turns.
EMMO 26bf1bef d192 4da6 b0eb d2209698fb54: https://www.wikidata.org/wiki/Q76435127
EMMO 50c298c2 55a2 4068 b3ac 4e948c33181f: https://www.electropedia.org/iev/iev.nsf/display
EMMO 8de5d5bf db1c 40ac b698 095ba3b18578: 3-14
EMMO 967080e5 2f42 4eb2 a3a9 c58143e835f9: Number of turns.
EMMO 967080e5 2f42 4eb2 a3a9 c58143e835f9: Rotation is not necessarily integer.

BohriumSymbol
type: Class
subclass of: Restriction
  has value: Bh
comment: The symbol that stands for the bohrium atom.
EMMO 967080e5 2f42 4eb2 a3a9 c58143e835f9: The symbol that stands for the bohrium atom.

Gram
type: Class
subclass of: Restriction
  has value: 0.001
subclass of: Restriction
  has value: 0.0
subclass of: Restriction
  has value: g
comment: A unit of mass in the metric system. The name comes from the Greek gramma, a small weight identified in later Roman and Byzantine times with the Latin scripulum or scruple (the English scruple is equal to about 1.3 grams). The gram was originally defined to be the mass of one cubic centimeter of pure water, but to provide precise standards it was necessary to construct physical objects of specified mass. One gram is now defined to be 1/1000 of the mass of the standard kilogram, a platinum-iridium bar carefully guarded by the International Bureau of Weights and Measures in Paris for more than a century. (The kilogram, rather than the gram, is considered the base unit of mass in the SI.) The gram is a small mass, equal to about 15.432 grains or 0.035 273 966 ounce. -- QUDT
comment: Gram is defined as one thousandth of the SI unit kilogram.
EMMO 0b1cbe60 d380 4787 b92e be26bdacf2c2: GRM
EMMO 1f1b164d ec6a 4faa 8d5e 88bda62316cc: http://qudt.org/vocab/unit/GM
EMMO 33ae2d07 5526 4555 a0b4 8f4c031b5652: g
EMMO 70fe84ff 99b6 4206 a9fc 9a8931836d84: Gram is defined as one thousandth of the SI unit kilogram.
EMMO 967080e5 2f42 4eb2 a3a9 c58143e835f9: A unit of mass in the metric system. The name comes from the Greek gramma, a small weight identified in later Roman and Byzantine times with the Latin scripulum or scruple (the English scruple is equal to about 1.3 grams). The gram was originally defined to be the mass of one cubic centimeter of pure water, but to provide precise standards it was necessary to construct physical objects of specified mass. One gram is now defined to be 1/1000 of the mass of the standard kilogram, a platinum-iridium bar carefully guarded by the International Bureau of Weights and Measures in Paris for more than a century. (The kilogram, rather than the gram, is considered the base unit of mass in the SI.) The gram is a small mass, equal to about 15.432 grains or 0.035 273 966 ounce. -- QUDT
EMMO c84c6752 6d64 48cc 9500 e54a3c34898d: https://en.wikipedia.org/wiki/Gram
EMMO fe015383 afb3 44a6 ae86 043628697aa2: https://doi.org/10.1351/goldbook.G02680

NanoSiemensPerCentiMetre
type: Class
subclass of: Restriction
  some values from: SiemensPerCentiMetre
subclass of: Restriction
  has value: 1e-07
subclass of: Restriction
  has value: 0.0
comment: 0.000000001-fold of the SI derived unit Siemens by the 0.01 fol of the SI base unit metre -- QUDT
alternative label: Nanosiemens Per Centimetre
EMMO 1f1b164d ec6a 4faa 8d5e 88bda62316cc: http://qudt.org/vocab/unit/NanoS-PER-CentiM
EMMO 33ae2d07 5526 4555 a0b4 8f4c031b5652: nS.cm-1
EMMO 7f1dec83 d85e 4e1b b7bd c9442d4f5a64: nS/cm
EMMO 967080e5 2f42 4eb2 a3a9 c58143e835f9: 0.000000001-fold of the SI derived unit Siemens by the 0.01 fol of the SI base unit metre -- QUDT

ElectricConductivityUnit
type: Class
subclass of: Restriction
  has value: T+3 L-3 M-1 I+2 Θ0 N0 J0
comment: The class of units with dimensionality 'ElectricConductivity'.
EMMO 967080e5 2f42 4eb2 a3a9 c58143e835f9: The class of units with dimensionality 'ElectricConductivity'.

NanoPrefixedUnit
type: Class
subclass of: Restriction
subclass of: Restriction
  has value: 1e-09
comment: Superclass for all units prefixed with "nano" (1e-9).
EMMO 967080e5 2f42 4eb2 a3a9 c58143e835f9: Superclass for all units prefixed with "nano" (1e-9).

ErbiumSymbol
type: Class
subclass of: Restriction
  has value: Er
comment: The symbol that stands for the erbium atom.
EMMO 967080e5 2f42 4eb2 a3a9 c58143e835f9: The symbol that stands for the erbium atom.

CausalPath
type: Class
subclass of: Restriction
  all values from: Class
comment: A causal chain is an ordered causal sequence of entities that does not host any bifurcation within itself (a chain). A chain can only be partitioned in time.
comment: A causal path is a concept almost equivalent to the concept of elementary particle in physics.
comment: The class of entities that possess a temporal structure but no spatial structure.
alternative label: CausalChain
alternative label: Elementary
example: An electron moving in time interacting with other particles.
EMMO 31252f35 c767 4b97 a877 1235076c3e13: A causal chain is an ordered causal sequence of entities that does not host any bifurcation within itself (a chain). A chain can only be partitioned in time.
EMMO 8a137e9f 579c 4e28 baca e8980eb0c3db: DisjointUnionOf: MultiParticlePath, ElementaryParticle
EMMO 967080e5 2f42 4eb2 a3a9 c58143e835f9: The class of entities that possess a temporal structure but no spatial structure.
EMMO c7b62dd7 063a 4c2a 8504 42f7264ba83f: A causal path is a concept almost equivalent to the concept of elementary particle in physics.

Peta
type: Class
subclass of: Restriction
  has value: P
subclass of: Restriction
  has value: 1000000000000000.0
comment: SI prefix who's value is 1e15.
EMMO 967080e5 2f42 4eb2 a3a9 c58143e835f9: SI prefix who's value is 1e15.

SIMultiplePrefix
type: Class
comment: SI prefix who's value is a positive integer larger than 1.
EMMO 967080e5 2f42 4eb2 a3a9 c58143e835f9: SI prefix who's value is a positive integer larger than 1.

NewtonSquareMetrePerAmpere
type: Class
subclass of: Restriction
  has value: 1.0
subclass of: Restriction
  has value: 0.0
comment: Newton metre squared per Ampere.
EMMO 1f1b164d ec6a 4faa 8d5e 88bda62316cc: http://qudt.org/vocab/unit/N-M2-PER-A
EMMO 33ae2d07 5526 4555 a0b4 8f4c031b5652: N.m2.A-1
EMMO 33ae2d07 5526 4555 a0b4 8f4c031b5652: N.m2/A
EMMO 7f1dec83 d85e 4e1b b7bd c9442d4f5a64: N⋅m²/A
EMMO 967080e5 2f42 4eb2 a3a9 c58143e835f9: Newton metre squared per Ampere.

Tonne
type: Class
subclass of: Restriction
  has value: 1000.0
subclass of: Restriction
  has value: 0.0
subclass of: Restriction
  has value: t
comment: 1,000-fold of the SI base unit kilogram -- QUDT
comment: A non-SI unit defined as 1000 kg.
EMMO 0b1cbe60 d380 4787 b92e be26bdacf2c2: TNE
EMMO 1f1b164d ec6a 4faa 8d5e 88bda62316cc: http://qudt.org/vocab/unit/TON_M
EMMO 33ae2d07 5526 4555 a0b4 8f4c031b5652: t
EMMO 70fe84ff 99b6 4206 a9fc 9a8931836d84: A non-SI unit defined as 1000 kg.
EMMO 967080e5 2f42 4eb2 a3a9 c58143e835f9: 1,000-fold of the SI base unit kilogram -- QUDT
EMMO c84c6752 6d64 48cc 9500 e54a3c34898d: https://en.wikipedia.org/wiki/Tonne
EMMO fe015383 afb3 44a6 ae86 043628697aa2: https://doi.org/10.1351/goldbook.T06394

SIAcceptedUnit
type: Class
comment: Non-SI units mentioned in the SI.
comment: This is a list of units that are not defined as part of the International System of Units (SI), but are otherwise mentioned in the SI brouchure, because either the General Conference on Weights and Measures (CGPM) accepts their use as being multiples or submultiples of SI-units, they have important contemporary application worldwide, or are otherwise commonly encountered worldwide.
EMMO 967080e5 2f42 4eb2 a3a9 c58143e835f9: Non-SI units mentioned in the SI.
EMMO c84c6752 6d64 48cc 9500 e54a3c34898d: https://en.wikipedia.org/wiki/Non-SI_units_mentioned_in_the_SI

MassUnit
type: Class
subclass of: Restriction
  has value: T0 L0 M+1 I0 Θ0 N0 J0
comment: The class of units with dimensionality 'Mass'.
EMMO 967080e5 2f42 4eb2 a3a9 c58143e835f9: The class of units with dimensionality 'Mass'.

GaugePressure
type: Class
subclass of: Restriction
comment: Gauge pressure can be measured using a diaphragm sensor, where one side of the diaphragm is exposed to the pressure media that is to be measured, while the other side is exposed to the ambient atmospheric pressure.
comment: The pressure measured relative to the ambient atmospheric pressure.
EMMO 26bf1bef d192 4da6 b0eb d2209698fb54: https://www.wikidata.org/wiki/Q109594211
EMMO 8de5d5bf db1c 40ac b698 095ba3b18578: 4-14.2
EMMO 967080e5 2f42 4eb2 a3a9 c58143e835f9: The pressure measured relative to the ambient atmospheric pressure.
EMMO c7b62dd7 063a 4c2a 8504 42f7264ba83f: Gauge pressure can be measured using a diaphragm sensor, where one side of the diaphragm is exposed to the pressure media that is to be measured, while the other side is exposed to the ambient atmospheric pressure.

Pressure
type: Class
subclass of: Restriction
comment: The force applied perpendicular to the surface of an object per unit area over which that force is distributed.
EMMO 1f1b164d ec6a 4faa 8d5e 88bda62316cc: http://qudt.org/vocab/quantitykind/Pressure
EMMO 8de5d5bf db1c 40ac b698 095ba3b18578: 4-14.1
EMMO 967080e5 2f42 4eb2 a3a9 c58143e835f9: The force applied perpendicular to the surface of an object per unit area over which that force is distributed.
EMMO fe015383 afb3 44a6 ae86 043628697aa2: https://doi.org/10.1351/goldbook.P04819

ChemicalNomenclature
type: Class
comment: A chemical numenclature should not be confused with the chemical formula.
comment: A language object following a specific nomenclature rules for defining univocal names of chemical compounds.
EMMO 967080e5 2f42 4eb2 a3a9 c58143e835f9: A language object following a specific nomenclature rules for defining univocal names of chemical compounds.

ChemicalSpecies
type: Class
equivalent class: Class
comment: Following nominalistic approach a species is simply a name that can point to an element name, a chemical formula or a chemical compound. So everything addressed by these classes of names can be calleded a chemical species.
comment: N2 Methane CH4 Fe Sodium Chloride
comment: Specific form of an element defined as to isotopic composition, electronic or oxidation state, and/or complex or molecular structure. Chemical species is the macroscopic equivalent of molecular entity and refers to sets or ensembles of molecular entities.
EMMO 967080e5 2f42 4eb2 a3a9 c58143e835f9: Specific form of an element defined as to isotopic composition, electronic or oxidation state, and/or complex or molecular structure. Chemical species is the macroscopic equivalent of molecular entity and refers to sets or ensembles of molecular entities.
EMMO fe015383 afb3 44a6 ae86 043628697aa2: https://doi.org/10.1351/goldbook.CT06859

SectionModulus
type: Class
subclass of: Restriction
comment: Geometrical characteristic of a shape of a body.
EMMO 1f1b164d ec6a 4faa 8d5e 88bda62316cc: https://qudt.org/vocab/quantitykind/SectionModulus
EMMO 26bf1bef d192 4da6 b0eb d2209698fb54: https://www.wikidata.org/wiki/Q1930808
EMMO 50c298c2 55a2 4068 b3ac 4e948c33181f: https://www.electropedia.org/iev/iev.nsf/display
EMMO 8de5d5bf db1c 40ac b698 095ba3b18578: 4-22
EMMO 967080e5 2f42 4eb2 a3a9 c58143e835f9: Geometrical characteristic of a shape of a body.

CountingUnit
type: Class
comment: Unit for dimensionless quantities that have the nature of count.
example: Unit of atomic number Unit of number of cellular Unit of degeneracy in quantum mechanics
EMMO 1f1b164d ec6a 4faa 8d5e 88bda62316cc: http://qudt.org/vocab/unit/NUM
EMMO 33ae2d07 5526 4555 a0b4 8f4c031b5652: 1
EMMO 967080e5 2f42 4eb2 a3a9 c58143e835f9: Unit for dimensionless quantities that have the nature of count.

DimensionlessUnit
type: Class
equivalent class: Restriction
  has value: T0 L0 M0 I0 Θ0 N0 J0
comment: The subclass of measurement units with no physical dimension.
example: Refractive index Plane angle Number of apples
EMMO 1f1b164d ec6a 4faa 8d5e 88bda62316cc: http://qudt.org/vocab/unit/UNITLESS
EMMO 967080e5 2f42 4eb2 a3a9 c58143e835f9: The subclass of measurement units with no physical dimension.

FractionUnit
type: Class
comment: Quantities that are ratios of quantities of the same kind (for example length ratios and amount fractions) have the option of being expressed with units (m/m, mol/mol to aid the understanding of the quantity being expressed and also allow the use of SI prefixes, if this is desirable (μm/m, nmol/mol). -- SI Brochure
comment: Unit for fractions of quantities of the same kind, to aid the understanding of the quantity being expressed.
alternative label: RatioUnit
EMMO 967080e5 2f42 4eb2 a3a9 c58143e835f9: Unit for fractions of quantities of the same kind, to aid the understanding of the quantity being expressed.

PerLengthTemperatureUnit
type: Class
subclass of: Restriction
  has value: T0 L-1 M0 I0 Θ-1 N0 J0
comment: The class of units with dimensionality 'PerLengthTemperature'.
EMMO 967080e5 2f42 4eb2 a3a9 c58143e835f9: The class of units with dimensionality 'PerLengthTemperature'.

EinsteiniumAtom
type: Class
subclass of: Restriction
subclass of: Restriction
  has value: 252.083
subclass of: Restriction
  has value: 99
comment: Atom subclass for einsteinium.
EMMO 967080e5 2f42 4eb2 a3a9 c58143e835f9: Atom subclass for einsteinium.

Emulsion
type: Class
comment: An emulsion is a mixture of two or more liquids that are normally immiscible (a liquid-liquid heterogeneous mixture).
example: Mayonnaise, milk.
EMMO 967080e5 2f42 4eb2 a3a9 c58143e835f9: An emulsion is a mixture of two or more liquids that are normally immiscible (a liquid-liquid heterogeneous mixture).

Colloid
type: Class
comment: A mixture in which one substance of microscopically dispersed insoluble or soluble particles (from 1 nm to 1 μm) is suspended throughout another substance and that does not settle, or would take a very long time to settle appreciably.
comment: Colloids are characterized by the occurring of the Tyndall effect on light.
EMMO 967080e5 2f42 4eb2 a3a9 c58143e835f9: A mixture in which one substance of microscopically dispersed insoluble or soluble particles (from 1 nm to 1 μm) is suspended throughout another substance and that does not settle, or would take a very long time to settle appreciably.
EMMO c7b62dd7 063a 4c2a 8504 42f7264ba83f: Colloids are characterized by the occurring of the Tyndall effect on light.

Liquid
type: Class
comment: A liquid is a nearly incompressible fluid that conforms to the shape of its container but retains a (nearly) constant volume independent of pressure.
EMMO 967080e5 2f42 4eb2 a3a9 c58143e835f9: A liquid is a nearly incompressible fluid that conforms to the shape of its container but retains a (nearly) constant volume independent of pressure.

KiloJoulePerMole
type: Class
subclass of: Restriction
  some values from: JoulePerMole
subclass of: Restriction
  has value: 1000.0
subclass of: Restriction
  has value: 0.0
comment: 1 000-fold of the SI derived unit joule divided by the SI base unit mol -- QUDT
alternative label: Kilojoule Per Mole
EMMO 1f1b164d ec6a 4faa 8d5e 88bda62316cc: http://qudt.org/vocab/unit/KiloJ-PER-MOL
EMMO 33ae2d07 5526 4555 a0b4 8f4c031b5652: kJ.mol-1
EMMO 7f1dec83 d85e 4e1b b7bd c9442d4f5a64: kJ/mol
EMMO 967080e5 2f42 4eb2 a3a9 c58143e835f9: 1 000-fold of the SI derived unit joule divided by the SI base unit mol -- QUDT

EnergyPerAmountUnit
type: Class
subclass of: Restriction
  has value: T-2 L+2 M+1 I0 Θ0 N-1 J0
comment: The class of units with dimensionality 'EnergyPerAmount'.
EMMO 967080e5 2f42 4eb2 a3a9 c58143e835f9: The class of units with dimensionality 'EnergyPerAmount'.

ActivityDensity
type: Class
subclass of: Restriction
comment: Activity per unit volume of the sample.
alternative label: ActivityConcentration
alternative label: VolumetricActivity
alternative label: VolumicActivity
EMMO 1f1b164d ec6a 4faa 8d5e 88bda62316cc: https://qudt.org/vocab/quantitykind/ActivityConcentration
EMMO 26bf1bef d192 4da6 b0eb d2209698fb54: https://www.wikidata.org/wiki/Q423263
EMMO 50c298c2 55a2 4068 b3ac 4e948c33181f: https://www.electropedia.org/iev/iev.nsf/display
EMMO 8de5d5bf db1c 40ac b698 095ba3b18578: 10-29
EMMO 967080e5 2f42 4eb2 a3a9 c58143e835f9: Activity per unit volume of the sample.

Declaration
type: Class
subclass of: Restriction
comment: A semiotic process that assigns a sign based on conventions.
alternative label: ConventionalSemiosis
EMMO 8a137e9f 579c 4e28 baca e8980eb0c3db: EquivalentTo: Determination or Naming
EMMO 967080e5 2f42 4eb2 a3a9 c58143e835f9: A semiotic process that assigns a sign based on conventions.

SemiosisByReferent
type: Class
comment: Semiosis classified by how the sign stands for its reference object.
EMMO 967080e5 2f42 4eb2 a3a9 c58143e835f9: Semiosis classified by how the sign stands for its reference object.

MicroWatt
type: Class
subclass of: Restriction
  has value: 1e-06
subclass of: Restriction
  has value: 0.0
comment: 0.000001-fold of the SI derived unit watt -- QUDT
EMMO 1f1b164d ec6a 4faa 8d5e 88bda62316cc: http://qudt.org/vocab/unit/MicroW
EMMO 33ae2d07 5526 4555 a0b4 8f4c031b5652: uW
EMMO 7f1dec83 d85e 4e1b b7bd c9442d4f5a64: μW
EMMO 967080e5 2f42 4eb2 a3a9 c58143e835f9: 0.000001-fold of the SI derived unit watt -- QUDT

MicroPrefixedUnit
type: Class
subclass of: Restriction
subclass of: Restriction
  has value: 1e-06
comment: Superclass for all units prefixed with "micro" (1e-6).
EMMO 967080e5 2f42 4eb2 a3a9 c58143e835f9: Superclass for all units prefixed with "micro" (1e-6).

PowerUnit
type: Class
subclass of: Restriction
  has value: T-3 L+2 M+1 I0 Θ0 N0 J0
comment: The class of units with dimensionality 'Power'.
EMMO 967080e5 2f42 4eb2 a3a9 c58143e835f9: The class of units with dimensionality 'Power'.

QuarticLengthUnit
type: Class
subclass of: Restriction
  has value: T0 L+4 M0 I0 Θ0 N0 J0
comment: The class of units with dimensionality 'QuarticLength'.
EMMO 967080e5 2f42 4eb2 a3a9 c58143e835f9: The class of units with dimensionality 'QuarticLength'.

Parameter
type: Class
comment: A variable whose value is assumed to be known independently from the equation, but whose value is not explicitated in the equation.
example: Viscosity in the Navier-Stokes equation

NumericalVariable
type: Class
comment: A variable standing for a numerical defined mathematical object like e.g. a number, a vector of numbers, a matrix of numbers.
EMMO 967080e5 2f42 4eb2 a3a9 c58143e835f9: A variable standing for a numerical defined mathematical object like e.g. a number, a vector of numbers, a matrix of numbers.

Description
type: Class
comment: A coded that is not atomic with respect to a code of description.
comment: A description is a collection of properties that depicts an object. It is not atomic since it is made of several properties collected together.
example: A biography.
example: A sentence about some object, depticting its properties.
EMMO 967080e5 2f42 4eb2 a3a9 c58143e835f9: A coded that is not atomic with respect to a code of description.
EMMO c7b62dd7 063a 4c2a 8504 42f7264ba83f: A description is a collection of properties that depicts an object. It is not atomic since it is made of several properties collected together.

NanoAmpere
type: Class
subclass of: Restriction
  some values from: Ampere
subclass of: Restriction
  has value: 1e-09
subclass of: Restriction
  has value: 0.0
alternative label: nanoampere
EMMO 1f1b164d ec6a 4faa 8d5e 88bda62316cc: http://qudt.org/vocab/unit/NanoA
EMMO 33ae2d07 5526 4555 a0b4 8f4c031b5652: nA
EMMO 7f1dec83 d85e 4e1b b7bd c9442d4f5a64: nA

IridiumSymbol
type: Class
subclass of: Restriction
  has value: Ir
comment: The symbol that stands for the iridium atom.
EMMO 967080e5 2f42 4eb2 a3a9 c58143e835f9: The symbol that stands for the iridium atom.

MicroHenryPerOhm
type: Class
subclass of: Restriction
  some values from: HenryPerOhm
subclass of: Restriction
  has value: 1e-06
subclass of: Restriction
  has value: 0.0
comment: 0.000001-fold of the SI derived unit henry divided by the SI derived unit ohm -- QUDT
alternative label: Microhenry Per Ohm
EMMO 1f1b164d ec6a 4faa 8d5e 88bda62316cc: http://qudt.org/vocab/unit/MicroH-PER-OHM
EMMO 33ae2d07 5526 4555 a0b4 8f4c031b5652: uH.Ohm-1
EMMO 7f1dec83 d85e 4e1b b7bd c9442d4f5a64: µH/Ω
EMMO 967080e5 2f42 4eb2 a3a9 c58143e835f9: 0.000001-fold of the SI derived unit henry divided by the SI derived unit ohm -- QUDT

TimeUnit
type: Class
subclass of: Restriction
  has value: T+1 L0 M0 I0 Θ0 N0 J0
comment: The class of units with dimensionality 'Time'.
EMMO 967080e5 2f42 4eb2 a3a9 c58143e835f9: The class of units with dimensionality 'Time'.

KiloPascalPerMilliMetre
type: Class
subclass of: Restriction
  has value: 100000.0
subclass of: Restriction
  has value: 0.0
comment: 1 000-fold of the derived SI unit pascal divided by the 0.001-fold of the SI base unit metre -- QUDT
alternative label: Kilopascal Per Millimetre
EMMO 1f1b164d ec6a 4faa 8d5e 88bda62316cc: http://qudt.org/vocab/unit/KiloPA-PER-MilliM
EMMO 33ae2d07 5526 4555 a0b4 8f4c031b5652: kPa.mm-1
EMMO 7f1dec83 d85e 4e1b b7bd c9442d4f5a64: kPa/mm
EMMO 967080e5 2f42 4eb2 a3a9 c58143e835f9: 1 000-fold of the derived SI unit pascal divided by the 0.001-fold of the SI base unit metre -- QUDT

MassPerSquareLengthSquareTimeUnit
type: Class
subclass of: Restriction
  has value: T-2 L-2 M+1 I0 Θ0 N0 J0
comment: The class of units with dimensionality 'MassPerSquareLengthSquareTime'.
EMMO 967080e5 2f42 4eb2 a3a9 c58143e835f9: The class of units with dimensionality 'MassPerSquareLengthSquareTime'.

MilliGramPerSecond
type: Class
subclass of: Restriction
  some values from: GramPerSecond
subclass of: Restriction
  has value: 1e-06
subclass of: Restriction
  has value: 0.0
comment: 0.000001-fold of the SI base unit kilogram divided by the SI base unit second -- QUDT
alternative label: Milligram Per Second
EMMO 1f1b164d ec6a 4faa 8d5e 88bda62316cc: http://qudt.org/vocab/unit/MilliGM-PER-SEC
EMMO 33ae2d07 5526 4555 a0b4 8f4c031b5652: mg/s
EMMO 7f1dec83 d85e 4e1b b7bd c9442d4f5a64: mg/s
EMMO 967080e5 2f42 4eb2 a3a9 c58143e835f9: 0.000001-fold of the SI base unit kilogram divided by the SI base unit second -- QUDT

MassPerTimeUnit
type: Class
subclass of: Restriction
  has value: T-1 L0 M+1 I0 Θ0 N0 J0
comment: The class of units with dimensionality 'MassPerTime'.
EMMO 967080e5 2f42 4eb2 a3a9 c58143e835f9: The class of units with dimensionality 'MassPerTime'.

KiloPascalSquareMetrePerGram
type: Class
subclass of: Restriction
  has value: 1000000.0
subclass of: Restriction
  has value: 0.0
comment: sector-specific unit of the burst index as 1 000-fold of the derived unit for pressure pascal related to the substance, represented as a quotient from the 0.001-fold of the SI base unit kilogram divided by the power of the SI base unit metre by exponent 2 -- QUDT
alternative label: Kilopascal Square Metre per Gram
EMMO 1f1b164d ec6a 4faa 8d5e 88bda62316cc: http://qudt.org/vocab/unit/KiloPA-M2-PER-GM
EMMO 33ae2d07 5526 4555 a0b4 8f4c031b5652: kPa.m2.g-1
EMMO 7f1dec83 d85e 4e1b b7bd c9442d4f5a64: kPa⋅m²/g
EMMO 967080e5 2f42 4eb2 a3a9 c58143e835f9: sector-specific unit of the burst index as 1 000-fold of the derived unit for pressure pascal related to the substance, represented as a quotient from the 0.001-fold of the SI base unit kilogram divided by the power of the SI base unit metre by exponent 2 -- QUDT

AccelerationUnit
type: Class
subclass of: Restriction
  has value: T-2 L+1 M0 I0 Θ0 N0 J0
comment: The class of units with dimensionality 'Acceleration'.
EMMO 967080e5 2f42 4eb2 a3a9 c58143e835f9: The class of units with dimensionality 'Acceleration'.

ActivityOfSolute
type: Class
comment: For a solute X in a solution; quantity proportional to the absolute activity.
alternative label: RelativeActivityOfSolute
EMMO 26bf1bef d192 4da6 b0eb d2209698fb54: https://www.wikidata.org/wiki/Q89408862
EMMO 8de5d5bf db1c 40ac b698 095ba3b18578: 9-24
EMMO 967080e5 2f42 4eb2 a3a9 c58143e835f9: For a solute X in a solution; quantity proportional to the absolute activity.

OganessonSymbol
type: Class
subclass of: Restriction
  has value: Og
comment: The symbol that stands for the oganesson atom.
EMMO 967080e5 2f42 4eb2 a3a9 c58143e835f9: The symbol that stands for the oganesson atom.

GermaniumSymbol
type: Class
subclass of: Restriction
  has value: Ge
comment: The symbol that stands for the germanium atom.
EMMO 967080e5 2f42 4eb2 a3a9 c58143e835f9: The symbol that stands for the germanium atom.

MicroNewton
type: Class
subclass of: Restriction
  has value: 1e-06
subclass of: Restriction
  has value: 0.0
comment: 0.000001-fold of the SI derived unit newton -- QUDT
EMMO 1f1b164d ec6a 4faa 8d5e 88bda62316cc: http://qudt.org/vocab/unit/MicroN
EMMO 33ae2d07 5526 4555 a0b4 8f4c031b5652: uN
EMMO 7f1dec83 d85e 4e1b b7bd c9442d4f5a64: μN
EMMO 967080e5 2f42 4eb2 a3a9 c58143e835f9: 0.000001-fold of the SI derived unit newton -- QUDT

MolecularEntity
type: Class
comment: Any constitutionally or isotopically distinct atom, molecule, ion, ion pair, radical, radical ion, complex, conformer etc., identifiable as a separately distinguishable entity that can undergo a chemical reaction.
comment: Molecular entity is used as a general term for singular entities, irrespective of their nature, while chemical species stands for sets or ensembles of molecular entities. Note that the name of a compound may refer to the respective molecular entity or to the chemical species,
alternative label: ChemicalEntity
example: Hydrogen molecule is an adequate definition of a certain molecular entity for some purposes, whereas for others it is necessary to distinguish the electronic state and/or vibrational state and/or nuclear spin, etc. of the hydrogen molecule.
example: Methane, may mean a single molecule of CH4 (molecular entity) or a molar amount, specified or not (chemical species), participating in a reaction. The degree of precision necessary to describe a molecular entity depends on the context.
EMMO 967080e5 2f42 4eb2 a3a9 c58143e835f9: Any constitutionally or isotopically distinct atom, molecule, ion, ion pair, radical, radical ion, complex, conformer etc., identifiable as a separately distinguishable entity that can undergo a chemical reaction.
EMMO c7b62dd7 063a 4c2a 8504 42f7264ba83f: Molecular entity is used as a general term for singular entities, irrespective of their nature, while chemical species stands for sets or ensembles of molecular entities. Note that the name of a compound may refer to the respective molecular entity or to the chemical species,
EMMO c7b62dd7 063a 4c2a 8504 42f7264ba83f: This concept is strictly related to chemistry. For this reason an atom can be considered the smallest entity that can be considered "molecular", including nucleus when they are seen as ions (e.g. H⁺, He⁺⁺).

ShearCutting
type: Class
comment: Cutting workpieces between two cutting edges that move past each other (see Figure 1 [see figure in the standard]).
alternative label: Scherschneiden

Cutting
type: Class
comment: Mechanical separation of workpieces without the formation of shapeless material, i.e. also without chips (chipless).
alternative label: Schneiden

CentiMetrePerSquareSecond
type: Class
subclass of: Restriction
  some values from: MetrePerSquareSecond
subclass of: Restriction
  has value: 0.01
subclass of: Restriction
  has value: 0.0
comment: `Centimeter per Square Second` is a C.G.S System unit for `Linear Acceleration` expressed as cm/s². -- QUDT
alternative label: Centimetre per Square Second
EMMO 1f1b164d ec6a 4faa 8d5e 88bda62316cc: http://qudt.org/vocab/unit/CentiM-PER-SEC2
EMMO 33ae2d07 5526 4555 a0b4 8f4c031b5652: cm.s-2
EMMO 33ae2d07 5526 4555 a0b4 8f4c031b5652: cm/s2
EMMO 7f1dec83 d85e 4e1b b7bd c9442d4f5a64: cm/s²
EMMO 967080e5 2f42 4eb2 a3a9 c58143e835f9: `Centimeter per Square Second` is a C.G.S System unit for `Linear Acceleration` expressed as cm/s². -- QUDT

MassExcess
type: Class
subclass of: Restriction
comment: Difference between the mass of an atom, and the product of its mass number and the unified mass constant.
EMMO 1f1b164d ec6a 4faa 8d5e 88bda62316cc: https://qudt.org/vocab/quantitykind/MassExcess
EMMO 26bf1bef d192 4da6 b0eb d2209698fb54: https://www.wikidata.org/wiki/Q1571163
EMMO 8de5d5bf db1c 40ac b698 095ba3b18578: 10-21.1
EMMO 967080e5 2f42 4eb2 a3a9 c58143e835f9: Difference between the mass of an atom, and the product of its mass number and the unified mass constant.
EMMO fe015383 afb3 44a6 ae86 043628697aa2: https://doi.org/10.1351/goldbook.M03719

ChemicalSubstance
type: Class
comment: A substance is always composed of more than one molecular entity. It lays in the continuum or mesoscopic domain.
comment: Matter of constant composition best characterized by the entities (molecules, formula units, atoms) it is composed of.
EMMO 967080e5 2f42 4eb2 a3a9 c58143e835f9: Matter of constant composition best characterized by the entities (molecules, formula units, atoms) it is composed of.
EMMO fe015383 afb3 44a6 ae86 043628697aa2: https://doi.org/10.1351/goldbook.C01039

SpatioTemporalTileByConnection
type: Class
comment: The superclass for tiles categorized accordingly to their topological role within a tessellation.
EMMO 967080e5 2f42 4eb2 a3a9 c58143e835f9: The superclass for tiles categorized accordingly to their topological role within a tessellation.

SpatioTemporalTile
type: Class
comment: The superclass for all tiles belonging to tessellations in which all tiles are connected through spatiotemporal relations hasNext or contacts.
alternative label: WellFormedTile
EMMO 8a137e9f 579c 4e28 baca e8980eb0c3db: EquivalentTo: SpatialTile or TemporalTile or JunctionTile
EMMO 8a137e9f 579c 4e28 baca e8980eb0c3db: EquivalentTo: ThroughTile or EndTile or BeginTile
EMMO 967080e5 2f42 4eb2 a3a9 c58143e835f9: The superclass for all tiles belonging to tessellations in which all tiles are connected through spatiotemporal relations hasNext or contacts.

MegaJoulePerSecond
type: Class
subclass of: Restriction
  some values from: JoulePerSecond
subclass of: Restriction
  has value: 1000000.0
subclass of: Restriction
  has value: 0.0
comment: quotient of the 1,000,000-fold of the derived SI unit joule divided by the SI base unit second -- QUDT
alternative label: Megajoule Per Second
EMMO 1f1b164d ec6a 4faa 8d5e 88bda62316cc: http://qudt.org/vocab/unit/MegaJ-PER-SEC
EMMO 33ae2d07 5526 4555 a0b4 8f4c031b5652: MJ.s-1
EMMO 7f1dec83 d85e 4e1b b7bd c9442d4f5a64: MJ/s
EMMO 967080e5 2f42 4eb2 a3a9 c58143e835f9: quotient of the 1,000,000-fold of the derived SI unit joule divided by the SI base unit second -- QUDT

EffectiveMass
type: Class
comment: The mass that it seems to have when responding to forces, or the mass that it seems to have when interacting with other identical particles in a thermal distribution.
EMMO 1f1b164d ec6a 4faa 8d5e 88bda62316cc: https://qudt.org/vocab/quantitykind/EffectiveMass
EMMO 26bf1bef d192 4da6 b0eb d2209698fb54: https://www.wikidata.org/wiki/Q1064434
EMMO 8de5d5bf db1c 40ac b698 095ba3b18578: 12-30
EMMO 967080e5 2f42 4eb2 a3a9 c58143e835f9: The mass that it seems to have when responding to forces, or the mass that it seems to have when interacting with other identical particles in a thermal distribution.

Mass
type: Class
subclass of: Restriction
comment: Property of a physical body that express its resistance to acceleration (a change in its state of motion) when a force is applied.
EMMO 1f1b164d ec6a 4faa 8d5e 88bda62316cc: http://qudt.org/vocab/quantitykind/Mass
EMMO 8de5d5bf db1c 40ac b698 095ba3b18578: 4-1
EMMO 967080e5 2f42 4eb2 a3a9 c58143e835f9: Property of a physical body that express its resistance to acceleration (a change in its state of motion) when a force is applied.
EMMO fe015383 afb3 44a6 ae86 043628697aa2: https://doi.org/10.1351/goldbook.M03709

CodedByObservation
type: Class
comment: A coded classified by observation.
EMMO 967080e5 2f42 4eb2 a3a9 c58143e835f9: A coded classified by observation.

Coded
type: Class
subclass of: Restriction
comment: A conventional referring to an object according to a specific code that reflects the results of a specific interaction mechanism and is shared between other interpreters. A coded is always a partial representation of an object since it reflects the object capability to be part of a specific determination. A coded is a sort of name or label that we put upon objects that interact with an determiner in the same specific way. For example, "hot" objects are objects that interact with an observer through a perception mechanism aimed to perceive an heat source. The code is made of terms such as "hot", "warm", "cold", that commonly refer to the perception of heat.
comment: A conventional that stands for an object according to a code of interpretation to which the interpreter refers.
example: A biography that makes use of a code that is provided by the meaning of the element of the language used by the author.
example: The name "red" that stands for the color of an object.
EMMO 8a137e9f 579c 4e28 baca e8980eb0c3db: EquivalentTo: Description or Property
EMMO 8a137e9f 579c 4e28 baca e8980eb0c3db: EquivalentTo: Observed or Estimated
EMMO 8a137e9f 579c 4e28 baca e8980eb0c3db: EquivalentTo: Subjective or Objective
EMMO 967080e5 2f42 4eb2 a3a9 c58143e835f9: A conventional that stands for an object according to a code of interpretation to which the interpreter refers.
EMMO c7b62dd7 063a 4c2a 8504 42f7264ba83f: A conventional referring to an object according to a specific code that reflects the results of a specific interaction mechanism and is shared between other interpreters. A coded is always a partial representation of an object since it reflects the object capability to be part of a specific determination. A coded is a sort of name or label that we put upon objects that interact with an determiner in the same specific way. For example, "hot" objects are objects that interact with an observer through a perception mechanism aimed to perceive an heat source. The code is made of terms such as "hot", "warm", "cold", that commonly refer to the perception of heat.
EMMO c7b62dd7 063a 4c2a 8504 42f7264ba83f: Let's define the class Colour as the subclass of the coded signs that involve photon emission and electromagnetic radiation sensible observers. An individual C of this class Colour can be defined be declaring the process individual (e.g. daylight illumination) and the observer (e.g. my eyes) Stating that an entity E hasCoded C, we mean that it can be observed by such setup of process + observer (i.e. observed by my eyes under daylight). This definition can be specialised for human eye perception, so that the observer can be a generic human, or to camera perception so that the observer can be a device. This can be used in material characterization, to define exactly the type of measurement done, including the instrument type.

SemioticEntity
type: Class
comment: Semiotic subclasse are defined using Peirce's semiotic theory. "Namely, a sign is something, A, which brings something, B, its interpretant sign determined or created by it, into the same sort of correspondence with something, C, its object, as that in which itself stands to C." (Peirce 1902, NEM 4, 20–21). The triadic elements: - 'sign': the sign A (e.g. a name) - 'interpretant': the sign B as the effects of the sign A on the interpreter (e.g. the mental concept of what a name means) - 'object': the object C (e.g. the entity to which the sign A and B refer to) This class includes also the 'interpeter' i.e. the entity that connects the 'sign' to the 'object'
comment: The class of individuals that stands for semiotic objects, i.e. objects that take part on a semiotic process.
EMMO 8a137e9f 579c 4e28 baca e8980eb0c3db: EquivalentTo: Interpreter or SemioticObject or Sign
EMMO 967080e5 2f42 4eb2 a3a9 c58143e835f9: The class of individuals that stands for semiotic objects, i.e. objects that take part on a semiotic process.
EMMO c7b62dd7 063a 4c2a 8504 42f7264ba83f: Semiotic subclasse are defined using Peirce's semiotic theory. "Namely, a sign is something, A, which brings something, B, its interpretant sign determined or created by it, into the same sort of correspondence with something, C, its object, as that in which itself stands to C." (Peirce 1902, NEM 4, 20–21). The triadic elements: - 'sign': the sign A (e.g. a name) - 'interpretant': the sign B as the effects of the sign A on the interpreter (e.g. the mental concept of what a name means) - 'object': the object C (e.g. the entity to which the sign A and B refer to) This class includes also the 'interpeter' i.e. the entity that connects the 'sign' to the 'object'

Semiotics
type: Class
EMMO 8a137e9f 579c 4e28 baca e8980eb0c3db: EquivalentTo: Semiosis or SemioticEntity

PerMetreKelvin
type: Class
subclass of: Restriction
  has value: 1.0
subclass of: Restriction
  has value: 0.0
comment: Per Meter Kelvin Unit is a denominator unit with dimensions /m.k. -- QUDT
alternative label: ReciprocalMetreKelvin
EMMO 1f1b164d ec6a 4faa 8d5e 88bda62316cc: http://qudt.org/vocab/unit/PER-M-K
EMMO 33ae2d07 5526 4555 a0b4 8f4c031b5652: m-1.K-1
EMMO 7f1dec83 d85e 4e1b b7bd c9442d4f5a64: /(m⋅K)
EMMO 967080e5 2f42 4eb2 a3a9 c58143e835f9: Per Meter Kelvin Unit is a denominator unit with dimensions /m.k. -- QUDT

KiloJoulePerKilogramKelvin
type: Class
subclass of: Restriction
  some values from: JoulePerKilogramKelvin
subclass of: Restriction
  has value: 1000.0
subclass of: Restriction
  has value: 0.0
comment: 1 000-fold of the SI derived unit joule divided by the product of the SI base unit kilogram and the SI base unit kelvin -- QUDT
alternative label: Kilojoule Per Kilogram Kelvin
EMMO 1f1b164d ec6a 4faa 8d5e 88bda62316cc: http://qudt.org/vocab/unit/KiloJ-PER-KiloGM-K
EMMO 33ae2d07 5526 4555 a0b4 8f4c031b5652: kJ.(kg.K)-1
EMMO 33ae2d07 5526 4555 a0b4 8f4c031b5652: kJ.kg-1.K-1
EMMO 33ae2d07 5526 4555 a0b4 8f4c031b5652: kJ/(kg.K)
EMMO 7f1dec83 d85e 4e1b b7bd c9442d4f5a64: kJ/(kg⋅K)
EMMO 967080e5 2f42 4eb2 a3a9 c58143e835f9: 1 000-fold of the SI derived unit joule divided by the product of the SI base unit kilogram and the SI base unit kelvin -- QUDT

EntropyPerMassUnit
type: Class
subclass of: Restriction
  has value: T-2 L+2 M0 I0 Θ-1 N0 J0
comment: The class of units with dimensionality 'EntropyPerMass'.
EMMO 967080e5 2f42 4eb2 a3a9 c58143e835f9: The class of units with dimensionality 'EntropyPerMass'.

HydrogenAtom
type: Class
subclass of: Restriction
subclass of: Restriction
  has value: 1.008
subclass of: Restriction
  has value: 1
comment: Atom subclass for hydrogen.
EMMO 967080e5 2f42 4eb2 a3a9 c58143e835f9: Atom subclass for hydrogen.

PerMole
type: Class
subclass of: Restriction
  has value: 1.0
subclass of: Restriction
  has value: 0.0
comment: Per Mole Unit is a denominator unit with dimensions mol⁻¹. -- QUDT
alternative label: ReciprocalMole
EMMO 1f1b164d ec6a 4faa 8d5e 88bda62316cc: http://qudt.org/vocab/unit/PER-MOL
EMMO 33ae2d07 5526 4555 a0b4 8f4c031b5652: mol-1
EMMO 7f1dec83 d85e 4e1b b7bd c9442d4f5a64: /mol
EMMO 967080e5 2f42 4eb2 a3a9 c58143e835f9: Per Mole Unit is a denominator unit with dimensions mol⁻¹. -- QUDT

PerAmountUnit
type: Class
subclass of: Restriction
  has value: T0 L0 M0 I0 Θ0 N-1 J0
comment: The class of units with dimensionality 'PerAmount'.
EMMO 967080e5 2f42 4eb2 a3a9 c58143e835f9: The class of units with dimensionality 'PerAmount'.

DigitalData
type: Class
comment: Discrete data that are decoded as a sequence of 1/0, or true/false, or on/off.
alternative label: BinaryData
EMMO 967080e5 2f42 4eb2 a3a9 c58143e835f9: Discrete data that are decoded as a sequence of 1/0, or true/false, or on/off.

Measurement
type: Class
subclass of: Restriction
comment: A measurement always implies a causal interaction between the object and the observer.
comment: A measurement is the process of experimentally obtaining one or more measurement results that can reasonably be attributed to a quantity.
comment: An 'observation' that results in a quantitative comparison of a 'property' of an 'object' with a standard reference based on a well defined mesurement procedure.
EMMO 967080e5 2f42 4eb2 a3a9 c58143e835f9: An 'observation' that results in a quantitative comparison of a 'property' of an 'object' with a standard reference based on a well defined mesurement procedure.
EMMO bb49844b 45d7 4f0d 8cae 8e552cbc20d6: measurement

PositiveIntegerData
type: Class
comment: A data representing an integer number > 0.
EMMO 8a137e9f 579c 4e28 baca e8980eb0c3db: EquivalentTo: hasDataValue some xsd:positiveInteger
EMMO 967080e5 2f42 4eb2 a3a9 c58143e835f9: A data representing an integer number > 0.

WattPerSquareMetrePascal
type: Class
subclass of: Restriction
  has value: 1.0
subclass of: Restriction
  has value: 0.0
comment: Watt Per Square Meter Per Pascal (W/m²-pa) is a unit of Evaporative Heat Transfer. -- QUDT
alternative label: Watt per Square Metre Pascal
EMMO 1f1b164d ec6a 4faa 8d5e 88bda62316cc: http://qudt.org/vocab/unit/W-PER-M2-PA
EMMO 33ae2d07 5526 4555 a0b4 8f4c031b5652: W.m-2.Pa-1
EMMO 7f1dec83 d85e 4e1b b7bd c9442d4f5a64: W/(m²⋅pa)
EMMO 967080e5 2f42 4eb2 a3a9 c58143e835f9: Watt Per Square Meter Per Pascal (W/m²-pa) is a unit of Evaporative Heat Transfer. -- QUDT

SpeedUnit
type: Class
subclass of: Restriction
  has value: T-1 L+1 M0 I0 Θ0 N0 J0
comment: The class of units with dimensionality 'Speed'.
EMMO 967080e5 2f42 4eb2 a3a9 c58143e835f9: The class of units with dimensionality 'Speed'.

VoltPerKelvin
type: Class
subclass of: Restriction
  has value: 1.0
subclass of: Restriction
  has value: 0.0
comment: Volt per Kelvin.
EMMO 1f1b164d ec6a 4faa 8d5e 88bda62316cc: http://qudt.org/vocab/unit/V-PER-K
EMMO 33ae2d07 5526 4555 a0b4 8f4c031b5652: V.K-1
EMMO 7f1dec83 d85e 4e1b b7bd c9442d4f5a64: V/K
EMMO 967080e5 2f42 4eb2 a3a9 c58143e835f9: Volt per Kelvin.

ElectricPotentialPerTemperatureUnit
type: Class
subclass of: Restriction
  has value: T-3 L+2 M+1 I-1 Θ-1 N0 J0
comment: The class of units with dimensionality 'ElectricPotentialPerTemperature'.
EMMO 967080e5 2f42 4eb2 a3a9 c58143e835f9: The class of units with dimensionality 'ElectricPotentialPerTemperature'.

SpatialTile
type: Class
comment: A direct part that is obtained by partitioning a whole purely in spatial parts.
EMMO 967080e5 2f42 4eb2 a3a9 c58143e835f9: A direct part that is obtained by partitioning a whole purely in spatial parts.

YtterbiumSymbol
type: Class
subclass of: Restriction
  has value: Yb
comment: The symbol that stands for the ytterbium atom.
EMMO 967080e5 2f42 4eb2 a3a9 c58143e835f9: The symbol that stands for the ytterbium atom.

Fundamental
type: Class
comment: The superclass for all classes of entities that have no proper parts of the same type of the whole.
comment: Fundamental(x) ≡ ∃φ[φ(x) ∧ ¬∃yRP⟨φ⟩(y, x)]
alternative label: Lifetime
alternative label: Maximal
example: A marathon is an example of class whose individuals are always maximal since the criteria satisfied by a marathon 4D entity poses some constraints on its temporal and spatial extent. On the contrary, the class for a generic running process does not necessarily impose maximality to its individuals. A running individual is maximal only when it extends in time for the minimum amount required to identify a running act, so every possible temporal part is always a non-running. Following the two examples, a marathon individual is a maximal that can be decomposed into running intervals. The marathon class is a subclass of running.
EMMO 70fe84ff 99b6 4206 a9fc 9a8931836d84: Fundamental(x) ≡ ∃φ[φ(x) ∧ ¬∃yRP⟨φ⟩(y, x)]
EMMO 967080e5 2f42 4eb2 a3a9 c58143e835f9: The superclass for all classes of entities that have no proper parts of the same type of the whole.

Structural
type: Class
comment: A perspective that categorises causal structures according to the merelogical relations between the whole and the parts, taking into account their types.
EMMO 967080e5 2f42 4eb2 a3a9 c58143e835f9: A perspective that categorises causal structures according to the merelogical relations between the whole and the parts, taking into account their types.

SquareMetre
type: Class
subclass of: Restriction
  has value: 1.0
subclass of: Restriction
  has value: 0.0
comment: The S I unit of area is the square metre. -- QUDT
EMMO 0b1cbe60 d380 4787 b92e be26bdacf2c2: MTK
EMMO 1f1b164d ec6a 4faa 8d5e 88bda62316cc: http://qudt.org/vocab/unit/M2
EMMO 209ba1b3 149f 4ff0 b672 941610eafd72: http://www.ontology-of-units-of-measure.org/resource/om-2/squareMetre
EMMO 33ae2d07 5526 4555 a0b4 8f4c031b5652: m2
EMMO 7f1dec83 d85e 4e1b b7bd c9442d4f5a64: m²
EMMO 967080e5 2f42 4eb2 a3a9 c58143e835f9: The S I unit of area is the square metre. -- QUDT

Assigner
type: Class
comment: A estimator that uses its predefined knowledge to declare a property of an object.
example: I estimate the molecular mass of the gas in my bottle as 1.00784 u because it is tagged as H.
EMMO 967080e5 2f42 4eb2 a3a9 c58143e835f9: A estimator that uses its predefined knowledge to declare a property of an object.

Estimator
type: Class
subclass of: Restriction
comment: A characteriser that declares a property for an object without actually interact with it with the specific interaction required by the property definition (i.e. infer a property from other properties).
EMMO 967080e5 2f42 4eb2 a3a9 c58143e835f9: A characteriser that declares a property for an object without actually interact with it with the specific interaction required by the property definition (i.e. infer a property from other properties).

PerMilliMetre
type: Class
subclass of: Restriction
  has value: 1000.0
subclass of: Restriction
  has value: 0.0
comment: Per Millimeter Unit is a denominator unit with dimensions /mm. -- QUDT
alternative label: ReciprocalMilliMetre
EMMO 1f1b164d ec6a 4faa 8d5e 88bda62316cc: http://qudt.org/vocab/unit/PER-MilliM
EMMO 33ae2d07 5526 4555 a0b4 8f4c031b5652: /mm
EMMO 33ae2d07 5526 4555 a0b4 8f4c031b5652: mm-1
EMMO 7f1dec83 d85e 4e1b b7bd c9442d4f5a64: /mm
EMMO 967080e5 2f42 4eb2 a3a9 c58143e835f9: Per Millimeter Unit is a denominator unit with dimensions /mm. -- QUDT

KilogramSquareMilliMetre
type: Class
subclass of: Restriction
  has value: 1e-06
subclass of: Restriction
  has value: 0.0
comment: product of the SI base kilogram and the 0.001-fold of the power of the SI base metre with the exponent 2 -- QUDT
alternative label: Kilogram Square Millimetre
EMMO 1f1b164d ec6a 4faa 8d5e 88bda62316cc: http://qudt.org/vocab/unit/KiloGM-MilliM2
EMMO 33ae2d07 5526 4555 a0b4 8f4c031b5652: kg.mm2
EMMO 7f1dec83 d85e 4e1b b7bd c9442d4f5a64: kg⋅mm²
EMMO 967080e5 2f42 4eb2 a3a9 c58143e835f9: product of the SI base kilogram and the 0.001-fold of the power of the SI base metre with the exponent 2 -- QUDT

MassAreaUnit
type: Class
subclass of: Restriction
  has value: T0 L+2 M+1 I0 Θ0 N0 J0
comment: The class of units with dimensionality 'MassArea'.
EMMO 967080e5 2f42 4eb2 a3a9 c58143e835f9: The class of units with dimensionality 'MassArea'.

Matter
type: Class
comment: A matter entity requires the presence of fermions without excluding the presence of real or virtual fundamental bosons parts that are responsible for the interactions between the (real) fundamental fermions.
comment: The class of physical objects that have some fermionic quantum parts.
comment: The interpretation of the term "matter" is not univocal. Several concepts are labelled with this term, depending on the field of science. The concept mass is sometimes related to the term "matter", even if the former refers to a physical quantity (precisely defined by modern physics) while the latter is a type that qualifies a physical entity. It is possible to identify more than one concept that can be reasonably labelled with the term "matter". For example, it is possible to label as matter only the entities that are made up of atoms. Or more generally, we can be more fine-grained and call "matter" the entities that are made up of protons, neutrons or electrons, so that we can call matter also a neutron radiation or a cathode ray. A more fundamental approach, that we embrace for the EMMO, considers matter as entities that are made of fermions (i.e. quarks and leptons) requiring their presence, without excluding particles like the W and Z bosons that possess some mass, but are not fermions. Antimatter is a subclass of matter.
alternative label: PhysicalSubstance
EMMO 31252f35 c767 4b97 a877 1235076c3e13: The interpretation of the term "matter" is not univocal. Several concepts are labelled with this term, depending on the field of science. The concept mass is sometimes related to the term "matter", even if the former refers to a physical quantity (precisely defined by modern physics) while the latter is a type that qualifies a physical entity. It is possible to identify more than one concept that can be reasonably labelled with the term "matter". For example, it is possible to label as matter only the entities that are made up of atoms. Or more generally, we can be more fine-grained and call "matter" the entities that are made up of protons, neutrons or electrons, so that we can call matter also a neutron radiation or a cathode ray. A more fundamental approach, that we embrace for the EMMO, considers matter as entities that are made of fermions (i.e. quarks and leptons) requiring their presence, without excluding particles like the W and Z bosons that possess some mass, but are not fermions. Antimatter is a subclass of matter.
EMMO 8a137e9f 579c 4e28 baca e8980eb0c3db: DisjointUnionOf: HybridMatter, OrdinaryMatter, AntiMatter
EMMO 967080e5 2f42 4eb2 a3a9 c58143e835f9: The class of physical objects that have some fermionic quantum parts.
EMMO c7b62dd7 063a 4c2a 8504 42f7264ba83f: A matter entity requires the presence of fermions without excluding the presence of real or virtual fundamental bosons parts that are responsible for the interactions between the (real) fundamental fermions.
EMMO c7b62dd7 063a 4c2a 8504 42f7264ba83f: Matter includes ordinary- and anti-matter. It is possible to have entities that are made of particle and anti-particles (e.g. mesons made of a quark and an anti-quark pair) so that it is possible to have entities that are somewhat heterogeneous with regards to this distinction.

Pascal
type: Class
subclass of: Restriction
  has value: Pa
comment: SI unit for pressure.
comment: The SI unit of pressure. The pascal is the standard pressure unit in the MKS metric system, equal to one newton per square meter or one "kilogram per meter per second per second." The unit is named for Blaise Pascal (1623-1662), French philosopher and mathematician, who was the first person to use a barometer to measure differences in altitude. -- QUDT
EMMO 0b1cbe60 d380 4787 b92e be26bdacf2c2: PAL
EMMO 1f1b164d ec6a 4faa 8d5e 88bda62316cc: http://qudt.org/vocab/unit/PA
EMMO 33ae2d07 5526 4555 a0b4 8f4c031b5652: Pa
EMMO 6dd685dd 1895 46e4 b227 be9f7d643c25: http://dbpedia.org/resource/Pascal
EMMO 967080e5 2f42 4eb2 a3a9 c58143e835f9: SI unit for pressure.
EMMO c7b62dd7 063a 4c2a 8504 42f7264ba83f: The SI unit of pressure. The pascal is the standard pressure unit in the MKS metric system, equal to one newton per square meter or one "kilogram per meter per second per second." The unit is named for Blaise Pascal (1623-1662), French philosopher and mathematician, who was the first person to use a barometer to measure differences in altitude. -- QUDT
EMMO c84c6752 6d64 48cc 9500 e54a3c34898d: http://en.wikipedia.org/wiki/Pascal
EMMO fe015383 afb3 44a6 ae86 043628697aa2: https://doi.org/10.1351/goldbook.P04442

PressureUnit
type: Class
subclass of: Restriction
  has value: T-2 L-1 M+1 I0 Θ0 N0 J0
comment: The class of units with dimensionality 'Pressure'.
EMMO 967080e5 2f42 4eb2 a3a9 c58143e835f9: The class of units with dimensionality 'Pressure'.

TitaniumSymbol
type: Class
subclass of: Restriction
  has value: Ti
comment: The symbol that stands for the titanium atom.
EMMO 967080e5 2f42 4eb2 a3a9 c58143e835f9: The symbol that stands for the titanium atom.

NanoMolePerKilogram
type: Class
subclass of: Restriction
  has value: 1e-09
subclass of: Restriction
  has value: 0.0
alternative label: Nanomoles per kilogram
EMMO 1f1b164d ec6a 4faa 8d5e 88bda62316cc: http://qudt.org/vocab/unit/NanoMOL-PER-KiloGM
EMMO 33ae2d07 5526 4555 a0b4 8f4c031b5652: nmol.kg-1
EMMO 7f1dec83 d85e 4e1b b7bd c9442d4f5a64: nmol/kg

AmountPerMassUnit
type: Class
subclass of: Restriction
  has value: T0 L0 M-1 I0 Θ0 N+1 J0
comment: The class of units with dimensionality 'AmountPerMass'.
EMMO 967080e5 2f42 4eb2 a3a9 c58143e835f9: The class of units with dimensionality 'AmountPerMass'.

PicoWattPerSquareMetre
type: Class
subclass of: Restriction
  some values from: WattPerSquareMetre
subclass of: Restriction
  has value: 1e-12
subclass of: Restriction
  has value: 0.0
comment: 0.000000000001-fold of the SI derived unit watt divided by the power of the SI base unit metre with the exponent 2 -- QUDT
alternative label: Picowatt Per Square Metre
EMMO 1f1b164d ec6a 4faa 8d5e 88bda62316cc: http://qudt.org/vocab/unit/PicoW-PER-M2
EMMO 33ae2d07 5526 4555 a0b4 8f4c031b5652: pW.m-2
EMMO 7f1dec83 d85e 4e1b b7bd c9442d4f5a64: pW/m²
EMMO 967080e5 2f42 4eb2 a3a9 c58143e835f9: 0.000000000001-fold of the SI derived unit watt divided by the power of the SI base unit metre with the exponent 2 -- QUDT

PowerDensityUnit
type: Class
subclass of: Restriction
  has value: T-3 L0 M+1 I0 Θ0 N0 J0
comment: The class of units with dimensionality 'PowerDensity'.
EMMO 967080e5 2f42 4eb2 a3a9 c58143e835f9: The class of units with dimensionality 'PowerDensity'.

Macromolecule
type: Class

PolyatomicEntity
type: Class

MutualInductance
type: Class
comment: Given an electric current in a thin conducting loop and the linked flux caused by that electric current in another loop, the mutual inductance of the two loops is the linked flux divided by the electric current.
EMMO 26bf1bef d192 4da6 b0eb d2209698fb54: https://www.wikidata.org/wiki/Q78101401
EMMO 50c298c2 55a2 4068 b3ac 4e948c33181f: https://www.electropedia.org/iev/iev.nsf/display
EMMO 8de5d5bf db1c 40ac b698 095ba3b18578: 6-41.2
EMMO 967080e5 2f42 4eb2 a3a9 c58143e835f9: Given an electric current in a thin conducting loop and the linked flux caused by that electric current in another loop, the mutual inductance of the two loops is the linked flux divided by the electric current.
EMMO fe015383 afb3 44a6 ae86 043628697aa2: https://doi.org/10.1351/goldbook.M04076

ElectricInductance
type: Class
subclass of: Restriction
comment: A property of an electrical conductor by which a change in current through it induces an electromotive force in both the conductor itself and in any nearby conductors by mutual inductance.
alternative label: Inductance
EMMO 1f1b164d ec6a 4faa 8d5e 88bda62316cc: http://qudt.org/vocab/quantitykind/Inductance
EMMO 26bf1bef d192 4da6 b0eb d2209698fb54: https://www.wikidata.org/wiki/Q177897
EMMO 50c298c2 55a2 4068 b3ac 4e948c33181f: https://www.electropedia.org/iev/iev.nsf/display
EMMO 8de5d5bf db1c 40ac b698 095ba3b18578: 6-41.1
EMMO 967080e5 2f42 4eb2 a3a9 c58143e835f9: A property of an electrical conductor by which a change in current through it induces an electromotive force in both the conductor itself and in any nearby conductors by mutual inductance.
EMMO fe015383 afb3 44a6 ae86 043628697aa2: https://doi.org/10.1351/goldbook.M04076

NanoGram
type: Class
subclass of: Restriction
  some values from: Gram
subclass of: Restriction
  has value: 1e-12
subclass of: Restriction
  has value: 0.0
comment: 10**-9 grams or one 10**-12 of the SI standard unit of mass (kilogram). -- QUDT
EMMO 1f1b164d ec6a 4faa 8d5e 88bda62316cc: http://qudt.org/vocab/unit/NanoGM
EMMO 33ae2d07 5526 4555 a0b4 8f4c031b5652: ng
EMMO 7f1dec83 d85e 4e1b b7bd c9442d4f5a64: ng
EMMO 967080e5 2f42 4eb2 a3a9 c58143e835f9: 10**-9 grams or one 10**-12 of the SI standard unit of mass (kilogram). -- QUDT

RelativeMassConcentrationOfWaterVapour
type: Class
comment: For normal cases, the relative humidity may be assumed to be equal to relative mass concentration of vapour.
comment: Ratio of the mass concentration of water vapour v to its mass concentration at saturation vsat, at the same temperature, thus ψ = v/vsat.
EMMO 1f1b164d ec6a 4faa 8d5e 88bda62316cc: https://qudt.org/vocab/quantitykind/RelativeMassConcentrationOfVapour
EMMO 26bf1bef d192 4da6 b0eb d2209698fb54: https://www.wikidata.org/wiki/Q76379357
EMMO 50c298c2 55a2 4068 b3ac 4e948c33181f: https://www.electropedia.org/iev/iev.nsf/display
EMMO 967080e5 2f42 4eb2 a3a9 c58143e835f9: Ratio of the mass concentration of water vapour v to its mass concentration at saturation vsat, at the same temperature, thus ψ = v/vsat.

RatioQuantity
type: Class
comment: Quantities defined as ratios `Q=A/B` having equal dimensions in numerator and denominator are dimensionless quantities but still have a physical dimension defined as dim(A)/dim(B). Johansson, Ingvar (2010). "Metrological thinking needs the notions of parametric quantities, units and dimensions". Metrologia. 47 (3): 219–230. doi:10.1088/0026-1394/47/3/012. ISSN 0026-1394.
comment: The class of quantities that are the ratio of two quantities with the same physical dimensionality.
example: refractive index, volume fraction, fine structure constant
EMMO 1f1b164d ec6a 4faa 8d5e 88bda62316cc: http://qudt.org/vocab/quantitykind/DimensionlessRatio
EMMO 967080e5 2f42 4eb2 a3a9 c58143e835f9: The class of quantities that are the ratio of two quantities with the same physical dimensionality.

MomentumUnit
type: Class
subclass of: Restriction
  has value: T-1 L+1 M+1 I0 Θ0 N0 J0
comment: The class of units with dimensionality 'Momentum'.
EMMO 967080e5 2f42 4eb2 a3a9 c58143e835f9: The class of units with dimensionality 'Momentum'.

PicoSiemens
type: Class
subclass of: Restriction
  some values from: Siemens
subclass of: Restriction
  has value: 1e-12
subclass of: Restriction
  has value: 0.0
EMMO 1f1b164d ec6a 4faa 8d5e 88bda62316cc: http://qudt.org/vocab/unit/PicoS
EMMO 7f1dec83 d85e 4e1b b7bd c9442d4f5a64: pS

ElectricConductanceUnit
type: Class
subclass of: Restriction
  has value: T+3 L-2 M-1 I+2 Θ0 N0 J0
comment: The class of units with dimensionality 'ElectricConductance'.
EMMO 967080e5 2f42 4eb2 a3a9 c58143e835f9: The class of units with dimensionality 'ElectricConductance'.

MilliTesla
type: Class
subclass of: Restriction
  some values from: Tesla
subclass of: Restriction
  has value: 0.001
subclass of: Restriction
  has value: 0.0
comment: 0.001-fold of the SI derived unit tesla -- QUDT
EMMO 1f1b164d ec6a 4faa 8d5e 88bda62316cc: http://qudt.org/vocab/unit/MilliT
EMMO 33ae2d07 5526 4555 a0b4 8f4c031b5652: mT
EMMO 7f1dec83 d85e 4e1b b7bd c9442d4f5a64: mT
EMMO 967080e5 2f42 4eb2 a3a9 c58143e835f9: 0.001-fold of the SI derived unit tesla -- QUDT

MagneticFluxDensityUnit
type: Class
subclass of: Restriction
  has value: T-2 L0 M+1 I-1 Θ0 N0 J0
comment: The class of units with dimensionality 'MagneticFluxDensity'.
EMMO 967080e5 2f42 4eb2 a3a9 c58143e835f9: The class of units with dimensionality 'MagneticFluxDensity'.

Tesla
type: Class
subclass of: Restriction
  has value: T
comment: SI unit for magnetic flux density or induction.
comment: The SI unit of flux density (or field intensity) for magnetic fields (also called the magnetic induction). The intensity of a magnetic field can be measured by placing a current-carrying conductor in the field. The magnetic field exerts a force on the conductor, a force which depends on the amount of the current and on the length of the conductor. One tesla is defined as the field intensity generating one newton of force per ampere of current per meter of conductor. Equivalently, one tesla represents a magnetic flux density of one weber per square meter of area. A field of one tesla is quite strong: the strongest fields available in laboratories are about 20 teslas, and the Earth's magnetic flux density, at its surface, is about 50 microteslas. The tesla, defined in 1958, honors the Serbian-American electrical engineer Nikola Tesla (1856-1943), whose work in electromagnetic induction led to the first practical generators and motors using alternating current. -- QUDT
EMMO 0b1cbe60 d380 4787 b92e be26bdacf2c2: D33
EMMO 1f1b164d ec6a 4faa 8d5e 88bda62316cc: http://qudt.org/vocab/unit/T
EMMO 33ae2d07 5526 4555 a0b4 8f4c031b5652: T
EMMO 6dd685dd 1895 46e4 b227 be9f7d643c25: http://dbpedia.org/resource/Tesla
EMMO 967080e5 2f42 4eb2 a3a9 c58143e835f9: SI unit for magnetic flux density or induction.
EMMO c7b62dd7 063a 4c2a 8504 42f7264ba83f: The SI unit of flux density (or field intensity) for magnetic fields (also called the magnetic induction). The intensity of a magnetic field can be measured by placing a current-carrying conductor in the field. The magnetic field exerts a force on the conductor, a force which depends on the amount of the current and on the length of the conductor. One tesla is defined as the field intensity generating one newton of force per ampere of current per meter of conductor. Equivalently, one tesla represents a magnetic flux density of one weber per square meter of area. A field of one tesla is quite strong: the strongest fields available in laboratories are about 20 teslas, and the Earth's magnetic flux density, at its surface, is about 50 microteslas. The tesla, defined in 1958, honors the Serbian-American electrical engineer Nikola Tesla (1856-1943), whose work in electromagnetic induction led to the first practical generators and motors using alternating current. -- QUDT
EMMO c7b62dd7 063a 4c2a 8504 42f7264ba83f: T = V·s·m⁻² = N/(A·m) = Wb/m²
EMMO c84c6752 6d64 48cc 9500 e54a3c34898d: http://en.wikipedia.org/wiki/Tesla_(unit)
EMMO fe015383 afb3 44a6 ae86 043628697aa2: https://doi.org/10.1351/goldbook.T06283

GFactorOfNucleusOrNuclearParticle
type: Class
comment: Quotient of the magnetic dipole moment of an atom, and the product of the nuclear spin quantum number and the nuclear magneton.
alternative label: NuclearGFactor
EMMO 1f1b164d ec6a 4faa 8d5e 88bda62316cc: https://qudt.org/vocab/quantitykind/GFactorOfNucleus
EMMO 26bf1bef d192 4da6 b0eb d2209698fb54: https://www.wikidata.org/wiki/Q97591250
EMMO 8de5d5bf db1c 40ac b698 095ba3b18578: 10-14.2
EMMO 967080e5 2f42 4eb2 a3a9 c58143e835f9: Quotient of the magnetic dipole moment of an atom, and the product of the nuclear spin quantum number and the nuclear magneton.

GFactor
type: Class
comment: Relation between observed magnetic moment of a particle and the related unit of magnetic moment.
EMMO 26bf1bef d192 4da6 b0eb d2209698fb54: https://www.wikidata.org/wiki/Q1951266
EMMO 967080e5 2f42 4eb2 a3a9 c58143e835f9: Relation between observed magnetic moment of a particle and the related unit of magnetic moment.

MeasurementUnit
type: Class
disjoint union of:
  rest:
    rest: nil
comment: "Real scalar quantity, defined and adopted by convention, with which any other quantity of the same kind can be compared to express the ratio of the second quantity to the first one as a number" ISO 80000-1
comment: A metrological reference for a physical quantity.
example: kg m/s km
EMMO 8a137e9f 579c 4e28 baca e8980eb0c3db: DisjointUnionOf: DimensionlessUnit, DimensionalUnit
EMMO 8a137e9f 579c 4e28 baca e8980eb0c3db: DisjointUnionOf: NonPrefixedUnit, PrefixedUnit
EMMO 967080e5 2f42 4eb2 a3a9 c58143e835f9: A metrological reference for a physical quantity.
EMMO bb49844b 45d7 4f0d 8cae 8e552cbc20d6: measurement unit (VIM3 1.9)
EMMO c7b62dd7 063a 4c2a 8504 42f7264ba83f: "Real scalar quantity, defined and adopted by convention, with which any other quantity of the same kind can be compared to express the ratio of the second quantity to the first one as a number" ISO 80000-1
EMMO c7b62dd7 063a 4c2a 8504 42f7264ba83f: "Unit symbols are mathematical entities and not abbreviations." "Symbols for units are treated as mathematical entities. In expressing the value of a quantity as the product of a numerical value and a unit, both the numerical value and the unit may be treated by the ordinary rules of algebra." https://www.bipm.org/utils/common/pdf/si-brochure/SI-Brochure-9-EN.pdf
EMMO c7b62dd7 063a 4c2a 8504 42f7264ba83f: Measurement units and procedure units are disjoint.
EMMO c7b62dd7 063a 4c2a 8504 42f7264ba83f: Quantitative value are expressed as a multiple of the 'MeasurementUnit'.

SquareDeciMetre
type: Class
subclass of: Restriction
  has value: 0.01
subclass of: Restriction
  has value: 0.0
comment: 0.1-fold of the power of the SI base unit metre with the exponent 2 -- QUDT
alternative label: Square Decimetre
EMMO 1f1b164d ec6a 4faa 8d5e 88bda62316cc: http://qudt.org/vocab/unit/DeciM2
EMMO 33ae2d07 5526 4555 a0b4 8f4c031b5652: dm2
EMMO 7f1dec83 d85e 4e1b b7bd c9442d4f5a64: dm²
EMMO 967080e5 2f42 4eb2 a3a9 c58143e835f9: 0.1-fold of the power of the SI base unit metre with the exponent 2 -- QUDT

MaterialsModel
type: Class
subclass of: Restriction
disjoint union of:
  rest:
    rest:
      rest:
        rest: nil
comment: A solvable set of one Physics Equation and one or more Materials Relations.
EMMO 967080e5 2f42 4eb2 a3a9 c58143e835f9: A solvable set of one Physics Equation and one or more Materials Relations.

PhysicsBasedModel
type: Class
subclass of: Restriction
comment: A mathematical entity based on a fundamental physics theory which defines the relations between physics quantities of an entity.
is defined by: CEN Workshop Agreement – CWA 17284 “Materials modelling – terminology, classification and metadata”
EMMO 967080e5 2f42 4eb2 a3a9 c58143e835f9: A mathematical entity based on a fundamental physics theory which defines the relations between physics quantities of an entity.

CoefficientOfFriction
type: Class
comment: Dimensionless scalar value which describes the ratio of the force of friction between two bodies and the force pressing them together; depends on the materials used, ranges from near zero to greater than one.
alternative label: FrictionCoefficient
alternative label: FrictionFactor
EMMO 26bf1bef d192 4da6 b0eb d2209698fb54: https://www.wikidata.org/wiki/Q1932524
EMMO 967080e5 2f42 4eb2 a3a9 c58143e835f9: Dimensionless scalar value which describes the ratio of the force of friction between two bodies and the force pressing them together; depends on the materials used, ranges from near zero to greater than one.
EMMO fe015383 afb3 44a6 ae86 043628697aa2: https://doi.org/10.1351/goldbook.F02530

Milli
type: Class
subclass of: Restriction
  has value: m
subclass of: Restriction
  has value: 0.001
comment: SI prefix who's value is 1/1000.
EMMO 967080e5 2f42 4eb2 a3a9 c58143e835f9: SI prefix who's value is 1/1000.

SolidAngularMeasure
type: Class
comment: Measure of a conical geometric figure, called solid angle, formed by all rays, originating from a common point, called the vertex of the solid angle, and passing through the points of a closed, non-self-intersecting curve in space considered as the border of a surface.
alternative label: SolidAngle
EMMO 1f1b164d ec6a 4faa 8d5e 88bda62316cc: https://qudt.org/vocab/quantitykind/SolidAngle
EMMO 26bf1bef d192 4da6 b0eb d2209698fb54: https://www.wikidata.org/wiki/Q208476
EMMO 50c298c2 55a2 4068 b3ac 4e948c33181f: https://www.electropedia.org/iev/iev.nsf/display
EMMO 6dd685dd 1895 46e4 b227 be9f7d643c25: https://dbpedia.org/page/Solid_angle
EMMO 8de5d5bf db1c 40ac b698 095ba3b18578: 3-8
EMMO 967080e5 2f42 4eb2 a3a9 c58143e835f9: Measure of a conical geometric figure, called solid angle, formed by all rays, originating from a common point, called the vertex of the solid angle, and passing through the points of a closed, non-self-intersecting curve in space considered as the border of a surface.
EMMO c84c6752 6d64 48cc 9500 e54a3c34898d: https://en.wikipedia.org/wiki/Solid_angle

Angle
type: Class
comment: Ratio of circular arc length to radius.
alternative label: PlaneAngle
EMMO 1f1b164d ec6a 4faa 8d5e 88bda62316cc: http://qudt.org/vocab/quantitykind/PlaneAngle
EMMO 8de5d5bf db1c 40ac b698 095ba3b18578: 3-5
EMMO 967080e5 2f42 4eb2 a3a9 c58143e835f9: Ratio of circular arc length to radius.
EMMO fe015383 afb3 44a6 ae86 043628697aa2: https://doi.org/10.1351/goldbook.A00346

MetricSubMultipleUnit
type: Class
comment: Measurement unit obtained by dividing a given measurement unit by an integer SI prefix greater than one.
EMMO 967080e5 2f42 4eb2 a3a9 c58143e835f9: Measurement unit obtained by dividing a given measurement unit by an integer SI prefix greater than one.

PerCubicCentiMetre
type: Class
subclass of: Restriction
  has value: 1000000.0
subclass of: Restriction
  has value: 0.0
comment: reciprocal of the 0.000001-fold of the power of the SI base unit metre with the exponent 3 -- QUDT
alternative label: ReciprocalCubicCentiMetre
EMMO 1f1b164d ec6a 4faa 8d5e 88bda62316cc: http://qudt.org/vocab/unit/PER-CentiM3
EMMO 33ae2d07 5526 4555 a0b4 8f4c031b5652: cm-3
EMMO 7f1dec83 d85e 4e1b b7bd c9442d4f5a64: /cm³
EMMO 967080e5 2f42 4eb2 a3a9 c58143e835f9: reciprocal of the 0.000001-fold of the power of the SI base unit metre with the exponent 3 -- QUDT

PerVolumeUnit
type: Class
subclass of: Restriction
  has value: T0 L-3 M0 I0 Θ0 N0 J0
comment: The class of units with dimensionality 'PerVolume'.
EMMO 967080e5 2f42 4eb2 a3a9 c58143e835f9: The class of units with dimensionality 'PerVolume'.

SodiumSymbol
type: Class
subclass of: Restriction
  has value: Na
comment: The symbol that stands for the sodium atom.
EMMO 967080e5 2f42 4eb2 a3a9 c58143e835f9: The symbol that stands for the sodium atom.

SolubilityProduct
type: Class
subclass of: Restriction
comment: For the dissociation of a salt AmBn → mA + nB, the solubility product is KSP = am(A) ⋅ an(B), where a is ionic activity and m and n are the stoichiometric numbers.
comment: Product of the ion activities of the ions resulting from the dissociation of a solute in a saturated solution, raised to powers equal to their stoichiometric numbers.
alternative label: SolubilityProductConstant
EMMO 26bf1bef d192 4da6 b0eb d2209698fb54: https://www.wikidata.org/wiki/Q11229788
EMMO 50c298c2 55a2 4068 b3ac 4e948c33181f: https://www.electropedia.org/iev/iev.nsf/display
EMMO 967080e5 2f42 4eb2 a3a9 c58143e835f9: Product of the ion activities of the ions resulting from the dissociation of a solute in a saturated solution, raised to powers equal to their stoichiometric numbers.
EMMO fe015383 afb3 44a6 ae86 043628697aa2: https://doi.org/10.1351/goldbook.S05742

MassChangeRate
type: Class
subclass of: Restriction
comment: Mass increment per time.
EMMO 26bf1bef d192 4da6 b0eb d2209698fb54: https://www.wikidata.org/wiki/Q92020547
EMMO 8de5d5bf db1c 40ac b698 095ba3b18578: 4-30.3
EMMO 967080e5 2f42 4eb2 a3a9 c58143e835f9: Mass increment per time.

AmperePerSquareMetreSquareKelvin
type: Class
subclass of: Restriction
  has value: 1.0
subclass of: Restriction
  has value: 0.0
comment: Ampere per square metre and square Kelvin.
EMMO 1f1b164d ec6a 4faa 8d5e 88bda62316cc: http://qudt.org/vocab/unit/A-PER-M2-K2
EMMO 33ae2d07 5526 4555 a0b4 8f4c031b5652: A.m-2.K-2
EMMO 33ae2d07 5526 4555 a0b4 8f4c031b5652: A/(m2.K2)
EMMO 7f1dec83 d85e 4e1b b7bd c9442d4f5a64: A/m²⋅k²
EMMO 967080e5 2f42 4eb2 a3a9 c58143e835f9: Ampere per square metre and square Kelvin.

RichardsonConstantUnit
type: Class
subclass of: Restriction
  has value: T0 L-2 M0 I+1 Θ-2 N0 J0
comment: The class of units with dimensionality 'RichardsonConstant'.
EMMO 967080e5 2f42 4eb2 a3a9 c58143e835f9: The class of units with dimensionality 'RichardsonConstant'.

ElectricChargePerTemperatureUnit
type: Class
subclass of: Restriction
  has value: T+1 L0 M0 I+1 Θ-1 N0 J0
comment: The class of units with dimensionality 'ElectricChargePerTemperature'.
EMMO 967080e5 2f42 4eb2 a3a9 c58143e835f9: The class of units with dimensionality 'ElectricChargePerTemperature'.

Declarer
type: Class
subclass of: Restriction
comment: An interpreter who establish the connection between an conventional sign and an object according to a specific convention.
example: A scientist that assigns a quantity to a physical objects without actually measuring it but taking it for granted due to its previous experience (e.g. considering an electron charge as 1.6027663e-19 C, assigning a molecular mass to a gas only by the fact of a name on the bottle).
example: Someone who assigns a name to an object.
EMMO 8a137e9f 579c 4e28 baca e8980eb0c3db: EquivalentTo: Determiner or Namer
EMMO 967080e5 2f42 4eb2 a3a9 c58143e835f9: An interpreter who establish the connection between an conventional sign and an object according to a specific convention.

InterpreterByReferent
type: Class
comment: Interpreter classified by how the sign stands for its reference object.
EMMO 967080e5 2f42 4eb2 a3a9 c58143e835f9: Interpreter classified by how the sign stands for its reference object.

SecondPolarMomentOfArea
type: Class
subclass of: Restriction
comment: A geometrical property of an area which reflects how its points are distributed with regard to an arbitrary axis.
EMMO 1f1b164d ec6a 4faa 8d5e 88bda62316cc: https://qudt.org/vocab/quantitykind/SecondPolarMomentOfArea
EMMO 26bf1bef d192 4da6 b0eb d2209698fb54: https://www.wikidata.org/wiki/Q1049636
EMMO 50c298c2 55a2 4068 b3ac 4e948c33181f: https://www.electropedia.org/iev/iev.nsf/display
EMMO 8de5d5bf db1c 40ac b698 095ba3b18578: 4-21.2
EMMO 967080e5 2f42 4eb2 a3a9 c58143e835f9: A geometrical property of an area which reflects how its points are distributed with regard to an arbitrary axis.

BeginTask
type: Class
comment: An initial task of a workflow.
comment: There may be more than one begin task, if they run in parallel.
EMMO 967080e5 2f42 4eb2 a3a9 c58143e835f9: An initial task of a workflow.
EMMO c7b62dd7 063a 4c2a 8504 42f7264ba83f: There may be more than one begin task, if they run in parallel.

TaskByPosition
type: Class
EMMO 157fdf31 6387 42be 8e72 10530519214a: A task in a workflow, categorised by its position in the workflow.

BeginTile
type: Class
comment: A direct part that only is the source, but not the target of temporal relations.
EMMO 967080e5 2f42 4eb2 a3a9 c58143e835f9: A direct part that only is the source, but not the target of temporal relations.

WattPerKilogram
type: Class
subclass of: Restriction
  has value: 1.0
subclass of: Restriction
  has value: 0.0
comment: SI derived unit watt divided by the SI base unit kilogram -- QUDT
alternative label: Watt Per Kilogram
EMMO 1f1b164d ec6a 4faa 8d5e 88bda62316cc: http://qudt.org/vocab/unit/W-PER-KiloGM
EMMO 33ae2d07 5526 4555 a0b4 8f4c031b5652: W.kg-1
EMMO 33ae2d07 5526 4555 a0b4 8f4c031b5652: W/kg
EMMO 7f1dec83 d85e 4e1b b7bd c9442d4f5a64: W/kg
EMMO 967080e5 2f42 4eb2 a3a9 c58143e835f9: SI derived unit watt divided by the SI base unit kilogram -- QUDT

CausalStructure
type: Class
comment: A causal structure expresses itself in time and space thanks to the underlying causality relations between its constituent quantum entities. It must at least provide two temporal parts. The unity criterion beyond the definition of a causal structure (the most general concept of structure) is the existence of an undirected causal path between each of its parts.
comment: The class of individuals representing causally self-connected world entities.
comment: The disjoint union of Causal Path and CausalSystem classes.
comment: The most fundamental unity criterion for the definition of an structure is that: - is made of at least two quantums (a structure is not a simple entity) - all quantum parts form a causally connected graph
EMMO 31252f35 c767 4b97 a877 1235076c3e13: The most fundamental unity criterion for the definition of an structure is that: - is made of at least two quantums (a structure is not a simple entity) - all quantum parts form a causally connected graph
EMMO 70fe84ff 99b6 4206 a9fc 9a8931836d84: The disjoint union of Causal Path and CausalSystem classes.
EMMO 8a137e9f 579c 4e28 baca e8980eb0c3db: EquivalentTo: CausalPath or CausalSystem
EMMO 967080e5 2f42 4eb2 a3a9 c58143e835f9: The class of individuals representing causally self-connected world entities.
EMMO c7b62dd7 063a 4c2a 8504 42f7264ba83f: A causal structure expresses itself in time and space thanks to the underlying causality relations between its constituent quantum entities. It must at least provide two temporal parts. The unity criterion beyond the definition of a causal structure (the most general concept of structure) is the existence of an undirected causal path between each of its parts.

CPlusPlus
type: Class
comment: A language object respecting the syntactic rules of C++.
alternative label: C++
EMMO 967080e5 2f42 4eb2 a3a9 c58143e835f9: A language object respecting the syntactic rules of C++.

CompiledLanguage
type: Class

NewtonMetre
type: Class
subclass of: Restriction
  has value: 1.0
subclass of: Restriction
  has value: 0.0
comment: "Torque" is the tendency of a force to cause a rotation, is the product of the force and the distance from the center of rotation to the point where the force is applied. Torque has the same units as work or energy, but it is a different physical concept. To stress the difference, scientists measure torque in newton meters rather than in joules, the SI unit of work. One newton meter is approximately 0.737562 pound foot. -- QUDT
comment: Note that the physical dimension is the same as for Joule.
EMMO 1f1b164d ec6a 4faa 8d5e 88bda62316cc: http://qudt.org/vocab/unit/N-M
EMMO 209ba1b3 149f 4ff0 b672 941610eafd72: http://www.ontology-of-units-of-measure.org/resource/om-2/newtonMetre
EMMO 967080e5 2f42 4eb2 a3a9 c58143e835f9: "Torque" is the tendency of a force to cause a rotation, is the product of the force and the distance from the center of rotation to the point where the force is applied. Torque has the same units as work or energy, but it is a different physical concept. To stress the difference, scientists measure torque in newton meters rather than in joules, the SI unit of work. One newton meter is approximately 0.737562 pound foot. -- QUDT

EnergyUnit
type: Class
subclass of: Restriction
  has value: T-2 L+2 M+1 I0 Θ0 N0 J0
comment: The class of units with dimensionality 'Energy'.
EMMO 967080e5 2f42 4eb2 a3a9 c58143e835f9: The class of units with dimensionality 'Energy'.

OsmoticCoefficientOfSolvent
type: Class
comment: Quantity characterizing the deviation of a solvent from ideal behavior.
alternative label: OsmoticFactorOfSolvent
EMMO 1f1b164d ec6a 4faa 8d5e 88bda62316cc: https://qudt.org/vocab/quantitykind/OsmoticCoefficient
EMMO 26bf1bef d192 4da6 b0eb d2209698fb54: https://www.wikidata.org/wiki/Q5776102
EMMO 8de5d5bf db1c 40ac b698 095ba3b18578: 9-27.2
EMMO 967080e5 2f42 4eb2 a3a9 c58143e835f9: Quantity characterizing the deviation of a solvent from ideal behavior.
EMMO fe015383 afb3 44a6 ae86 043628697aa2: https://doi.org/10.1351/goldbook.O04342

ZirconiumSymbol
type: Class
subclass of: Restriction
  has value: Zr
comment: The symbol that stands for the zirconium atom.
EMMO 967080e5 2f42 4eb2 a3a9 c58143e835f9: The symbol that stands for the zirconium atom.

MetricMultipleUnit
type: Class
comment: Measurement unit obtained by multiplying a given measurement unit by an integer SI prefix greater than one.
EMMO 967080e5 2f42 4eb2 a3a9 c58143e835f9: Measurement unit obtained by multiplying a given measurement unit by an integer SI prefix greater than one.

IonTransportNumber
type: Class
comment: Faction of electrical current carried by given ionic species.
alternative label: CurrentFraction
alternative label: TransferrenceNumber
EMMO 1f1b164d ec6a 4faa 8d5e 88bda62316cc: https://qudt.org/vocab/quantitykind/IonTransportNumber
EMMO 26bf1bef d192 4da6 b0eb d2209698fb54: https://www.wikidata.org/wiki/Q331854
EMMO 8de5d5bf db1c 40ac b698 095ba3b18578: 9-46
EMMO 967080e5 2f42 4eb2 a3a9 c58143e835f9: Faction of electrical current carried by given ionic species.
EMMO fe015383 afb3 44a6 ae86 043628697aa2: https://doi.org/10.1351/goldbook.I03181
EMMO fe015383 afb3 44a6 ae86 043628697aa2: https://doi.org/10.1351/goldbook.T06489

Farad
type: Class
subclass of: Restriction
  has value: F
comment: Measurement unit for electric capacitance.
comment: The SI unit of electric capacitance. Very early in the study of electricity scientists discovered that a pair of conductors separated by an insulator can store a much larger charge than an isolated conductor can store. The better the insulator, the larger the charge that the conductors can hold. This property of a circuit is called capacitance, and it is measured in farads. One farad is defined as the ability to store one coulomb of charge per volt of potential difference between the two conductors. This is a natural definition, but the unit it defines is very large. In practical circuits, capacitance is often measured in microfarads, nanofarads, or sometimes even in picofarads (10⁻¹² farad, or trillionths of a farad). The unit is named for the British physicist Michael Faraday (1791-1867), who was known for his work in electricity and electrochemistry. -- QUDT
EMMO 0b1cbe60 d380 4787 b92e be26bdacf2c2: FAR
EMMO 1f1b164d ec6a 4faa 8d5e 88bda62316cc: http://qudt.org/vocab/unit/FARAD
EMMO 33ae2d07 5526 4555 a0b4 8f4c031b5652: F
EMMO 6dd685dd 1895 46e4 b227 be9f7d643c25: http://dbpedia.org/resource/Farad
EMMO 967080e5 2f42 4eb2 a3a9 c58143e835f9: The SI unit of electric capacitance. Very early in the study of electricity scientists discovered that a pair of conductors separated by an insulator can store a much larger charge than an isolated conductor can store. The better the insulator, the larger the charge that the conductors can hold. This property of a circuit is called capacitance, and it is measured in farads. One farad is defined as the ability to store one coulomb of charge per volt of potential difference between the two conductors. This is a natural definition, but the unit it defines is very large. In practical circuits, capacitance is often measured in microfarads, nanofarads, or sometimes even in picofarads (10⁻¹² farad, or trillionths of a farad). The unit is named for the British physicist Michael Faraday (1791-1867), who was known for his work in electricity and electrochemistry. -- QUDT
EMMO c84c6752 6d64 48cc 9500 e54a3c34898d: http://en.wikipedia.org/wiki/Farad
EMMO fe015383 afb3 44a6 ae86 043628697aa2: https://doi.org/10.1351/goldbook.F02320

TensileForming
type: Class
comment: Forming of a solid body, whereby the plastic state is essentially brought about by a combined tensile and compressive stress.
alternative label: Zugdruckumformen

ReshapeManufacturing
type: Class
comment: A manufacturing in which workpieces are produced from solid raw parts through permanent deformation, provided that neither material is added nor removed.
comment: The mass of the raw part is equal to the mass of the finished part.
see also: DIN 8580:2020
alternative label: Forming
alternative label: Umformen @de
EMMO 967080e5 2f42 4eb2 a3a9 c58143e835f9: A manufacturing in which workpieces are produced from solid raw parts through permanent deformation, provided that neither material is added nor removed.
EMMO c7b62dd7 063a 4c2a 8504 42f7264ba83f: The mass of the raw part is equal to the mass of the finished part.

DubniumSymbol
type: Class
subclass of: Restriction
  has value: Db
comment: The symbol that stands for the dubnium atom.
EMMO 967080e5 2f42 4eb2 a3a9 c58143e835f9: The symbol that stands for the dubnium atom.

HafniumSymbol
type: Class
subclass of: Restriction
  has value: Hf
comment: The symbol that stands for the hafnium atom.
EMMO 967080e5 2f42 4eb2 a3a9 c58143e835f9: The symbol that stands for the hafnium atom.

ParticulateMatter
type: Class
equivalent class: Class
comment: Bounded matter.
EMMO 967080e5 2f42 4eb2 a3a9 c58143e835f9: Bounded matter.

ChemicalEntity
type: Class
disjoint union of:
  rest:
    rest: nil
comment: A chemical entity comprises the two different ways to represents matter: as single recognizable particle entity (molecular entity) and as a composition of particle entities (substance). This distinction is not well assessed in actual chemical nomenclature, in which an element name refers to both the pure elemental substance or the atom. In the EMMO we force the adoption of a more strict categorization based on mereotopology. The class Material hosts the subclasses for which a substance can be identified without necessarily considering its nature of molecule/atom or substance (e.g. hydrocarbon is the class of both hydrocarbon molecules or gases).

ThuliumAtom
type: Class
subclass of: Restriction
subclass of: Restriction
  has value: 168.93422
subclass of: Restriction
  has value: 69
comment: Atom subclass for thulium.
EMMO 967080e5 2f42 4eb2 a3a9 c58143e835f9: Atom subclass for thulium.

PromethiumSymbol
type: Class
subclass of: Restriction
  has value: Pm
comment: The symbol that stands for the promethium atom.
EMMO 967080e5 2f42 4eb2 a3a9 c58143e835f9: The symbol that stands for the promethium atom.

NanoFarad
type: Class
subclass of: Restriction
  some values from: Farad
subclass of: Restriction
  has value: 1e-09
subclass of: Restriction
  has value: 0.0
comment: A common metric unit of electric capacitance equal to 10⁻⁹ farad. This unit was previously called the millimicrofarad. -- QUDT
EMMO 1f1b164d ec6a 4faa 8d5e 88bda62316cc: http://qudt.org/vocab/unit/NanoFARAD
EMMO 33ae2d07 5526 4555 a0b4 8f4c031b5652: nF
EMMO 7f1dec83 d85e 4e1b b7bd c9442d4f5a64: nF
EMMO 967080e5 2f42 4eb2 a3a9 c58143e835f9: A common metric unit of electric capacitance equal to 10⁻⁹ farad. This unit was previously called the millimicrofarad. -- QUDT
EMMO c84c6752 6d64 48cc 9500 e54a3c34898d: http://en.wikipedia.org/wiki/Farad

PicoSiemensPerMetre
type: Class
subclass of: Restriction
  some values from: SiemensPerMetre
subclass of: Restriction
  has value: 1e-12
subclass of: Restriction
  has value: 0.0
comment: 0.000000000001-fold of the SI derived unit Siemens divided by the SI base unit metre -- QUDT
alternative label: Picosiemens Per Metre
EMMO 1f1b164d ec6a 4faa 8d5e 88bda62316cc: http://qudt.org/vocab/unit/PicoS-PER-M
EMMO 33ae2d07 5526 4555 a0b4 8f4c031b5652: pS.m-1
EMMO 7f1dec83 d85e 4e1b b7bd c9442d4f5a64: pS/m
EMMO 967080e5 2f42 4eb2 a3a9 c58143e835f9: 0.000000000001-fold of the SI derived unit Siemens divided by the SI base unit metre -- QUDT

String
type: Class
comment: A physical made of more than one symbol sequentially arranged.
comment: A string is made of concatenated symbols whos arrangement is one-dimensional. Each symbol can have only one previous and one next neighborhood (bidirectional list).
example: The word "cat" considered as a collection of 'symbol'-s respecting the rules of english language. In this example the 'symbolic' entity "cat" is not related to the real cat, but it is only a word (like it would be to an italian person that ignores the meaning of this english word). If an 'interpreter' skilled in english language is involved in a 'semiotic' process with this word, that "cat" became also a 'sign' i.e. it became for the 'interpreter' a representation for a real cat.
EMMO 967080e5 2f42 4eb2 a3a9 c58143e835f9: A physical made of more than one symbol sequentially arranged.
EMMO c7b62dd7 063a 4c2a 8504 42f7264ba83f: A string is made of concatenated symbols whos arrangement is one-dimensional. Each symbol can have only one previous and one next neighborhood (bidirectional list).
EMMO c7b62dd7 063a 4c2a 8504 42f7264ba83f: A string is not requested to respect any syntactic rule: it's simply directly made of symbols.

WorkPiece
type: Class
comment: A WorkPiece is physical artifact, that has a proper shape and occupyes a proper volume intended for subsequent transformation. It is a condensed state, so it is a compact body that is processed or has to be processed.
comment: A solid is defined as a portion of matter that is in a condensed state characterised by resistance to deformation and volume changes.
comment: In manufacturing, a workpiece is a single, delimited part of largely solid material that is processed in some form (e.g. stone ).
comment: In physics, a rigid body (also known as a rigid object[2]) is a solid body in which deformation is zero or so small it can be neglected. The distance between any two given points on a rigid body remains constant in time regardless of external forces or moments exerted on it. A rigid body is usually considered as a continuous distribution of mass.
comment: It has a shape, so we conclude that it is solid
comment: Object that is processed with a machine
comment: Seems to have to be processed through mechanical deformation. So it takes part of a manufacturing process. It is a Manufactured Product and it can be a Commercial Product
comment: The raw material or partially finished piece that is shaped by performing various operations.
comment: They are not powders or threads
comment: a physical artifact, real or virtual, intended for subsequent transformation within some manufacturing operation
comment: fili e polveri non sono compresi
comment: it seems to be an intermediate product, that has to reach the final shape.
comment: it seems to be solid, so it has a proper shape
comment: powder is not workpiece because it has the shape of the recipient containing them
alternative label: Werkstück
EMMO 967080e5 2f42 4eb2 a3a9 c58143e835f9: A WorkPiece is physical artifact, that has a proper shape and occupyes a proper volume intended for subsequent transformation. It is a condensed state, so it is a compact body that is processed or has to be processed.

TaskTile
type: Class
comment: A task that is a well formed tile of a workflow, according to a reductionistic description.
comment: A task tile is part of a specific granularity level for the workflow description, as composition of tasks.
comment: While a task is only an holistic part of a workflow, a task tile provide a more precise context about the placement of a task in the topological structure of a workflow by using a reductionistic categorization. A workflow is now seen as a tiling and the task is on of its tiles.
alternative label: Step
EMMO 31252f35 c767 4b97 a877 1235076c3e13: While a task is only an holistic part of a workflow, a task tile provide a more precise context about the placement of a task in the topological structure of a workflow by using a reductionistic categorization. A workflow is now seen as a tiling and the task is on of its tiles.
EMMO 967080e5 2f42 4eb2 a3a9 c58143e835f9: A task that is a well formed tile of a workflow, according to a reductionistic description.
EMMO c7b62dd7 063a 4c2a 8504 42f7264ba83f: A task tile is part of a specific granularity level for the workflow description, as composition of tasks.

Task
type: Class
subclass of: Restriction
comment: A procedure that is an hoilistic part of a workflow.
comment: A task is a generic part of a workflow, without taking care of the task granularities. It means that you can declare that e.g. tightening a bolt is a task of building an airplane, without caring of the coarser tasks to which this tightening belongs.
comment: The concept of task is developed in strict connection with the concept of workflow: a task is always part of a workflow and a workflow always possess some tasks. This makes the relation between task and workflow an holistic relation, with task as role and workflow as whole. A task is also holistically connected to an intentional agent, since a task is defined as a procedure. For this reason a task is both a role, with respect to a workflow, and a whole, with respect to an intentional agent.
alternative label: Job
EMMO 31252f35 c767 4b97 a877 1235076c3e13: The concept of task is developed in strict connection with the concept of workflow: a task is always part of a workflow and a workflow always possess some tasks. This makes the relation between task and workflow an holistic relation, with task as role and workflow as whole. A task is also holistically connected to an intentional agent, since a task is defined as a procedure. For this reason a task is both a role, with respect to a workflow, and a whole, with respect to an intentional agent.
EMMO 967080e5 2f42 4eb2 a3a9 c58143e835f9: A procedure that is an hoilistic part of a workflow.
EMMO c7b62dd7 063a 4c2a 8504 42f7264ba83f: A task is a generic part of a workflow, without taking care of the task granularities. It means that you can declare that e.g. tightening a bolt is a task of building an airplane, without caring of the coarser tasks to which this tightening belongs.

Tile
type: Class
subclass of: Restriction
comment: A causal object that is direct part of a tessellation.
EMMO 967080e5 2f42 4eb2 a3a9 c58143e835f9: A causal object that is direct part of a tessellation.

ISQBaseQuantity
type: Class
comment: Base quantities defined in the International System of Quantities (ISQ).
EMMO 967080e5 2f42 4eb2 a3a9 c58143e835f9: Base quantities defined in the International System of Quantities (ISQ).
EMMO c84c6752 6d64 48cc 9500 e54a3c34898d: https://en.wikipedia.org/wiki/International_System_of_Quantities

LithiumSymbol
type: Class
subclass of: Restriction
  has value: Li
comment: The symbol that stands for the lithium atom.
EMMO 967080e5 2f42 4eb2 a3a9 c58143e835f9: The symbol that stands for the lithium atom.

Collection
type: Class
subclass of: Restriction
  min qualified cardinality: 2
comment: A collection is the concept that complements the item. A collection is an entity that has at least one part non directly causally connected with the rest. A collection can be partitioned in maximally connected items called members. The members are self-connected entities and there is no direct causality relation between them. The combination of collection and item concepts is the EMMO mereocausality alternative to set theory. However, two items can be members only if they are non direct causally connected, giving some constraints to a collection definition. For example, two entities which are directly connected cannot be two distinct members, while their interiors (i.e. the entities obtained by removing the layer of parts that provides the causal contact between them) can be.
comment: The class of not direct causally self-connected world entities.
example: The collection of users of a particular software, the collection of atoms that have been part of that just dissociated molecule.
EMMO 31252f35 c767 4b97 a877 1235076c3e13: A collection is the concept that complements the item. A collection is an entity that has at least one part non directly causally connected with the rest. A collection can be partitioned in maximally connected items called members. The members are self-connected entities and there is no direct causality relation between them. The combination of collection and item concepts is the EMMO mereocausality alternative to set theory. However, two items can be members only if they are non direct causally connected, giving some constraints to a collection definition. For example, two entities which are directly connected cannot be two distinct members, while their interiors (i.e. the entities obtained by removing the layer of parts that provides the causal contact between them) can be.
EMMO 967080e5 2f42 4eb2 a3a9 c58143e835f9: The class of not direct causally self-connected world entities.

CausalCluster
type: Class
comment: The class of individuals representing causal clusters.
comment: The disjoint union of the CausalSystem and Collection classes.
comment: With the causal cluster term we address an heterogeneous group of entities, which possess the common feature of having at least two causally non connected quanta. It comprises collections (non self-connected entities) and causal systems (entities extended in space).
EMMO 31252f35 c767 4b97 a877 1235076c3e13: With the causal cluster term we address an heterogeneous group of entities, which possess the common feature of having at least two causally non connected quanta. It comprises collections (non self-connected entities) and causal systems (entities extended in space).
EMMO 70fe84ff 99b6 4206 a9fc 9a8931836d84: The disjoint union of the CausalSystem and Collection classes.
EMMO 8a137e9f 579c 4e28 baca e8980eb0c3db: EquivalentTo: Collection or CausalSystem
EMMO 967080e5 2f42 4eb2 a3a9 c58143e835f9: The class of individuals representing causal clusters.

MicroCoulomb
type: Class
subclass of: Restriction
  some values from: Coulomb
subclass of: Restriction
  has value: 1e-06
subclass of: Restriction
  has value: 0.0
comment: A MicroCoulomb is 10⁻⁶ C. -- QUDT
EMMO 1f1b164d ec6a 4faa 8d5e 88bda62316cc: http://qudt.org/vocab/unit/MicroC
EMMO 33ae2d07 5526 4555 a0b4 8f4c031b5652: uC
EMMO 7f1dec83 d85e 4e1b b7bd c9442d4f5a64: µC
EMMO 967080e5 2f42 4eb2 a3a9 c58143e835f9: A MicroCoulomb is 10⁻⁶ C. -- QUDT

ElectricChargePerAmountUnit
type: Class
subclass of: Restriction
  has value: T+1 L0 M0 I+1 Θ0 N-1 J0
comment: The class of units with dimensionality 'ElectricChargePerAmount'.
EMMO 967080e5 2f42 4eb2 a3a9 c58143e835f9: The class of units with dimensionality 'ElectricChargePerAmount'.

Deducer
type: Class
subclass of: Restriction
comment: An interpreter who establish the connection between an index sign and an object according to a causal contiguity.
example: Someone who deduces an emotional status of a persona according to facial expression.
example: Someone who deduces the occurring of a physical phenomenon through other phenomena.
EMMO 967080e5 2f42 4eb2 a3a9 c58143e835f9: An interpreter who establish the connection between an index sign and an object according to a causal contiguity.

MicroMetrePerKelvin
type: Class
subclass of: Restriction
  has value: 1e-06
subclass of: Restriction
  has value: 0.0
comment: 0.000001-fold of the SI base unit metre divided by the SI base unit kelvin -- QUDT
alternative label: Micrometre Per Kelvin
EMMO 1f1b164d ec6a 4faa 8d5e 88bda62316cc: http://qudt.org/vocab/unit/MicroM-PER-K
EMMO 33ae2d07 5526 4555 a0b4 8f4c031b5652: um.K-1
EMMO 7f1dec83 d85e 4e1b b7bd c9442d4f5a64: μm/K
EMMO 967080e5 2f42 4eb2 a3a9 c58143e835f9: 0.000001-fold of the SI base unit metre divided by the SI base unit kelvin -- QUDT

KilogramSquareMetrePerSecond
type: Class
subclass of: Restriction
  has value: 1.0
subclass of: Restriction
  has value: 0.0
comment: "Kilogram Square Meter Per Second" is a unit for 'Angular Momentum' expressed as kg-m²-s⁻¹. -- QUDT
alternative label: Kilogram Square Metre Per Second
EMMO 1f1b164d ec6a 4faa 8d5e 88bda62316cc: http://qudt.org/vocab/unit/KiloGM-M2-PER-SEC
EMMO 33ae2d07 5526 4555 a0b4 8f4c031b5652: kg.m2.s-1
EMMO 7f1dec83 d85e 4e1b b7bd c9442d4f5a64: kg⋅m²/s
EMMO 967080e5 2f42 4eb2 a3a9 c58143e835f9: "Kilogram Square Meter Per Second" is a unit for 'Angular Momentum' expressed as kg-m²-s⁻¹. -- QUDT

AngularMomentumUnit
type: Class
subclass of: Restriction
  has value: T-1 L+2 M+1 I0 Θ0 N0 J0
comment: The class of units with dimensionality 'AngularMomentum'.
EMMO 967080e5 2f42 4eb2 a3a9 c58143e835f9: The class of units with dimensionality 'AngularMomentum'.

EMMO
type: Class
subclass of: Thing
subclass of: Restriction
comment: EMMO entities dimensionality is related to their mereocausal structures. From the no-dimensional quantum entity, we introduce time dimension with the elementary concept, and space with the causal system concept. The EMMO conceptualisation does not allow the existence of space without a temporal dimension, the latter coming from a causal relation between entities. For this reason, the EMMO entities that are not quantum or elementaries, may be considered to be always 4D spatiotemporal entities. Moreover, the combination of mereology and causality used in the EMMO theory (mereocausality) represents entities as direct acyclic graphs with dimension of 4 (i.e., the mereocasual graph can be represented in a 4D euclidian space with edges having unit length). For this reasons, the EMMO can be considered a 4D ontology.
comment: The EMMO conceptualises the world using the primitive concepts of causality and parthood. Parthood is about the composition of world entities starting from other more fundamental entities. Causality is about the interactions between world entities. The quantum is the smallest indivisible part of any world entity. Quantum individuals are the fundamental causal constituents of the universe, since it is implied that causality originates from quantum-to-quantum interactions. Quantums are no-dimensional, and their aggregation makes spacetime emerge from their causal structure. We can think of a quantum as an elementary particle after and interaction and before another interaction. Causality between macro entities (i.e. entities made of more than one quantum) is explained as the sum of the causality relations between their quantum constituents. Fundamental interactions (quantum fields) are represented as symmetric causality relation between macro entities, while classical interactions are mediated by chain of quantums (i.e. elementary particles). The fundamental distinction between world entities is causality self-connectedness: a world entity can be self-connected xor not self-connected depending on the causality network of its fundamental components. Void regions do not exist in the EMMO. In other words there is no spacetime without entities and spacetime emerges as relational property not as a self-standing entity). Entities are not placed in space or time: space and time are measured quantities, always relative between entities and are measured. In other words, space and time relations originates from causality interactions.
comment: The class of all the OWL individuals representing world entities according to EMMO conceptualisation.
comment: The disjoint union of the fundamental mereocausal classes of Quantum, CausalPath, CausalSystem and Collection.
EMMO 31252f35 c767 4b97 a877 1235076c3e13: The EMMO conceptualises the world using the primitive concepts of causality and parthood. Parthood is about the composition of world entities starting from other more fundamental entities. Causality is about the interactions between world entities. The quantum is the smallest indivisible part of any world entity. Quantum individuals are the fundamental causal constituents of the universe, since it is implied that causality originates from quantum-to-quantum interactions. Quantums are no-dimensional, and their aggregation makes spacetime emerge from their causal structure. We can think of a quantum as an elementary particle after and interaction and before another interaction. Causality between macro entities (i.e. entities made of more than one quantum) is explained as the sum of the causality relations between their quantum constituents. Fundamental interactions (quantum fields) are represented as symmetric causality relation between macro entities, while classical interactions are mediated by chain of quantums (i.e. elementary particles). The fundamental distinction between world entities is causality self-connectedness: a world entity can be self-connected xor not self-connected depending on the causality network of its fundamental components. Void regions do not exist in the EMMO. In other words there is no spacetime without entities and spacetime emerges as relational property not as a self-standing entity). Entities are not placed in space or time: space and time are measured quantities, always relative between entities and are measured. In other words, space and time relations originates from causality interactions.
EMMO 70fe84ff 99b6 4206 a9fc 9a8931836d84: The disjoint union of the fundamental mereocausal classes of Quantum, CausalPath, CausalSystem and Collection.
EMMO 8a137e9f 579c 4e28 baca e8980eb0c3db: DisjointUnion: CausalPath, Collection, Quantum, CausalSystem
EMMO 967080e5 2f42 4eb2 a3a9 c58143e835f9: The class of all the OWL individuals representing world entities according to EMMO conceptualisation.
EMMO c7b62dd7 063a 4c2a 8504 42f7264ba83f: EMMO entities dimensionality is related to their mereocausal structures. From the no-dimensional quantum entity, we introduce time dimension with the elementary concept, and space with the causal system concept. The EMMO conceptualisation does not allow the existence of space without a temporal dimension, the latter coming from a causal relation between entities. For this reason, the EMMO entities that are not quantum or elementaries, may be considered to be always 4D spatiotemporal entities. Moreover, the combination of mereology and causality used in the EMMO theory (mereocausality) represents entities as direct acyclic graphs with dimension of 4 (i.e., the mereocasual graph can be represented in a 4D euclidian space with edges having unit length). For this reasons, the EMMO can be considered a 4D ontology.

MatterByType
type: Class

MagneticFlux
type: Class
subclass of: Restriction
comment: Measure of magnetism, taking account of the strength and the extent of a magnetic field.
EMMO 1f1b164d ec6a 4faa 8d5e 88bda62316cc: http://qudt.org/vocab/quantitykind/MagneticFlux
EMMO 26bf1bef d192 4da6 b0eb d2209698fb54: https://www.wikidata.org/wiki/Q177831
EMMO 50c298c2 55a2 4068 b3ac 4e948c33181f: https://www.electropedia.org/iev/iev.nsf/display
EMMO 6dd685dd 1895 46e4 b227 be9f7d643c25: https://dbpedia.org/page/Magnetic_flux
EMMO 8de5d5bf db1c 40ac b698 095ba3b18578: 6-22.1
EMMO 967080e5 2f42 4eb2 a3a9 c58143e835f9: Measure of magnetism, taking account of the strength and the extent of a magnetic field.
EMMO c84c6752 6d64 48cc 9500 e54a3c34898d: https://en.wikipedia.org/wiki/Magnetic_flux
EMMO fe015383 afb3 44a6 ae86 043628697aa2: https://doi.org/10.1351/goldbook.M03684

ElectromagneticQuantity
type: Class
comment: Quantities categorised according to ISO 80000-6.
EMMO 967080e5 2f42 4eb2 a3a9 c58143e835f9: Quantities categorised according to ISO 80000-6.

Object
type: Class
comment: An item can be classified as an object according to a type ϕ (a ϕ-object) if it's a ϕ all its temporal item parts are also of type ϕ. This conceptualisation tries to catch the persistency of type in the temporal parts of an entity.
comment: Indefinitely temporally slicing of an entity leads to temporal parts whose temporal extension is so small that the connectivity relations that define the entity as an item will no longer hold. More generally. a temporal part is no more of type ϕ when the temporal interval is lower than the interval that characterizes the causality interactions between the object parts. In other terms, if the time span of a temporal part is lower than the inverse of the frequency of interactions between the constituents, then the constituents in such temporal part are not connected. The object is no more an object, neither an item, but simply a collection of fundamental quantum parts. For this reason, the definition of object is done by considering only item temporal parts, meaning that slicing in time has the lower limit of a self-connected (i.e. item) entity.
comment: The superclass for causal structure classes whose individuals have all temporal item parts of the same type of the whole.
alternative label: Continuant
alternative label: Endurant
example: Practically speaking, the Object class can be populated by primitive subclasses (e.g. Car) for each of which holds the axiom that all the item parts are of the same type of the whole (e.g. Car SubClassOf hasTemporalItemPart only Car). The intended usage is not for an individual to belong directly to Object, but to belong to a specific subclass of Object that identifies entities with a type-persistent structure.
EMMO 31252f35 c767 4b97 a877 1235076c3e13: An item can be classified as an object according to a type ϕ (a ϕ-object) if it's a ϕ all its temporal item parts are also of type ϕ. This conceptualisation tries to catch the persistency of type in the temporal parts of an entity.
EMMO 8a137e9f 579c 4e28 baca e8980eb0c3db: Equivalent To: Constituent or Participant or Status or SubObject
EMMO 967080e5 2f42 4eb2 a3a9 c58143e835f9: The superclass for causal structure classes whose individuals have all temporal item parts of the same type of the whole.
EMMO c7b62dd7 063a 4c2a 8504 42f7264ba83f: Indefinitely temporally slicing of an entity leads to temporal parts whose temporal extension is so small that the connectivity relations that define the entity as an item will no longer hold. More generally. a temporal part is no more of type ϕ when the temporal interval is lower than the interval that characterizes the causality interactions between the object parts. In other terms, if the time span of a temporal part is lower than the inverse of the frequency of interactions between the constituents, then the constituents in such temporal part are not connected. The object is no more an object, neither an item, but simply a collection of fundamental quantum parts. For this reason, the definition of object is done by considering only item temporal parts, meaning that slicing in time has the lower limit of a self-connected (i.e. item) entity.

Persistence
type: Class
comment: The persistence perspective classifies entities according to the persistence of temporal parts of specifc type, introducing the distiction between objects (when a type is conserved through all its time parts) or processes (where a type is not conserved through all its time parts). This perspective provides classes aimed to represent concepts similar to the ones of endurant and perdurant (a.k.a. continuant and occurrent). However, in the EMMO case, an entity is defined as an object or a process according to a specific type, and not per-se. For this reason an entity in the EMMO can be classified both object or a process depending on the reference type, due to the underlying 4D framework (e.g. an individual may belong both to the class of runners and the class of running process), and the distinction is purely representational. This categorisation has been introduced due to the large use of object/process commonsensical concepts, and the fact that our language distinguish between nouns and verbs to address things, forcing the separation between things that happens and things that persist.
comment: The union of the object or process classes.
EMMO 8a137e9f 579c 4e28 baca e8980eb0c3db: EquivalentTo: Process or Object
EMMO 967080e5 2f42 4eb2 a3a9 c58143e835f9: The union of the object or process classes.
EMMO c7b62dd7 063a 4c2a 8504 42f7264ba83f: The persistence perspective classifies entities according to the persistence of temporal parts of specifc type, introducing the distiction between objects (when a type is conserved through all its time parts) or processes (where a type is not conserved through all its time parts). This perspective provides classes aimed to represent concepts similar to the ones of endurant and perdurant (a.k.a. continuant and occurrent). However, in the EMMO case, an entity is defined as an object or a process according to a specific type, and not per-se. For this reason an entity in the EMMO can be classified both object or a process depending on the reference type, due to the underlying 4D framework (e.g. an individual may belong both to the class of runners and the class of running process), and the distinction is purely representational. This categorisation has been introduced due to the large use of object/process commonsensical concepts, and the fact that our language distinguish between nouns and verbs to address things, forcing the separation between things that happens and things that persist.

NewtonMetrePerRadian
type: Class
subclass of: Restriction
  has value: 1.0
subclass of: Restriction
  has value: 0.0
comment: Newton Meter per Radian is the SI unit for Torsion Constant -- QUDT
alternative label: Newton metre per radian
EMMO 1f1b164d ec6a 4faa 8d5e 88bda62316cc: http://qudt.org/vocab/unit/N-M-PER-RAD
EMMO 7f1dec83 d85e 4e1b b7bd c9442d4f5a64: N⋅m/rad
EMMO 967080e5 2f42 4eb2 a3a9 c58143e835f9: Newton Meter per Radian is the SI unit for Torsion Constant -- QUDT

Join
type: Class
comment: A tessellation in which a tile is next for two or more non spatially connected tiles.
EMMO 967080e5 2f42 4eb2 a3a9 c58143e835f9: A tessellation in which a tile is next for two or more non spatially connected tiles.

TemporalTiling
type: Class
subclass of: Restriction
comment: A well formed tessellation with tiles that are all temporal.
EMMO 967080e5 2f42 4eb2 a3a9 c58143e835f9: A well formed tessellation with tiles that are all temporal.

OhmMetre
type: Class
subclass of: Restriction
  has value: 1.0
subclass of: Restriction
  has value: 0.0
comment: Ohm metre.
EMMO 1f1b164d ec6a 4faa 8d5e 88bda62316cc: http://qudt.org/vocab/unit/OHM-M
EMMO 33ae2d07 5526 4555 a0b4 8f4c031b5652: Ohm.m
EMMO 7f1dec83 d85e 4e1b b7bd c9442d4f5a64: Ω⋅m
EMMO 967080e5 2f42 4eb2 a3a9 c58143e835f9: Ohm metre.

ElectricResistivityUnit
type: Class
subclass of: Restriction
  has value: T-3 L+3 M+1 I-2 Θ0 N0 J0
comment: The class of units with dimensionality 'ElectricResistivity'.
EMMO 967080e5 2f42 4eb2 a3a9 c58143e835f9: The class of units with dimensionality 'ElectricResistivity'.

Ronna
type: Class
subclass of: Restriction
  has value: R
subclass of: Restriction
  has value: 1e+27
comment: SI prefix who's value is 1e27.
EMMO 967080e5 2f42 4eb2 a3a9 c58143e835f9: SI prefix who's value is 1e27.

FermiEnergy
type: Class
comment: In a metal, highest occupied energy level at zero thermodynamic temperature, where energy level means the energy of an electron in the interior of a substance.
EMMO 1f1b164d ec6a 4faa 8d5e 88bda62316cc: https://qudt.org/vocab/quantitykind/FermiEnergy
EMMO 26bf1bef d192 4da6 b0eb d2209698fb54: https://www.wikidata.org/wiki/Q431335
EMMO 50c298c2 55a2 4068 b3ac 4e948c33181f: https://www.electropedia.org/iev/iev.nsf/display
EMMO 8de5d5bf db1c 40ac b698 095ba3b18578: 12-27.1
EMMO 967080e5 2f42 4eb2 a3a9 c58143e835f9: In a metal, highest occupied energy level at zero thermodynamic temperature, where energy level means the energy of an electron in the interior of a substance.
EMMO fe015383 afb3 44a6 ae86 043628697aa2: https://doi.org/10.1351/goldbook.F02340

SymbolicData
type: Class
comment: A symbolic data is a data that is rooted on some specified symbolic based encoding, such as floating point numbers, strings, integer. When a symbolic data is used for expressing numerical data (e.g., integer), it is not to be intended as a mathematical entity (even if it may be interpreted as such) but as a syntactic structure (datastructures or datatypes) based on concatenated tokens (or symbols, letters) that can deliver data.
comment: The class for entities which stands for a specific data format expressed using a symbolic encoding.
alternative label: LiteralData
EMMO 31252f35 c767 4b97 a877 1235076c3e13: A symbolic data is a data that is rooted on some specified symbolic based encoding, such as floating point numbers, strings, integer. When a symbolic data is used for expressing numerical data (e.g., integer), it is not to be intended as a mathematical entity (even if it may be interpreted as such) but as a syntactic structure (datastructures or datatypes) based on concatenated tokens (or symbols, letters) that can deliver data.
EMMO 8a137e9f 579c 4e28 baca e8980eb0c3db: DisjointUnionOf: ArrayData, ScalarData
EMMO 967080e5 2f42 4eb2 a3a9 c58143e835f9: The class for entities which stands for a specific data format expressed using a symbolic encoding.

LinearEnergyTransfer
type: Class
subclass of: Restriction
comment: Measure for the energy lost by charged particles per traversed distance, including only interactions up to a given energy.
EMMO 1f1b164d ec6a 4faa 8d5e 88bda62316cc: https://qudt.org/vocab/quantitykind/LinearEnergyTransfer
EMMO 26bf1bef d192 4da6 b0eb d2209698fb54: https://www.wikidata.org/wiki/Q1699996
EMMO 50c298c2 55a2 4068 b3ac 4e948c33181f: https://www.electropedia.org/iev/iev.nsf/display
EMMO 8de5d5bf db1c 40ac b698 095ba3b18578: 10-85
EMMO 967080e5 2f42 4eb2 a3a9 c58143e835f9: Measure for the energy lost by charged particles per traversed distance, including only interactions up to a given energy.
EMMO fe015383 afb3 44a6 ae86 043628697aa2: https://doi.org/10.1351/goldbook.L03550

Mixture
type: Class
comment: A Miixture is a material made up of two or more different substances which are physically (not chemically) combined.
EMMO 967080e5 2f42 4eb2 a3a9 c58143e835f9: A Miixture is a material made up of two or more different substances which are physically (not chemically) combined.

ContinuumSubstance
type: Class
comment: A continuum is made of a sufficient number of parts that it continues to exists as continuum individual even after the loss of one of them i.e. a continuum is a redundant.
comment: A state that is a collection of sufficiently large number of other parts such that: - it is the bearer of qualities that can exists only by the fact that it is a sum of parts - the smallest partition dV of the state volume in which we are interested in, contains enough parts to be statistically consistent: n [#/m3] x dV [m3] >> 1
EMMO 967080e5 2f42 4eb2 a3a9 c58143e835f9: A state that is a collection of sufficiently large number of other parts such that: - it is the bearer of qualities that can exists only by the fact that it is a sum of parts - the smallest partition dV of the state volume in which we are interested in, contains enough parts to be statistically consistent: n [#/m3] x dV [m3] >> 1
EMMO c7b62dd7 063a 4c2a 8504 42f7264ba83f: A continuum is made of a sufficient number of parts that it continues to exists as continuum individual even after the loss of one of them i.e. a continuum is a redundant.
EMMO c7b62dd7 063a 4c2a 8504 42f7264ba83f: A continuum is not necessarily small (i.e. composed by the minimum amount of sates to fulfill the definition). A single continuum individual can be the whole fluid in a pipe.
EMMO c7b62dd7 063a 4c2a 8504 42f7264ba83f: A continuum is the bearer of properties that are generated by the interactions of parts such as viscosity and thermal or electrical conductivity.

AmpereSquareMetre
type: Class
subclass of: Restriction
  has value: 1.0
subclass of: Restriction
  has value: 0.0
comment: The SI unit of electromagnetic moment. -- QUDT
alternative label: Ampere Square Metre
EMMO 1f1b164d ec6a 4faa 8d5e 88bda62316cc: http://qudt.org/vocab/unit/A-M2
EMMO 33ae2d07 5526 4555 a0b4 8f4c031b5652: A.m2
EMMO 7f1dec83 d85e 4e1b b7bd c9442d4f5a64: A⋅m²
EMMO 967080e5 2f42 4eb2 a3a9 c58143e835f9: The SI unit of electromagnetic moment. -- QUDT

MagneticDipoleMomentUnit
type: Class
subclass of: Restriction
  has value: T-2 L+3 M+1 I-1 Θ0 N0 J0
comment: The class of units with dimensionality 'MagneticDipoleMoment'.
EMMO 967080e5 2f42 4eb2 a3a9 c58143e835f9: The class of units with dimensionality 'MagneticDipoleMoment'.

GramPerKiloMetre
type: Class
subclass of: Restriction
  has value: 1e-06
subclass of: Restriction
  has value: 0.0
comment: 0,001-fold of the SI base unit kilogram divided by the 1000-fold of the SI base unit metre -- QUDT
alternative label: Gram Per Kilometre
EMMO 1f1b164d ec6a 4faa 8d5e 88bda62316cc: http://qudt.org/vocab/unit/GM-PER-KiloM
EMMO 33ae2d07 5526 4555 a0b4 8f4c031b5652: g.km-1
EMMO 7f1dec83 d85e 4e1b b7bd c9442d4f5a64: g/km
EMMO 967080e5 2f42 4eb2 a3a9 c58143e835f9: 0,001-fold of the SI base unit kilogram divided by the 1000-fold of the SI base unit metre -- QUDT

MassPerLengthUnit
type: Class
subclass of: Restriction
  has value: T0 L-1 M+1 I0 Θ0 N0 J0
comment: The class of units with dimensionality 'MassPerLength'.
EMMO 967080e5 2f42 4eb2 a3a9 c58143e835f9: The class of units with dimensionality 'MassPerLength'.

CommandLanguage
type: Class
comment: An interpreted computer language for job control in computing.
example: Unix shell. Batch programming languages.
EMMO 967080e5 2f42 4eb2 a3a9 c58143e835f9: An interpreted computer language for job control in computing.
EMMO c84c6752 6d64 48cc 9500 e54a3c34898d: https://en.wikipedia.org/wiki/Command_language

ConstructionLanguage
type: Class
comment: A computer language by which a human can specify an executable problem solution to a computer.
EMMO 967080e5 2f42 4eb2 a3a9 c58143e835f9: A computer language by which a human can specify an executable problem solution to a computer.
EMMO c84c6752 6d64 48cc 9500 e54a3c34898d: https://en.wikipedia.org/wiki/Software_construction#Construction_languages

Assignment
type: Class
comment: A estimation of a property by a criteria based on the pre-existing knowledge of the estimator.
example: The Argon gas in my bottle has ionisation energy of 15.7596 eV. This is not measured but assigned to this material by previous knowledge.
EMMO 967080e5 2f42 4eb2 a3a9 c58143e835f9: A estimation of a property by a criteria based on the pre-existing knowledge of the estimator.

Estimation
type: Class
subclass of: Restriction
comment: A determination of an object without any actual interaction.
EMMO 967080e5 2f42 4eb2 a3a9 c58143e835f9: A determination of an object without any actual interaction.

Magnetization
type: Class
subclass of: Restriction
comment: At a given point within a domain of quasi-infinitesimal volume V, vector quantity equal to the magnetic area moment m of the substance contained within the domain divided by the volume V.
EMMO 1f1b164d ec6a 4faa 8d5e 88bda62316cc: https://qudt.org/vocab/quantitykind/Magnetization
EMMO 26bf1bef d192 4da6 b0eb d2209698fb54: https://www.wikidata.org/wiki/Q856711
EMMO 50c298c2 55a2 4068 b3ac 4e948c33181f: https://www.electropedia.org/iev/iev.nsf/display
EMMO 8de5d5bf db1c 40ac b698 095ba3b18578: 6-24
EMMO 967080e5 2f42 4eb2 a3a9 c58143e835f9: At a given point within a domain of quasi-infinitesimal volume V, vector quantity equal to the magnetic area moment m of the substance contained within the domain divided by the volume V.

PicoMolePerCubicMetre
type: Class
subclass of: Restriction
  some values from: MolePerCubicMetre
subclass of: Restriction
  has value: 1e-12
subclass of: Restriction
  has value: 0.0
alternative label: Picomoles per cubic metre
EMMO 1f1b164d ec6a 4faa 8d5e 88bda62316cc: http://qudt.org/vocab/unit/PicoMOL-PER-M3
EMMO 33ae2d07 5526 4555 a0b4 8f4c031b5652: pmol.m-3
EMMO 7f1dec83 d85e 4e1b b7bd c9442d4f5a64: pmol/m³

AmountConcentrationUnit
type: Class
subclass of: Restriction
  has value: T0 L-3 M0 I0 Θ0 N+1 J0
comment: The class of units with dimensionality 'AmountConcentration'.
EMMO 967080e5 2f42 4eb2 a3a9 c58143e835f9: The class of units with dimensionality 'AmountConcentration'.

DonorDensity
type: Class
comment: Number of donor levels per volume.
EMMO 1f1b164d ec6a 4faa 8d5e 88bda62316cc: https://qudt.org/vocab/quantitykind/DonorDensity
EMMO 26bf1bef d192 4da6 b0eb d2209698fb54: https://www.wikidata.org/wiki/Q105979886
EMMO 8de5d5bf db1c 40ac b698 095ba3b18578: 12-29.4
EMMO 967080e5 2f42 4eb2 a3a9 c58143e835f9: Number of donor levels per volume.

ReciprocalVolume
type: Class
subclass of: Restriction
comment: Physical quantity for measuring per volume.
EMMO 967080e5 2f42 4eb2 a3a9 c58143e835f9: Physical quantity for measuring per volume.

Intensive
type: Class
comment: A quantity whose magnitude is independent of the size of the system.
comment: Note that not all physical quantities can be categorised as being either intensive or extensive. For example the square root of the mass.
example: Temperature Density Pressure ChemicalPotential
EMMO 967080e5 2f42 4eb2 a3a9 c58143e835f9: A quantity whose magnitude is independent of the size of the system.

SpecificHeatCapacity
type: Class
subclass of: Restriction
comment: Heat capacity divided by mass.
EMMO 1f1b164d ec6a 4faa 8d5e 88bda62316cc: https://qudt.org/vocab/quantitykind/SpecificHeatCapacity
EMMO 26bf1bef d192 4da6 b0eb d2209698fb54: https://www.wikidata.org/wiki/Q487756
EMMO 50c298c2 55a2 4068 b3ac 4e948c33181f: https://www.electropedia.org/iev/iev.nsf/display
EMMO 6dd685dd 1895 46e4 b227 be9f7d643c25: https://dbpedia.org/page/Specific_heat_capacity
EMMO 8de5d5bf db1c 40ac b698 095ba3b18578: 5-16.1
EMMO 967080e5 2f42 4eb2 a3a9 c58143e835f9: Heat capacity divided by mass.
EMMO c84c6752 6d64 48cc 9500 e54a3c34898d: https://en.wikipedia.org/wiki/Specific_heat_capacity
EMMO fe015383 afb3 44a6 ae86 043628697aa2: https://doi.org/10.1351/goldbook.S05800

Collapse
type: Class
comment: A collapse is a fundamental interaction between m colliding particles that results in a single outgoing particle (inverse decay) that is expressed as a complete bipartite directed graph K(m,1) with m>1.
EMMO 31252f35 c767 4b97 a877 1235076c3e13: A collapse is a fundamental interaction between m colliding particles that results in a single outgoing particle (inverse decay) that is expressed as a complete bipartite directed graph K(m,1) with m>1.

FundamentalPhysicalSystem
type: Class
comment: A causal system that is the representation of a Feynman diagram, where quantum represents the real particles entering and exiting the system.
comment: A fundamental physical process is made of one or more standard particles as input, and one or more standard particles as output, where each input is direct cause of each output. Each fundamental physical phenomena refers to a Feynman diagram, hence is made at least of three standard model particles. This requirement implies that a physical phenomena is either a decay, annihilation, interaction, collapse or creation phenomena (fundamental) or a composition of them (non-fundamental).
comment: A fundamental system is expressed as a complete bipartite directed graph K(m,n) of quantums, m being the number of originating quantums, and n being the receiving quantums.
EMMO 31252f35 c767 4b97 a877 1235076c3e13: A fundamental physical process is made of one or more standard particles as input, and one or more standard particles as output, where each input is direct cause of each output. Each fundamental physical phenomena refers to a Feynman diagram, hence is made at least of three standard model particles. This requirement implies that a physical phenomena is either a decay, annihilation, interaction, collapse or creation phenomena (fundamental) or a composition of them (non-fundamental).
EMMO 8a137e9f 579c 4e28 baca e8980eb0c3db: DisjointUnionOf: Collapse, Interaction, Decay
EMMO 967080e5 2f42 4eb2 a3a9 c58143e835f9: A causal system that is the representation of a Feynman diagram, where quantum represents the real particles entering and exiting the system.
EMMO c7b62dd7 063a 4c2a 8504 42f7264ba83f: A fundamental system is expressed as a complete bipartite directed graph K(m,n) of quantums, m being the number of originating quantums, and n being the receiving quantums.

Language
type: Class
comment: A language object is a discrete data entity respecting specific language syntactic rules (a well-formed formula).
EMMO 967080e5 2f42 4eb2 a3a9 c58143e835f9: A language object is a discrete data entity respecting specific language syntactic rules (a well-formed formula).

Symbolic
type: Class
comment: A discrete data whose elements can be decoded as tokens from one or more alphabets, without necessarily respecting syntactic rules.
comment: A symbolic entity is not necessarily graphical (e.g. it doesn't necessarily have the physical shape of a letter), but its elements can be decoded and put in relation with an alphabet. In other words, a sequence of bit "1000010" in a RAM (a non-graphical entity) is a valid symbol since it can be decoded through ASCII rules as the letter "B". The same holds for an entity standing for the sound of a voice saying: "Hello", since it can be decomposed in discrete parts, each of them being associated to a letter of an alphabet.
example: fe780 emmo !5*a cat for(i=0;i<N;++i)
EMMO 8a137e9f 579c 4e28 baca e8980eb0c3db: EquivalentTo: SymbolicConstruct or Symbol
EMMO 967080e5 2f42 4eb2 a3a9 c58143e835f9: A discrete data whose elements can be decoded as tokens from one or more alphabets, without necessarily respecting syntactic rules.
EMMO c7b62dd7 063a 4c2a 8504 42f7264ba83f: A symbolic entity is not necessarily graphical (e.g. it doesn't necessarily have the physical shape of a letter), but its elements can be decoded and put in relation with an alphabet. In other words, a sequence of bit "1000010" in a RAM (a non-graphical entity) is a valid symbol since it can be decoded through ASCII rules as the letter "B". The same holds for an entity standing for the sound of a voice saying: "Hello", since it can be decomposed in discrete parts, each of them being associated to a letter of an alphabet.
EMMO c7b62dd7 063a 4c2a 8504 42f7264ba83f: A symbolic object possesses a reductionistic oriented structure. For example, text is made of words, spaces and punctuations. Words are made of characters (i.e. atomic symbols).

VanadiumAtom
type: Class
subclass of: Restriction
subclass of: Restriction
  has value: 50.9415
subclass of: Restriction
  has value: 23
comment: Atom subclass for vanadium.
EMMO 967080e5 2f42 4eb2 a3a9 c58143e835f9: Atom subclass for vanadium.

Momentum
type: Class
subclass of: Restriction
comment: Product of mass and velocity.
EMMO 1f1b164d ec6a 4faa 8d5e 88bda62316cc: http://qudt.org/vocab/quantitykind/Momentum
EMMO 8de5d5bf db1c 40ac b698 095ba3b18578: 4-8
EMMO 967080e5 2f42 4eb2 a3a9 c58143e835f9: Product of mass and velocity.
EMMO fe015383 afb3 44a6 ae86 043628697aa2: https://doi.org/10.1351/goldbook.M04007

DirectionDistributionOfCrossSection
type: Class
subclass of: Restriction
comment: Differential quotient of the cross section for scattering a particle in a given direction and the solid angle around that direction.
EMMO 1f1b164d ec6a 4faa 8d5e 88bda62316cc: https://qudt.org/vocab/quantitykind/AngularCrossSection
EMMO 26bf1bef d192 4da6 b0eb d2209698fb54: https://www.wikidata.org/wiki/Q98266630
EMMO 8de5d5bf db1c 40ac b698 095ba3b18578: 10-39
EMMO 967080e5 2f42 4eb2 a3a9 c58143e835f9: Differential quotient of the cross section for scattering a particle in a given direction and the solid angle around that direction.

ThermalConductance
type: Class
subclass of: Restriction
comment: Reciprocal of the thermal resistance.
EMMO 1f1b164d ec6a 4faa 8d5e 88bda62316cc: https://qudt.org/vocab/quantitykind/ThermalConductance
EMMO 26bf1bef d192 4da6 b0eb d2209698fb54: https://www.wikidata.org/wiki/Q17176562
EMMO 50c298c2 55a2 4068 b3ac 4e948c33181f: https://www.electropedia.org/iev/iev.nsf/display
EMMO 8de5d5bf db1c 40ac b698 095ba3b18578: 5-13
EMMO 967080e5 2f42 4eb2 a3a9 c58143e835f9: Reciprocal of the thermal resistance.
EMMO fe015383 afb3 44a6 ae86 043628697aa2: https://doi.org/10.1351/goldbook.T06298

CoulombPerCubicCentiMetre
type: Class
subclass of: Restriction
  has value: 1000000.0
subclass of: Restriction
  has value: 0.0
comment: derived SI unit coulomb divided by the 0.000 001-fold of the power of the SI base unit metre by exponent 3 -- QUDT
alternative label: Coulomb Per Cubic Centimetre
EMMO 1f1b164d ec6a 4faa 8d5e 88bda62316cc: http://qudt.org/vocab/unit/C-PER-CentiM3
EMMO 33ae2d07 5526 4555 a0b4 8f4c031b5652: C.cm-3
EMMO 33ae2d07 5526 4555 a0b4 8f4c031b5652: C/cm3
EMMO 7f1dec83 d85e 4e1b b7bd c9442d4f5a64: C/cm³
EMMO 967080e5 2f42 4eb2 a3a9 c58143e835f9: derived SI unit coulomb divided by the 0.000 001-fold of the power of the SI base unit metre by exponent 3 -- QUDT

ElectricChargeDensityUnit
type: Class
subclass of: Restriction
  has value: T+1 L-3 M0 I+1 Θ0 N0 J0
comment: The class of units with dimensionality 'ElectricChargeDensity'.
EMMO 967080e5 2f42 4eb2 a3a9 c58143e835f9: The class of units with dimensionality 'ElectricChargeDensity'.

CentiMetreSecondDegreeCelsius
type: Class
comment: `Centimeter Second Degree Celsius` is a C.G.S System unit for 'Length Temperature Time' expressed as cm-s-degC. -- QUDT
alternative label: Centimetre Second Degree Celsius
EMMO 1f1b164d ec6a 4faa 8d5e 88bda62316cc: http://qudt.org/vocab/unit/CentiM-SEC-DEG_C
EMMO 33ae2d07 5526 4555 a0b4 8f4c031b5652: cm.s.Cel-1
EMMO 33ae2d07 5526 4555 a0b4 8f4c031b5652: cm.s/Cel
EMMO 7f1dec83 d85e 4e1b b7bd c9442d4f5a64: cm⋅s⋅°C
EMMO 967080e5 2f42 4eb2 a3a9 c58143e835f9: `Centimeter Second Degree Celsius` is a C.G.S System unit for 'Length Temperature Time' expressed as cm-s-degC. -- QUDT

NonSIUnit
type: Class
comment: Measurement units that are not SI units.
EMMO 967080e5 2f42 4eb2 a3a9 c58143e835f9: Measurement units that are not SI units.

LengthTimeTemperatureUnit
type: Class
subclass of: Restriction
  has value: T+1 L+1 M0 I0 Θ+1 N0 J0
comment: The class of units with dimensionality 'LengthTimeTemperature'.
EMMO 967080e5 2f42 4eb2 a3a9 c58143e835f9: The class of units with dimensionality 'LengthTimeTemperature'.

PerLengthUnit
type: Class
subclass of: Restriction
  has value: T0 L-1 M0 I0 Θ0 N0 J0
comment: The class of units with dimensionality 'PerLength'.
EMMO 967080e5 2f42 4eb2 a3a9 c58143e835f9: The class of units with dimensionality 'PerLength'.

MassPerQuarticTimeUnit
type: Class
subclass of: Restriction
  has value: T-4 L0 M+1 I0 Θ0 N0 J0
comment: The class of units with dimensionality 'MassPerQuarticTime'.
EMMO 967080e5 2f42 4eb2 a3a9 c58143e835f9: The class of units with dimensionality 'MassPerQuarticTime'.

Procedure
type: Class
subclass of: Restriction
comment: A procedure can be considered as an intentional process with a plan.
comment: An intentional process in which an agent works with some entities according to some existing formalised operative rules.
comment: The set of established forms or methods of an organized body for accomplishing a certain task or tasks (Wiktionary).
alternative label: Elaboration
alternative label: Work
example: The process in which a control unit of a CPU (the agent) orchestrates some cached binary data according to a list of instructions (e.g. a program). The process in which a librarian order books alphabetically on a shelf. The execution of an algorithm.
EMMO 31252f35 c767 4b97 a877 1235076c3e13: The set of established forms or methods of an organized body for accomplishing a certain task or tasks (Wiktionary).
EMMO 967080e5 2f42 4eb2 a3a9 c58143e835f9: An intentional process in which an agent works with some entities according to some existing formalised operative rules.
EMMO c7b62dd7 063a 4c2a 8504 42f7264ba83f: A procedure can be considered as an intentional process with a plan.

LogarithmicUnit
type: Class
comment: A logarithmic unit is a unit that can be used to express a quantity (physical or mathematical) on a logarithmic scale, that is, as being proportional to the value of a logarithm function applied to the ratio of the quantity and a reference quantity of the same type.
comment: Note that logarithmic units like decibel or neper are not univocally defines, since their definition depends on whether they are used to measure a "power" or a "root-power" quantity. It is advisory to create a uniquely defined subclass these units for concrete usage.
example: Decibel
EMMO 1f1b164d ec6a 4faa 8d5e 88bda62316cc: http://qudt.org/schema/qudt/LogarithmicUnit
EMMO 967080e5 2f42 4eb2 a3a9 c58143e835f9: A logarithmic unit is a unit that can be used to express a quantity (physical or mathematical) on a logarithmic scale, that is, as being proportional to the value of a logarithm function applied to the ratio of the quantity and a reference quantity of the same type.
EMMO c7b62dd7 063a 4c2a 8504 42f7264ba83f: Note that logarithmic units like decibel or neper are not univocally defines, since their definition depends on whether they are used to measure a "power" or a "root-power" quantity. It is advisory to create a uniquely defined subclass these units for concrete usage.
EMMO c84c6752 6d64 48cc 9500 e54a3c34898d: https://en.wikipedia.org/wiki/Logarithmic_scale#Logarithmic_units

MassieuFunction
type: Class
subclass of: Restriction
comment: Negative quotient of Helmholtz energy and temperature.
EMMO 1f1b164d ec6a 4faa 8d5e 88bda62316cc: https://qudt.org/vocab/quantitykind/MassieuFunction
EMMO 26bf1bef d192 4da6 b0eb d2209698fb54: https://www.wikidata.org/wiki/Q3077625
EMMO 50c298c2 55a2 4068 b3ac 4e948c33181f: https://www.electropedia.org/iev/iev.nsf/display
EMMO 8de5d5bf db1c 40ac b698 095ba3b18578: 5-22
EMMO 967080e5 2f42 4eb2 a3a9 c58143e835f9: Negative quotient of Helmholtz energy and temperature.

MetrologicalSymbol
type: Class
equivalent class: Class
subclass of: Restriction
  all values from: Class
comment: A symbol that stands for a concept in the language of the meterological domain of ISO 80000.
EMMO 967080e5 2f42 4eb2 a3a9 c58143e835f9: A symbol that stands for a concept in the language of the meterological domain of ISO 80000.

NonPrefixedUnit
type: Class
comment: A measurement unit symbol that do not have a metric prefix as a direct spatial part.
EMMO 8a137e9f 579c 4e28 baca e8980eb0c3db: EquivalentTo: DerivedUnit or UnitSymbol
EMMO 967080e5 2f42 4eb2 a3a9 c58143e835f9: A measurement unit symbol that do not have a metric prefix as a direct spatial part.

SizeDefinedMaterial
type: Class

Material
type: Class
comment: A instance of a material (e.g. nitrogen) can represent any state of matter. The fact that the individual also belongs to other classes (e.g. Gas) would reveal the actual form in which the material is found.
comment: The class of individuals standing for an amount of ordinary matter substance (or mixture of substances) in different states of matter or phases.
EMMO 967080e5 2f42 4eb2 a3a9 c58143e835f9: The class of individuals standing for an amount of ordinary matter substance (or mixture of substances) in different states of matter or phases.
EMMO c7b62dd7 063a 4c2a 8504 42f7264ba83f: A instance of a material (e.g. nitrogen) can represent any state of matter. The fact that the individual also belongs to other classes (e.g. Gas) would reveal the actual form in which the material is found.
EMMO c7b62dd7 063a 4c2a 8504 42f7264ba83f: Material usually means some definite kind, quality, or quantity of matter, especially as intended for use.

DataSet
type: Class
comment: Encoded data made of more than one datum.
EMMO 967080e5 2f42 4eb2 a3a9 c58143e835f9: Encoded data made of more than one datum.

Datum
type: Class
comment: A self-consistent encoded data entity.
example: A character, a bit, a song in a CD.
EMMO 967080e5 2f42 4eb2 a3a9 c58143e835f9: A self-consistent encoded data entity.

ConventionalProperty
type: Class
comment: A property that is associated to an object by convention, or assumption.
comment: A quantitative property attributed by agreement to a quantity for a given purpose.
example: The thermal conductivity of a copper sample in my laboratory can be assumed to be the conductivity that appears in the vendor specification. This value has been obtained by measurement of a sample which is not the one I have in my laboratory. This conductivity value is then a conventional quantitiative property assigned to my sample through a semiotic process in which no actual measurement is done by my laboratory. If I don't believe the vendor, then I can measure the actual thermal conductivity. I then perform a measurement process that semiotically assign another value for the conductivity, which is a measured property, since is part of a measurement process. Then I have two different physical quantities that are properties thanks to two different semiotic processes.
EMMO 967080e5 2f42 4eb2 a3a9 c58143e835f9: A quantitative property attributed by agreement to a quantity for a given purpose.

KelvinPerSquareSecond
type: Class
subclass of: Restriction
  has value: 1.0
subclass of: Restriction
  has value: 0.0
comment: `Kelvin per Square Second` is a unit for 'Temperature Per Time Squared' expressed as K / s². -- QUDT
alternative label: Kelvin per Square Second
EMMO 1f1b164d ec6a 4faa 8d5e 88bda62316cc: http://qudt.org/vocab/unit/K-PER-SEC2
EMMO 33ae2d07 5526 4555 a0b4 8f4c031b5652: K.s-2
EMMO 33ae2d07 5526 4555 a0b4 8f4c031b5652: K/s^2
EMMO 7f1dec83 d85e 4e1b b7bd c9442d4f5a64: K/s²
EMMO 967080e5 2f42 4eb2 a3a9 c58143e835f9: `Kelvin per Square Second` is a unit for 'Temperature Per Time Squared' expressed as K / s². -- QUDT

LivermoriumSymbol
type: Class
subclass of: Restriction
  has value: Lv
comment: The symbol that stands for the livermorium atom.
EMMO 967080e5 2f42 4eb2 a3a9 c58143e835f9: The symbol that stands for the livermorium atom.

GramPerMole
type: Class
subclass of: Restriction
  has value: 0.001
subclass of: Restriction
  has value: 0.0
comment: 0,01-fold of the SI base unit kilogram divided by the SI base unit mol -- QUDT
alternative label: Gram Per Mole
EMMO 1f1b164d ec6a 4faa 8d5e 88bda62316cc: http://qudt.org/vocab/unit/GM-PER-MOL
EMMO 33ae2d07 5526 4555 a0b4 8f4c031b5652: g.mol-1
EMMO 7f1dec83 d85e 4e1b b7bd c9442d4f5a64: g/mol
EMMO 967080e5 2f42 4eb2 a3a9 c58143e835f9: 0,01-fold of the SI base unit kilogram divided by the SI base unit mol -- QUDT

MassPerAmountUnit
type: Class
subclass of: Restriction
  has value: T0 L0 M+1 I0 Θ0 N-1 J0
comment: The class of units with dimensionality 'MassPerAmount'.
EMMO 967080e5 2f42 4eb2 a3a9 c58143e835f9: The class of units with dimensionality 'MassPerAmount'.

Assembled
type: Class
comment: A system of independent elements that are assembled together to perform a function.
EMMO 967080e5 2f42 4eb2 a3a9 c58143e835f9: A system of independent elements that are assembled together to perform a function.

HolisticArrangement
type: Class
comment: A system which is mainly characterised by the spatial configuration of its elements.
EMMO 967080e5 2f42 4eb2 a3a9 c58143e835f9: A system which is mainly characterised by the spatial configuration of its elements.

KiloVolt
type: Class
subclass of: Restriction
  some values from: Volt
subclass of: Restriction
  has value: 1000.0
subclass of: Restriction
  has value: 0.0
comment: 1 000-fold of the SI derived unit volt -- QUDT
EMMO 1f1b164d ec6a 4faa 8d5e 88bda62316cc: http://qudt.org/vocab/unit/KiloV
EMMO 33ae2d07 5526 4555 a0b4 8f4c031b5652: kV
EMMO 7f1dec83 d85e 4e1b b7bd c9442d4f5a64: kV
EMMO 967080e5 2f42 4eb2 a3a9 c58143e835f9: 1 000-fold of the SI derived unit volt -- QUDT

ElectricPotentialUnit
type: Class
subclass of: Restriction
  has value: T-3 L+2 M+1 I-1 Θ0 N0 J0
comment: The class of units with dimensionality 'ElectricPotential'.
EMMO 967080e5 2f42 4eb2 a3a9 c58143e835f9: The class of units with dimensionality 'ElectricPotential'.

MegaPascal
type: Class
subclass of: Restriction
  some values from: Pascal
subclass of: Restriction
  has value: 1000000.0
subclass of: Restriction
  has value: 0.0
comment: 1,000,000-fold of the derived unit pascal -- QUDT
EMMO 1f1b164d ec6a 4faa 8d5e 88bda62316cc: http://qudt.org/vocab/unit/MegaPA
EMMO 33ae2d07 5526 4555 a0b4 8f4c031b5652: MPa
EMMO 7f1dec83 d85e 4e1b b7bd c9442d4f5a64: MPa
EMMO 967080e5 2f42 4eb2 a3a9 c58143e835f9: 1,000,000-fold of the derived unit pascal -- QUDT

HolmiumAtom
type: Class
subclass of: Restriction
subclass of: Restriction
  has value: 164.93033
subclass of: Restriction
  has value: 67
comment: Atom subclass for holmium.
EMMO 967080e5 2f42 4eb2 a3a9 c58143e835f9: Atom subclass for holmium.

CompositeBoson
type: Class
equivalent class: Class
comment: A non-elementary particle (bonded) of a fundamental bosonic type (integer spin).
example: Examples of composite particles with integer spin: spin 0: H1 and He4 in ground state, pion spin 1: H1 and He4 in first excited state, meson spin 2: O15 in ground state.
EMMO 967080e5 2f42 4eb2 a3a9 c58143e835f9: A non-elementary particle (bonded) of a fundamental bosonic type (integer spin).

BondedParticle
type: Class
comment: A composite particle is a bonded particle for which it is possible to clearly define its bosonic or fermionic behaviour. The term particle is then reserved for entities whose fermionic or bosonic nature is clearly defined.
EMMO 31252f35 c767 4b97 a877 1235076c3e13: A composite particle is a bonded particle for which it is possible to clearly define its bosonic or fermionic behaviour. The term particle is then reserved for entities whose fermionic or bosonic nature is clearly defined.
EMMO 8a137e9f 579c 4e28 baca e8980eb0c3db: DisjointUnionOf: CompositeBoson, CompositeFermion

Boson
type: Class
comment: A physical particle with integer spin that follows Bose–Einstein statistics.
EMMO 967080e5 2f42 4eb2 a3a9 c58143e835f9: A physical particle with integer spin that follows Bose–Einstein statistics.
EMMO c84c6752 6d64 48cc 9500 e54a3c34898d: https://en.wikipedia.org/wiki/Boson

CompositeFermion
type: Class
equivalent class: Class
comment: A non-elementary particle (bonded) of a fundamental fermionic type (half-integer spin).
example: Examples of composite particles with half-integer spin: spin 1/2: He3 in ground state, proton, neutron spin 3/2: He5 in ground state, Delta baryons (excitations of the proton and neutron)
EMMO 967080e5 2f42 4eb2 a3a9 c58143e835f9: A non-elementary particle (bonded) of a fundamental fermionic type (half-integer spin).

ElementaryBoson
type: Class
comment: An elementary particle of a fundamental bosonic type.
EMMO 967080e5 2f42 4eb2 a3a9 c58143e835f9: An elementary particle of a fundamental bosonic type.

CubicMetrePerKilogram
type: Class
subclass of: Restriction
  has value: 1.0
subclass of: Restriction
  has value: 0.0
comment: Cubic Meter Per Kilogram (m3/kg) is a unit in the category of Specific volume. It is also known as cubic meters per kilogram, cubic metre per kilogram, cubic metres per kilogram, cubic meter/kilogram, cubic metre/kilogram. This unit is commonly used in the SI unit system. Cubic Meter Per Kilogram (m3/kg) has a dimension of M-1L3 where M is mass, and L is length. This unit is the standard SI unit in this category. -- QUDT
alternative label: Cubic Metre per Kilogram
EMMO 1f1b164d ec6a 4faa 8d5e 88bda62316cc: http://qudt.org/vocab/unit/M3-PER-KiloGM
EMMO 33ae2d07 5526 4555 a0b4 8f4c031b5652: m3.kg-1
EMMO 33ae2d07 5526 4555 a0b4 8f4c031b5652: m3/kg
EMMO 7f1dec83 d85e 4e1b b7bd c9442d4f5a64: m³/kg
EMMO 967080e5 2f42 4eb2 a3a9 c58143e835f9: Cubic Meter Per Kilogram (m3/kg) is a unit in the category of Specific volume. It is also known as cubic meters per kilogram, cubic metre per kilogram, cubic metres per kilogram, cubic meter/kilogram, cubic metre/kilogram. This unit is commonly used in the SI unit system. Cubic Meter Per Kilogram (m3/kg) has a dimension of M-1L3 where M is mass, and L is length. This unit is the standard SI unit in this category. -- QUDT

VolumePerMassUnit
type: Class
subclass of: Restriction
  has value: T0 L+3 M-1 I0 Θ0 N0 J0
comment: The class of units with dimensionality 'VolumePerMass'.
EMMO 967080e5 2f42 4eb2 a3a9 c58143e835f9: The class of units with dimensionality 'VolumePerMass'.

ElectricFluxDensity
type: Class
subclass of: Restriction
comment: Vector quantity obtained at a given point by adding the electric polarization P to the product of the electric field strength E and the electric constant ε0.
alternative label: ElectricDisplacement
EMMO 1f1b164d ec6a 4faa 8d5e 88bda62316cc: https://qudt.org/vocab/quantitykind/ElectricDisplacementField
EMMO 26bf1bef d192 4da6 b0eb d2209698fb54: https://www.wikidata.org/wiki/Q371907
EMMO 50c298c2 55a2 4068 b3ac 4e948c33181f: https://www.electropedia.org/iev/iev.nsf/display
EMMO 8de5d5bf db1c 40ac b698 095ba3b18578: 6-12
EMMO 967080e5 2f42 4eb2 a3a9 c58143e835f9: Vector quantity obtained at a given point by adding the electric polarization P to the product of the electric field strength E and the electric constant ε0.

CentrifugalCasting
type: Class

Casting
type: Class

LawrenciumAtom
type: Class
subclass of: Restriction
subclass of: Restriction
  has value: 262.11
subclass of: Restriction
  has value: 103
comment: Atom subclass for lawrencium.
EMMO 967080e5 2f42 4eb2 a3a9 c58143e835f9: Atom subclass for lawrencium.

CubicMetrePerSecond
type: Class
subclass of: Restriction
  has value: 1.0
subclass of: Restriction
  has value: 0.0
comment: A cubic metre per second (m³s⁻¹, m³/s), cumecs or cubic meter per second in American English) is a derived SI unit of flow rate equal to that of a stere or cube with sides of one metre ( u0303 39.37 in) in length exchanged or moving each second. It is popularly used for water flow, especially in rivers and streams, and fractions for HVAC values measuring air flow. -- QUDT
alternative label: Cubic Metre per Second
EMMO 1f1b164d ec6a 4faa 8d5e 88bda62316cc: http://qudt.org/vocab/unit/M3-PER-SEC
EMMO 33ae2d07 5526 4555 a0b4 8f4c031b5652: m3.s-1
EMMO 33ae2d07 5526 4555 a0b4 8f4c031b5652: m3/s
EMMO 7f1dec83 d85e 4e1b b7bd c9442d4f5a64: m³/s
EMMO 967080e5 2f42 4eb2 a3a9 c58143e835f9: A cubic metre per second (m³s⁻¹, m³/s), cumecs or cubic meter per second in American English) is a derived SI unit of flow rate equal to that of a stere or cube with sides of one metre ( u0303 39.37 in) in length exchanged or moving each second. It is popularly used for water flow, especially in rivers and streams, and fractions for HVAC values measuring air flow. -- QUDT

VolumePerTimeUnit
type: Class
subclass of: Restriction
  has value: T-1 L+3 M0 I0 Θ0 N0 J0
comment: The class of units with dimensionality 'VolumePerTime'.
EMMO 967080e5 2f42 4eb2 a3a9 c58143e835f9: The class of units with dimensionality 'VolumePerTime'.

Density
type: Class
subclass of: Restriction
comment: Quantity representing the spatial distribution of mass in a continuous material.
alternative label: MassConcentration
alternative label: MassDensity
EMMO 1f1b164d ec6a 4faa 8d5e 88bda62316cc: http://qudt.org/vocab/quantitykind/Density
EMMO 8de5d5bf db1c 40ac b698 095ba3b18578: Mass per volume.
EMMO 8de5d5bf db1c 40ac b698 095ba3b18578: 4-2
EMMO 8de5d5bf db1c 40ac b698 095ba3b18578: 9-10
EMMO 967080e5 2f42 4eb2 a3a9 c58143e835f9: Quantity representing the spatial distribution of mass in a continuous material.
EMMO fe015383 afb3 44a6 ae86 043628697aa2: https://doi.org/10.1351/goldbook.D01590

MergingManufacturing
type: Class
alternative label: AddingManufacturing

WorkpieceManufacturing
type: Class
comment: A manufacturing with an output that is an object with a specific function, shape, or intended use, not simply a material.
see also: DIN 8580:2020
see also: ISO 15531-1:2004 discrete manufacturing: production of discrete items.
see also: ISO 8887-1:2017 manufacturing: production of components
alternative label: DiscreteManufacturing
alternative label: Werkstücke @de
EMMO 967080e5 2f42 4eb2 a3a9 c58143e835f9: A manufacturing with an output that is an object with a specific function, shape, or intended use, not simply a material.

MolarAttenuationCoefficient
type: Class
subclass of: Restriction
comment: Quotient of linear attenuation coefficient µ and the amount c of the medium.
EMMO 26bf1bef d192 4da6 b0eb d2209698fb54: https://www.wikidata.org/wiki/Q98592828
EMMO 8de5d5bf db1c 40ac b698 095ba3b18578: 10-51
EMMO 967080e5 2f42 4eb2 a3a9 c58143e835f9: Quotient of linear attenuation coefficient µ and the amount c of the medium.

CollectiveAgency
type: Class
comment: Collective agency occurs when two or more individuals act as a group, in accordance with certain principles or procedures that constitute and organize the group.
comment: The group acting collectively is intended to be represented as an item, meaning that all members of the group should have had at least one causal interaction with another member. The collective action in fact is taken in accordance with certain principles or procedures that constitute and organize the group itself that requires implicitly a causal interaction between members.
EMMO 967080e5 2f42 4eb2 a3a9 c58143e835f9: Collective agency occurs when two or more individuals act as a group, in accordance with certain principles or procedures that constitute and organize the group.
EMMO c7b62dd7 063a 4c2a 8504 42f7264ba83f: The group acting collectively is intended to be represented as an item, meaning that all members of the group should have had at least one causal interaction with another member. The collective action in fact is taken in accordance with certain principles or procedures that constitute and organize the group itself that requires implicitly a causal interaction between members.

IntentionalAgencyByKind
type: Class

Cognition
type: Class
subclass of: Restriction
comment: A semiotic process that assigns a sign by recognising an object by how it resemble or imitate what the sign stands for, in shape, function or by sharing a similar logical structure.
alternative label: IconSemiosis
EMMO 967080e5 2f42 4eb2 a3a9 c58143e835f9: A semiotic process that assigns a sign by recognising an object by how it resemble or imitate what the sign stands for, in shape, function or by sharing a similar logical structure.

ResourceIdentifier
type: Class
subclass of: Restriction
comment: A formal computer-interpretable identifier of a system resource.
EMMO 967080e5 2f42 4eb2 a3a9 c58143e835f9: A formal computer-interpretable identifier of a system resource.

Information
type: Class
equivalent class: Class
comment: Information is data with a meaning (semiotic sign).
comment: The General Definition of Information (GDI) can be used to define the concept of information. (GDI) a is an instance of information, understood as semantic content, if and only if: GDI.l) a consists of n data, for n > 1; GDI.2) the data are well formed; GDI.3) the well-formed data are meaningful. In the EMMO conceptualisation, well-formed data are data with a specific syntactic structure (symbolic and reductionistic modules), while meaningful data are data that are part of a semiotic interpretation process that declares what the data are about (semiotic module).
EMMO 31252f35 c767 4b97 a877 1235076c3e13: The General Definition of Information (GDI) can be used to define the concept of information. (GDI) a is an instance of information, understood as semantic content, if and only if: GDI.l) a consists of n data, for n > 1; GDI.2) the data are well formed; GDI.3) the well-formed data are meaningful. In the EMMO conceptualisation, well-formed data are data with a specific syntactic structure (symbolic and reductionistic modules), while meaningful data are data that are part of a semiotic interpretation process that declares what the data are about (semiotic module).
EMMO 967080e5 2f42 4eb2 a3a9 c58143e835f9: Information is data with a meaning (semiotic sign).

ComputerScience
type: Class
comment: A well-formed formula in computer science may be or not be interpreted by a computer. For example pseudo-code is only intended for human consumption.
comment: A well-formed formula that follows the syntactic rules of computer science.
EMMO 967080e5 2f42 4eb2 a3a9 c58143e835f9: A well-formed formula that follows the syntactic rules of computer science.
EMMO c7b62dd7 063a 4c2a 8504 42f7264ba83f: A well-formed formula in computer science may be or not be interpreted by a computer. For example pseudo-code is only intended for human consumption.

Entropy
type: Class
subclass of: Restriction
comment: Logarithmic measure of the number of available states of a system.
comment: May also be referred to as a measure of order of a system.
EMMO 1f1b164d ec6a 4faa 8d5e 88bda62316cc: http://qudt.org/vocab/quantitykind/Entropy
EMMO 8de5d5bf db1c 40ac b698 095ba3b18578: 5-18
EMMO 967080e5 2f42 4eb2 a3a9 c58143e835f9: Logarithmic measure of the number of available states of a system.
EMMO fe015383 afb3 44a6 ae86 043628697aa2: https://doi.org/10.1351/goldbook.E02149

BerylliumSymbol
type: Class
subclass of: Restriction
  has value: Be
comment: The symbol that stands for the beryllium atom.
EMMO 967080e5 2f42 4eb2 a3a9 c58143e835f9: The symbol that stands for the beryllium atom.

LumenSecond
type: Class
subclass of: Restriction
  has value: 1.0
subclass of: Restriction
  has value: 0.0
comment: In photometry, the lumen second is the SI derived unit of luminous energy. It is based on the lumen, the SI unit of luminous flux, and the second, the SI base unit of time. The lumen second is sometimes called the talbot (symbol T). An older name for the lumen second was the lumberg. -- QUDT
alternative label: lumen second
EMMO 1f1b164d ec6a 4faa 8d5e 88bda62316cc: http://qudt.org/vocab/unit/LM-SEC
EMMO 33ae2d07 5526 4555 a0b4 8f4c031b5652: lm.s
EMMO 7f1dec83 d85e 4e1b b7bd c9442d4f5a64: lm⋅s
EMMO 967080e5 2f42 4eb2 a3a9 c58143e835f9: In photometry, the lumen second is the SI derived unit of luminous energy. It is based on the lumen, the SI unit of luminous flux, and the second, the SI base unit of time. The lumen second is sometimes called the talbot (symbol T). An older name for the lumen second was the lumberg. -- QUDT

GramPerMilliMetre
type: Class
subclass of: Restriction
  has value: 1.0
subclass of: Restriction
  has value: 0.0
comment: 0,001-fold of the SI base unit kilogram divided by the 0.001-fold the SI base unit meter -- QUDT
alternative label: Gram Per Millimetre
EMMO 1f1b164d ec6a 4faa 8d5e 88bda62316cc: http://qudt.org/vocab/unit/GM-PER-MilliM
EMMO 33ae2d07 5526 4555 a0b4 8f4c031b5652: g.mm-1
EMMO 7f1dec83 d85e 4e1b b7bd c9442d4f5a64: g/mm
EMMO 967080e5 2f42 4eb2 a3a9 c58143e835f9: 0,001-fold of the SI base unit kilogram divided by the 0.001-fold the SI base unit meter -- QUDT

GadoliniumAtom
type: Class
subclass of: Restriction
subclass of: Restriction
  has value: 157.25
subclass of: Restriction
  has value: 64
comment: Atom subclass for gadolinium.
EMMO 967080e5 2f42 4eb2 a3a9 c58143e835f9: Atom subclass for gadolinium.

Program
type: Class
equivalent class: Class
comment: A program is a sequence of instructions understandable by a computer's central processing unit (CPU) that indicates which operations the computer should perform on a set of data.
comment: A set of instructions that tell a computer what to do.
alternative label: Executable
EMMO 967080e5 2f42 4eb2 a3a9 c58143e835f9: A set of instructions that tell a computer what to do.
EMMO c7b62dd7 063a 4c2a 8504 42f7264ba83f: A program is a sequence of instructions understandable by a computer's central processing unit (CPU) that indicates which operations the computer should perform on a set of data.

Software
type: Class
comment: All or part of the programs, procedures, rules, and associated documentation of an information processing system.
comment: Software is usually used as a generic term for programs. However, in its broadest sense it can refer to all information (i.e., both programs and data) in electronic form and can provide a distinction from hardware, which refers to computers or other electronic systems on which software can exist and be use. Here we explicitly include in the definition also all the data (e.g. source code, script files) that takes part to the building of the executable, are necessary to the execution of a program or that document it for the users.
EMMO 967080e5 2f42 4eb2 a3a9 c58143e835f9: All or part of the programs, procedures, rules, and associated documentation of an information processing system.
EMMO c7b62dd7 063a 4c2a 8504 42f7264ba83f: Software is usually used as a generic term for programs. However, in its broadest sense it can refer to all information (i.e., both programs and data) in electronic form and can provide a distinction from hardware, which refers to computers or other electronic systems on which software can exist and be use. Here we explicitly include in the definition also all the data (e.g. source code, script files) that takes part to the building of the executable, are necessary to the execution of a program or that document it for the users.

GramPerCubicDeciMetre
type: Class
subclass of: Restriction
  has value: 1.0
subclass of: Restriction
  has value: 0.0
comment: 0,001-fold of the SI base unit kilogram divided by the 0.001-fold of the power of the SI base unit metre with the exponent 3 -- QUDT
alternative label: Gram Per Cubic Decimetre
EMMO 1f1b164d ec6a 4faa 8d5e 88bda62316cc: http://qudt.org/vocab/unit/GM-PER-DeciM3
EMMO 33ae2d07 5526 4555 a0b4 8f4c031b5652: g.dm-3
EMMO 7f1dec83 d85e 4e1b b7bd c9442d4f5a64: g/dm³
EMMO 967080e5 2f42 4eb2 a3a9 c58143e835f9: 0,001-fold of the SI base unit kilogram divided by the 0.001-fold of the power of the SI base unit metre with the exponent 3 -- QUDT

DensityUnit
type: Class
subclass of: Restriction
  has value: T0 L-3 M+1 I0 Θ0 N0 J0
comment: The class of units with dimensionality 'Density'.
EMMO 967080e5 2f42 4eb2 a3a9 c58143e835f9: The class of units with dimensionality 'Density'.

SiemensPerMetre
type: Class
subclass of: Restriction
  has value: 1.0
subclass of: Restriction
  has value: 0.0
comment: SI derived unit siemens divided by the SI base unit metre. -- QUDT
alternative label: Siemens Per Metre
EMMO 1f1b164d ec6a 4faa 8d5e 88bda62316cc: http://qudt.org/vocab/unit/S-PER-M
EMMO 33ae2d07 5526 4555 a0b4 8f4c031b5652: S.m-1
EMMO 33ae2d07 5526 4555 a0b4 8f4c031b5652: S/m
EMMO 7f1dec83 d85e 4e1b b7bd c9442d4f5a64: S/m
EMMO 967080e5 2f42 4eb2 a3a9 c58143e835f9: SI derived unit siemens divided by the SI base unit metre. -- QUDT

ManganeseAtom
type: Class
subclass of: Restriction
subclass of: Restriction
  has value: 54.938044
subclass of: Restriction
  has value: 25
comment: Atom subclass for manganese.
EMMO 967080e5 2f42 4eb2 a3a9 c58143e835f9: Atom subclass for manganese.

ApplicationSpecificScript
type: Class
comment: A scripting language developed specifically for an application, so that it's usage and interpretation is limited in this context.
example: Scripting file for the execution of modelling software such as LAMMPS, OpenFOAM, or for general purpose platforms such as MATLAB or Mathematica.
EMMO 967080e5 2f42 4eb2 a3a9 c58143e835f9: A scripting language developed specifically for an application, so that it's usage and interpretation is limited in this context.

ScriptingLanguage
type: Class
comment: A programming language that is executed through runtime interpretation.
EMMO 967080e5 2f42 4eb2 a3a9 c58143e835f9: A programming language that is executed through runtime interpretation.

CoulombPerKilogramSecond
type: Class
subclass of: Restriction
  has value: 1.0
subclass of: Restriction
  has value: 0.0
comment: The SI unit of exposure rate -- QUDT
alternative label: Coulomb Per Kilogram Second
EMMO 1f1b164d ec6a 4faa 8d5e 88bda62316cc: http://qudt.org/vocab/unit/C-PER-KiloGM-SEC
EMMO 33ae2d07 5526 4555 a0b4 8f4c031b5652: C.kg-1.s-1
EMMO 33ae2d07 5526 4555 a0b4 8f4c031b5652: C/(kg.s)
EMMO 7f1dec83 d85e 4e1b b7bd c9442d4f5a64: C/kg⋅s
EMMO 967080e5 2f42 4eb2 a3a9 c58143e835f9: The SI unit of exposure rate -- QUDT

ElectricCurrentPerMassUnit
type: Class
subclass of: Restriction
  has value: T0 L0 M-1 I+1 Θ0 N0 J0
comment: The class of units with dimensionality 'ElectricCurrentPerMass'.
EMMO 967080e5 2f42 4eb2 a3a9 c58143e835f9: The class of units with dimensionality 'ElectricCurrentPerMass'.

ChlorineAtom
type: Class
subclass of: Restriction
subclass of: Restriction
  has value: 35.45
subclass of: Restriction
  has value: 17
comment: Atom subclass for chlorine.
EMMO 967080e5 2f42 4eb2 a3a9 c58143e835f9: Atom subclass for chlorine.

AstronomicalUnit
type: Class
subclass of: Restriction
  has value: 149597900000.0
subclass of: Restriction
  has value: au
comment: An astronomical unit (abbreviated as AU, au, a.u., or ua) is a unit of length equal to 149,597,870,700 metres (92,955,807.273 mi) or approximately the mean Earth Sun distance. The symbol ua is recommended by the International Bureau of Weights and Measures, and the international standard ISO 80000, while au is recommended by the International Astronomical Union, and is more common in Anglosphere countries. In general, the International System of Units only uses capital letters for the symbols of units which are named after individual scientists, while au or a.u. can also mean atomic unit or even arbitrary unit. However, the use of AU to refer to the astronomical unit is widespread. The astronomical constant whose value is one astronomical unit is referred to as unit distance and is given the symbol A. [Wikipedia] -- QUDT
comment: One astronomical unit is defined as exactly 149597870700 m, which is roughly the distance from earth to sun.
alternative label: astronomical-unit
EMMO 0b1cbe60 d380 4787 b92e be26bdacf2c2: A12
EMMO 1f1b164d ec6a 4faa 8d5e 88bda62316cc: https://qudt.org/vocab/unit/AU
EMMO 33ae2d07 5526 4555 a0b4 8f4c031b5652: AU
EMMO 6dd685dd 1895 46e4 b227 be9f7d643c25: http://dbpedia.org/page/Astronomical_unit
EMMO 70fe84ff 99b6 4206 a9fc 9a8931836d84: One astronomical unit is defined as exactly 149597870700 m, which is roughly the distance from earth to sun.
EMMO 7f1dec83 d85e 4e1b b7bd c9442d4f5a64: AU
EMMO 7f1dec83 d85e 4e1b b7bd c9442d4f5a64: au
EMMO 967080e5 2f42 4eb2 a3a9 c58143e835f9: An astronomical unit (abbreviated as AU, au, a.u., or ua) is a unit of length equal to 149,597,870,700 metres (92,955,807.273 mi) or approximately the mean Earth Sun distance. The symbol ua is recommended by the International Bureau of Weights and Measures, and the international standard ISO 80000, while au is recommended by the International Astronomical Union, and is more common in Anglosphere countries. In general, the International System of Units only uses capital letters for the symbols of units which are named after individual scientists, while au or a.u. can also mean atomic unit or even arbitrary unit. However, the use of AU to refer to the astronomical unit is widespread. The astronomical constant whose value is one astronomical unit is referred to as unit distance and is given the symbol A. [Wikipedia] -- QUDT
EMMO c84c6752 6d64 48cc 9500 e54a3c34898d: http://en.wikipedia.org/wiki/Astronomical_unit

Mole
type: Class
subclass of: Restriction
  has value: mol
comment: The mole, symbol mol, is the SI unit of amount of substance. One mole contains exactly 6.022 140 76 × 1023 elementary entities. This number is the fixed numerical value of the Avogadro constant, NA, when expressed in the unit mol−1 and is called the Avogadro number. The amount of substance, symbol n, of a system is a measure of the number of specified elementary entities. An elementary entity may be an atom, a molecule, an ion, an electron, any other particle or specified group of particles.
EMMO 0b1cbe60 d380 4787 b92e be26bdacf2c2: C34
EMMO 1f1b164d ec6a 4faa 8d5e 88bda62316cc: http://qudt.org/vocab/unit/MOL
EMMO 33ae2d07 5526 4555 a0b4 8f4c031b5652: mol
EMMO 6dd685dd 1895 46e4 b227 be9f7d643c25: http://dbpedia.org/resource/Mole_%28unit%29
EMMO 70fe84ff 99b6 4206 a9fc 9a8931836d84: The mole, symbol mol, is the SI unit of amount of substance. One mole contains exactly 6.022 140 76 × 1023 elementary entities. This number is the fixed numerical value of the Avogadro constant, NA, when expressed in the unit mol−1 and is called the Avogadro number. The amount of substance, symbol n, of a system is a measure of the number of specified elementary entities. An elementary entity may be an atom, a molecule, an ion, an electron, any other particle or specified group of particles.
EMMO c84c6752 6d64 48cc 9500 e54a3c34898d: http://en.wikipedia.org/wiki/Mole_(unit)
EMMO fe015383 afb3 44a6 ae86 043628697aa2: https://doi.org/10.1351/goldbook.M03980

SIBaseUnit
type: Class
disjoint union of: Ampere
disjoint union of: Candela
disjoint union of: Kelvin
disjoint union of: Kilogram
disjoint union of: Metre
disjoint union of: Mole
disjoint union of: Second
comment: The base units in the SI system.
EMMO 967080e5 2f42 4eb2 a3a9 c58143e835f9: The base units in the SI system.

AmountUnit
type: Class
subclass of: Restriction
  has value: T0 L0 M0 I0 Θ0 N+1 J0
comment: The class of units with dimensionality 'Amount'.
EMMO 967080e5 2f42 4eb2 a3a9 c58143e835f9: The class of units with dimensionality 'Amount'.

Deci
type: Class
subclass of: Restriction
  has value: d
subclass of: Restriction
  has value: 0.1
comment: SI prefix who's value is 1/10.
EMMO 967080e5 2f42 4eb2 a3a9 c58143e835f9: SI prefix who's value is 1/10.

Coulomb
type: Class
subclass of: Restriction
  has value: C
comment: SI unit for electric charge.
comment: The SI unit of electric charge. One coulomb is the amount of charge accumulated in one second by a current of one ampere. Electricity is actually a flow of charged particles, such as electrons, protons, or ions. The charge on one of these particles is a whole-number multiple of the charge e on a single electron, and one coulomb represents a charge of approximately 6.241 506 x 1018 e. The coulomb is named for a French physicist, Charles-Augustin de Coulomb (1736-1806), who was the first to measure accurately the forces exerted between electric charges. -- QUDT
EMMO 0b1cbe60 d380 4787 b92e be26bdacf2c2: COU
EMMO 1f1b164d ec6a 4faa 8d5e 88bda62316cc: http://qudt.org/vocab/unit/C
EMMO 33ae2d07 5526 4555 a0b4 8f4c031b5652: C
EMMO 6dd685dd 1895 46e4 b227 be9f7d643c25: http://dbpedia.org/resource/Coulomb
EMMO 967080e5 2f42 4eb2 a3a9 c58143e835f9: SI unit for electric charge.
EMMO c7b62dd7 063a 4c2a 8504 42f7264ba83f: The SI unit of electric charge. One coulomb is the amount of charge accumulated in one second by a current of one ampere. Electricity is actually a flow of charged particles, such as electrons, protons, or ions. The charge on one of these particles is a whole-number multiple of the charge e on a single electron, and one coulomb represents a charge of approximately 6.241 506 x 1018 e. The coulomb is named for a French physicist, Charles-Augustin de Coulomb (1736-1806), who was the first to measure accurately the forces exerted between electric charges. -- QUDT
EMMO c84c6752 6d64 48cc 9500 e54a3c34898d: http://en.wikipedia.org/wiki/Coulomb
EMMO fe015383 afb3 44a6 ae86 043628697aa2: https://doi.org/10.1351/goldbook.C01365

ModulusOfAdmittance
type: Class
comment: Apparent admittance is often denoted by Y .
comment: quotient of the rms value of the electric current in a two-terminal element or a two-terminal circuit by the rms value of the voltage between its terminals.
EMMO 1f1b164d ec6a 4faa 8d5e 88bda62316cc: https://qudt.org/vocab/quantitykind/ModulusOfAdmittance
EMMO 26bf1bef d192 4da6 b0eb d2209698fb54: https://www.wikidata.org/wiki/Q79466359
EMMO 50c298c2 55a2 4068 b3ac 4e948c33181f: https://www.electropedia.org/iev/iev.nsf/display
EMMO 8de5d5bf db1c 40ac b698 095ba3b18578: 6-52.4
EMMO 967080e5 2f42 4eb2 a3a9 c58143e835f9: quotient of the rms value of the electric current in a two-terminal element or a two-terminal circuit by the rms value of the voltage between its terminals.
EMMO c7b62dd7 063a 4c2a 8504 42f7264ba83f: Apparent admittance is often denoted by Y .

ElectricConductance
type: Class
subclass of: Restriction
comment: Inverse of 'ElectricalResistance'.
comment: Measure of the ease for electric current to pass through a material.
alternative label: Conductance
EMMO 1f1b164d ec6a 4faa 8d5e 88bda62316cc: http://qudt.org/vocab/quantitykind/Conductance
EMMO 26bf1bef d192 4da6 b0eb d2209698fb54: https://www.wikidata.org/wiki/Q309017
EMMO 50c298c2 55a2 4068 b3ac 4e948c33181f: https://www.electropedia.org/iev/iev.nsf/display
EMMO 8de5d5bf db1c 40ac b698 095ba3b18578: 6-47
EMMO 967080e5 2f42 4eb2 a3a9 c58143e835f9: Measure of the ease for electric current to pass through a material.
EMMO fe015383 afb3 44a6 ae86 043628697aa2: https://doi.org/10.1351/goldbook.E01925

TemporalRole
type: Class
comment: An holistic temporal part of a whole.
alternative label: HolisticTemporalPart
EMMO 967080e5 2f42 4eb2 a3a9 c58143e835f9: An holistic temporal part of a whole.

RoleBySpatiotemporal
type: Class
comment: The superclass for all classes that categorise roles according to that fact that they are temporal or non-temporal parts of the whole.
EMMO 967080e5 2f42 4eb2 a3a9 c58143e835f9: The superclass for all classes that categorise roles according to that fact that they are temporal or non-temporal parts of the whole.

Dalton
type: Class
subclass of: Restriction
  has value: 1.660539e-27
subclass of: Restriction
  has value: 0.0
subclass of: Restriction
  has value: Da
comment: One dalton is defined as one twelfth of the mass of an unbound neutral atom of carbon-12 in its nuclear and electronic ground state.
comment: The unified atomic mass unit (symbol: μ) or dalton (symbol: Da) is a unit that is used for indicating mass on an atomic or molecular scale. It is defined as one twelfth of the rest mass of an unbound atom of carbon-12 in its nuclear and electronic ground state, and has a value of 1.660538782(83) × 10⁻²⁷ kg. One Da is approximately equal to the mass of one proton or one neutron. The CIPM have categorised it as a "non-SI unit whose values in SI units must be obtained experimentally". -- QUDT
alternative label: AtomicMassUnit
EMMO 0b1cbe60 d380 4787 b92e be26bdacf2c2: D43
EMMO 1f1b164d ec6a 4faa 8d5e 88bda62316cc: http://qudt.org/vocab/unit/Da
EMMO 33ae2d07 5526 4555 a0b4 8f4c031b5652: u
EMMO 6dd685dd 1895 46e4 b227 be9f7d643c25: http://dbpedia.org/page/Unified_atomic_mass_unit
EMMO 70fe84ff 99b6 4206 a9fc 9a8931836d84: One dalton is defined as one twelfth of the mass of an unbound neutral atom of carbon-12 in its nuclear and electronic ground state.
EMMO 7f1dec83 d85e 4e1b b7bd c9442d4f5a64: amu
EMMO 967080e5 2f42 4eb2 a3a9 c58143e835f9: The unified atomic mass unit (symbol: μ) or dalton (symbol: Da) is a unit that is used for indicating mass on an atomic or molecular scale. It is defined as one twelfth of the rest mass of an unbound atom of carbon-12 in its nuclear and electronic ground state, and has a value of 1.660538782(83) × 10⁻²⁷ kg. One Da is approximately equal to the mass of one proton or one neutron. The CIPM have categorised it as a "non-SI unit whose values in SI units must be obtained experimentally". -- QUDT
EMMO c84c6752 6d64 48cc 9500 e54a3c34898d: http://en.wikipedia.org/wiki/Atomic_mass_unit
EMMO fe015383 afb3 44a6 ae86 043628697aa2: https://doi.org/10.1351/goldbook.D01514

ChemicalSymbol
type: Class
equivalent class: Class

Symbol
type: Class
comment: Subclasses of 'Symbol' are alphabets, in formal languages terminology. A 'Symbol' is atomic for that alphabet, i.e. it has no parts that are symbols for the same alphabet. e.g. a math symbol is not made of other math symbols A Symbol may be a String in another language. e.g. "Bq" is the symbol for Becquerel units when dealing with metrology, or a string of "B" and "q" symbols when dealing with characters.
comment: The class of individuals that stand for an elementary mark of a specific symbolic code (alphabet).
alternative label: AlphabeticEntity
example: A letter, a number, a punctuation sign, a space, an UTF-8 character.
example: The class of letter "A" is the symbol as idea and the letter A that you see on the screen is the mark that can be represented by an individual belonging to "A".
EMMO 967080e5 2f42 4eb2 a3a9 c58143e835f9: The class of individuals that stand for an elementary mark of a specific symbolic code (alphabet).
EMMO c7b62dd7 063a 4c2a 8504 42f7264ba83f: Subclasses of 'Symbol' are alphabets, in formal languages terminology. A 'Symbol' is atomic for that alphabet, i.e. it has no parts that are symbols for the same alphabet. e.g. a math symbol is not made of other math symbols A Symbol may be a String in another language. e.g. "Bq" is the symbol for Becquerel units when dealing with metrology, or a string of "B" and "q" symbols when dealing with characters.
EMMO c7b62dd7 063a 4c2a 8504 42f7264ba83f: Symbols of a formal language need not be symbols of anything. For instance there are logical constants which do not refer to any idea, but rather serve as a form of punctuation in the language (e.g. parentheses). Symbols of a formal language must be capable of being specified without any reference to any interpretation of them. (Wikipedia)
EMMO c7b62dd7 063a 4c2a 8504 42f7264ba83f: The class is the idea of the symbol, while the individual of that class stands for a specific mark (or token) of that idea.

Chemical
type: Class
comment: A language object that follows the syntactic rules used in the chemical field.
EMMO 967080e5 2f42 4eb2 a3a9 c58143e835f9: A language object that follows the syntactic rules used in the chemical field.

AreaDensityUnit
type: Class
subclass of: Restriction
  has value: T0 L-2 M+1 I0 Θ0 N0 J0
comment: The class of units with dimensionality 'AreaDensity'.
EMMO 967080e5 2f42 4eb2 a3a9 c58143e835f9: The class of units with dimensionality 'AreaDensity'.

LuminousEfficacyOf540THzRadiation
type: Class
subclass of: Restriction
comment: Defines the Candela base unit in the SI system.
comment: The luminous efficacy of monochromatic radiation of frequency 540 × 10 12 Hz, K cd , is a technical constant that gives an exact numerical relationship between the purely physical characteristics of the radiant power stimulating the human eye (W) and its photobiological response defined by the luminous flux due to the spectral responsivity of a standard observer (lm) at a frequency of 540 × 10 12 hertz.
EMMO 967080e5 2f42 4eb2 a3a9 c58143e835f9: The luminous efficacy of monochromatic radiation of frequency 540 × 10 12 Hz, K cd , is a technical constant that gives an exact numerical relationship between the purely physical characteristics of the radiant power stimulating the human eye (W) and its photobiological response defined by the luminous flux due to the spectral responsivity of a standard observer (lm) at a frequency of 540 × 10 12 hertz.

SIExactConstant
type: Class
comment: Physical constant that by definition (after the latest revision of the SI system that was enforsed May 2019) has a known exact numerical value when expressed in SI units.
EMMO 967080e5 2f42 4eb2 a3a9 c58143e835f9: Physical constant that by definition (after the latest revision of the SI system that was enforsed May 2019) has a known exact numerical value when expressed in SI units.

MicroFaradPerMetre
type: Class
subclass of: Restriction
  has value: 1e-06
subclass of: Restriction
  has value: 0.0
comment: 0.000001-fold of the SI derived unit farad divided by the SI base unit metre. -- QUDT
alternative label: Microfarad Per Metre
EMMO 1f1b164d ec6a 4faa 8d5e 88bda62316cc: http://qudt.org/vocab/unit/MicroFARAD-PER-M
EMMO 33ae2d07 5526 4555 a0b4 8f4c031b5652: uF.m-1
EMMO 7f1dec83 d85e 4e1b b7bd c9442d4f5a64: μF/m
EMMO 967080e5 2f42 4eb2 a3a9 c58143e835f9: 0.000001-fold of the SI derived unit farad divided by the SI base unit metre. -- QUDT

PermittivityUnit
type: Class
subclass of: Restriction
  has value: T+4 L-3 M-1 I+2 Θ0 N0 J0
comment: The class of units with dimensionality 'Permittivity'.
EMMO 967080e5 2f42 4eb2 a3a9 c58143e835f9: The class of units with dimensionality 'Permittivity'.

EuropiumSymbol
type: Class
subclass of: Restriction
  has value: Eu
comment: The symbol that stands for the europium atom.
EMMO 967080e5 2f42 4eb2 a3a9 c58143e835f9: The symbol that stands for the europium atom.

WattPerSquareMetrePerNanoMetrePerSteradian
type: Class
subclass of: Restriction
  has value: 1000000000.0
subclass of: Restriction
  has value: 0.0
comment: Watt per square metre and nanometre and steradian unit.
EMMO 1f1b164d ec6a 4faa 8d5e 88bda62316cc: http://qudt.org/vocab/unit/W-PER-M2-NanoM-SR
EMMO 33ae2d07 5526 4555 a0b4 8f4c031b5652: W.m-2.nm-1.sr-1
EMMO 7f1dec83 d85e 4e1b b7bd c9442d4f5a64: W/m²⋅nm⋅sr
EMMO 967080e5 2f42 4eb2 a3a9 c58143e835f9: Watt per square metre and nanometre and steradian unit.

PressurePerTimeUnit
type: Class
subclass of: Restriction
  has value: T-3 L-1 M+1 I0 Θ0 N0 J0
comment: The class of units with dimensionality 'PressurePerTime'.
EMMO 967080e5 2f42 4eb2 a3a9 c58143e835f9: The class of units with dimensionality 'PressurePerTime'.

AlphaDisintegrationEnergy
type: Class
comment: Sum of the kinetic energy of the α-particle produced in the disintegration process and the recoil energy of the product atom in a reference frame in which the emitting nucleus is at rest before its disintegration.
EMMO 1f1b164d ec6a 4faa 8d5e 88bda62316cc: http://qudt.org/vocab/quantitykind/AlphaDisintegrationEnergy
EMMO 26bf1bef d192 4da6 b0eb d2209698fb54: https://www.wikidata.org/wiki/Q98146025
EMMO 8de5d5bf db1c 40ac b698 095ba3b18578: 10-32
EMMO 967080e5 2f42 4eb2 a3a9 c58143e835f9: Sum of the kinetic energy of the α-particle produced in the disintegration process and the recoil energy of the product atom in a reference frame in which the emitting nucleus is at rest before its disintegration.

POH
type: Class
comment: Written as pOH
comment: number quantifying the acidic or the alkaline character of a solution, equal to the negative of the decimal logarithm of ion activity aOH- of the hydroxide anion OH- pH = −10 log(a_OH-)
EMMO 967080e5 2f42 4eb2 a3a9 c58143e835f9: number quantifying the acidic or the alkaline character of a solution, equal to the negative of the decimal logarithm of ion activity aOH- of the hydroxide anion OH- pH = −10 log(a_OH-)

IonActivity
type: Class
comment: Normally a standard solution is a solution of the ion at a molality of 1 mol/kg (exactly). Standardized conditions are normally 1013,25 hPa and 25 °C.
comment: The correction factor is called activity coefficient and it is determined experimentally. See ActivityCoefficient
comment: ratio of the product of ion molality b and a correction factor γ to the molality b° of the same ion in a standard solution under standardized conditions: a = bγ / b°.
EMMO 50c298c2 55a2 4068 b3ac 4e948c33181f: https://www.electropedia.org/iev/iev.nsf/display
EMMO 967080e5 2f42 4eb2 a3a9 c58143e835f9: ratio of the product of ion molality b and a correction factor γ to the molality b° of the same ion in a standard solution under standardized conditions: a = bγ / b°.

PH
type: Class
comment: At about 25 °C aqueous solutions with: pH < 7 are acidic; pH = 7 are neutral; pH > 7 are alkaline. At temperatures far from 25 °C the pH of a neutral solution differs significantly from 7.
comment: Number quantifying the acidic or the alkaline character of a solution, equal to the negative of the decimal logarithm of ion activity aH+ of the hydrogen cation H+ pH = −10 log(a_H+).
comment: Written as pH
EMMO 50c298c2 55a2 4068 b3ac 4e948c33181f: https://www.electropedia.org/iev/iev.nsf/display
EMMO 8de5d5bf db1c 40ac b698 095ba3b18578: For more details, see ISO 80000-9:2009, Annex C
EMMO 967080e5 2f42 4eb2 a3a9 c58143e835f9: Number quantifying the acidic or the alkaline character of a solution, equal to the negative of the decimal logarithm of ion activity aH+ of the hydrogen cation H+ pH = −10 log(a_H+).
EMMO fe015383 afb3 44a6 ae86 043628697aa2: https://doi.org/10.1351/goldbook.P04524

SquareMetrePerGram
type: Class
subclass of: Restriction
  has value: 1000.0
subclass of: Restriction
  has value: 0.0
comment: A unit in the category of specific area.
alternative label: Square metres per gram
EMMO 1f1b164d ec6a 4faa 8d5e 88bda62316cc: http://qudt.org/vocab/unit/M2-PER-GM
EMMO 33ae2d07 5526 4555 a0b4 8f4c031b5652: m2.g-1
EMMO 7f1dec83 d85e 4e1b b7bd c9442d4f5a64: m²/g
EMMO 967080e5 2f42 4eb2 a3a9 c58143e835f9: A unit in the category of specific area.

AreaPerMassUnit
type: Class
subclass of: Restriction
  has value: T0 L+2 M-1 I0 Θ0 N0 J0
comment: The class of units with dimensionality 'AreaPerMass'.
EMMO 967080e5 2f42 4eb2 a3a9 c58143e835f9: The class of units with dimensionality 'AreaPerMass'.

Machining
type: Class
comment: A manufacturing in which material is removed from the workpiece in the form of chips.
alternative label: RemovingChipsFromWorkpiece
EMMO 967080e5 2f42 4eb2 a3a9 c58143e835f9: A manufacturing in which material is removed from the workpiece in the form of chips.

DefinedEdgeCutting
type: Class
alternative label: Machining in which a tool is used whose number of cutting edges, geometry of the cutting wedges and position of the cutting edges in relation to the workpiece are determined
alternative label: Spanen mit geometrisch bestimmten Schneiden

JoulePerKilogramKelvinPerPascal
type: Class
subclass of: Restriction
  has value: 1.0
subclass of: Restriction
  has value: 0.0
comment: Joule per kilogram and Kelvin and Pascal.
EMMO 1f1b164d ec6a 4faa 8d5e 88bda62316cc: http://qudt.org/vocab/unit/J-PER-KiloGM-K-PA
EMMO 33ae2d07 5526 4555 a0b4 8f4c031b5652: J.kg-1.K-1.Pa-1
EMMO 7f1dec83 d85e 4e1b b7bd c9442d4f5a64: J/(kg⋅K⋅Pa)
EMMO 967080e5 2f42 4eb2 a3a9 c58143e835f9: Joule per kilogram and Kelvin and Pascal.

Coercivity
type: Class
subclass of: Restriction
comment: Coercive field strength in a substance when either the magnetic flux density or the magnetic polarization and magnetization is brought from its value at magnetic saturation to zero by monotonic reduction of the applied magnetic field strength.
EMMO 1f1b164d ec6a 4faa 8d5e 88bda62316cc: https://qudt.org/vocab/quantitykind/Coercivity
EMMO 26bf1bef d192 4da6 b0eb d2209698fb54: https://www.wikidata.org/wiki/Q432635
EMMO 50c298c2 55a2 4068 b3ac 4e948c33181f: https://www.electropedia.org/iev/iev.nsf/display
EMMO 8de5d5bf db1c 40ac b698 095ba3b18578: 6-31
EMMO 967080e5 2f42 4eb2 a3a9 c58143e835f9: Coercive field strength in a substance when either the magnetic flux density or the magnetic polarization and magnetization is brought from its value at magnetic saturation to zero by monotonic reduction of the applied magnetic field strength.

TimePerVolumeUnit
type: Class
subclass of: Restriction
  has value: T+1 L-3 M0 I0 Θ0 N0 J0
comment: The class of units with dimensionality 'TimePerVolume'.
EMMO 967080e5 2f42 4eb2 a3a9 c58143e835f9: The class of units with dimensionality 'TimePerVolume'.

IterativeTask
type: Class
comment: An iterative workflow which is a task of a larger workflow.
example: A Jacobi method, involving the iterative multiplication between a matrix A and a vector x, which is part of larger workflow for the solution of a partial differential equation using finite differences.
EMMO 967080e5 2f42 4eb2 a3a9 c58143e835f9: An iterative workflow which is a task of a larger workflow.

TaskByFlow
type: Class
EMMO 157fdf31 6387 42be 8e72 10530519214a: A task in a workflow, categorised by how it is connected to other tasks.

IterativeWorkflow
type: Class
comment: A workflow whose steps are the repetition of the same task type.
EMMO 967080e5 2f42 4eb2 a3a9 c58143e835f9: A workflow whose steps are the repetition of the same task type.

Soldering
type: Class
comment: Method of joining metallic materials with the aid of a molten filler metal (solder), optionally with the use of flow agents
alternative label: Löten

JoinManufacturing
type: Class
comment: A manufacturing involving the creation of long-term connection of several workpieces.
comment: The permanent joining or other bringing together of two or more workpieces of a geometric shape or of similar workpieces with shapeless material. In each case, the cohesion is created locally and increased as a whole.
see also: DIN 8580:2020
alternative label: Fügen @de
EMMO 967080e5 2f42 4eb2 a3a9 c58143e835f9: A manufacturing involving the creation of long-term connection of several workpieces.

NanoHenryPerMetre
type: Class
subclass of: Restriction
  some values from: HenryPerMetre
subclass of: Restriction
  has value: 1e-09
subclass of: Restriction
  has value: 0.0
comment: 0.000000001-fold of the SI derived unit henry divided by the SI base unit metre -- QUDT
alternative label: Nanohenry Per Metre
EMMO 1f1b164d ec6a 4faa 8d5e 88bda62316cc: http://qudt.org/vocab/unit/NanoH-PER-M
EMMO 33ae2d07 5526 4555 a0b4 8f4c031b5652: nH.m-1
EMMO 7f1dec83 d85e 4e1b b7bd c9442d4f5a64: nH/m
EMMO 967080e5 2f42 4eb2 a3a9 c58143e835f9: 0.000000001-fold of the SI derived unit henry divided by the SI base unit metre -- QUDT

PermeabilityUnit
type: Class
subclass of: Restriction
  has value: T-2 L+1 M+1 I-2 Θ0 N0 J0
comment: The class of units with dimensionality 'Permeability'.
EMMO 967080e5 2f42 4eb2 a3a9 c58143e835f9: The class of units with dimensionality 'Permeability'.

Fusion
type: Class
comment: A mereological fusion is any entity that is made up of two or more quantum entities, regardless of the fact that they are or not self-connected. It captures the idea of set, but excluding singletons.
comment: The class of individuals representing mereological fusions consisting of two or more quantum entities.
comment: The union of the CausalCluster and CausalStructure classes.
example: An atom, a group of persons, a fluid.
EMMO 31252f35 c767 4b97 a877 1235076c3e13: A mereological fusion is any entity that is made up of two or more quantum entities, regardless of the fact that they are or not self-connected. It captures the idea of set, but excluding singletons.
EMMO 70fe84ff 99b6 4206 a9fc 9a8931836d84: The union of the CausalCluster and CausalStructure classes.
EMMO 8a137e9f 579c 4e28 baca e8980eb0c3db: EquivalentTo: CausalCluster or CausalStructure
EMMO 967080e5 2f42 4eb2 a3a9 c58143e835f9: The class of individuals representing mereological fusions consisting of two or more quantum entities.

Dismantling
type: Class
comment: action to disassemble a product or a component by removing all or some of its constituent parts with the intent to salvage
alternative label: Demontage
EMMO c7b62dd7 063a 4c2a 8504 42f7264ba83f: action to disassemble a product or a component by removing all or some of its constituent parts with the intent to salvage

SeparateManufacturing
type: Class
comment: A manufacturing process in which the shape of a workpiece is changed by breaking the material cohesion at the processing point and thus the material cohesion is reduced overall.
see also: DIN 8580:2020
alternative label: CuttingManufacturing
alternative label: Trennen @de
EMMO 967080e5 2f42 4eb2 a3a9 c58143e835f9: A manufacturing process in which the shape of a workpiece is changed by breaking the material cohesion at the processing point and thus the material cohesion is reduced overall.

NanoMolePerMicroMole
type: Class
subclass of: Restriction
  has value: 0.001
subclass of: Restriction
  has value: 0.0
comment: Unavailable. -- QUDT
alternative label: Nanomoles per micromole
EMMO 1f1b164d ec6a 4faa 8d5e 88bda62316cc: http://qudt.org/vocab/unit/NanoMOL-PER-MicroMOL
EMMO 33ae2d07 5526 4555 a0b4 8f4c031b5652: nmol.umol-1
EMMO 7f1dec83 d85e 4e1b b7bd c9442d4f5a64: nmol/µmol
EMMO 967080e5 2f42 4eb2 a3a9 c58143e835f9: Unavailable. -- QUDT

AmountFractionUnit
type: Class
comment: Unit for quantities of dimension one that are the fraction of two amount of substance.
example: Unit for amount fraction.
EMMO 967080e5 2f42 4eb2 a3a9 c58143e835f9: Unit for quantities of dimension one that are the fraction of two amount of substance.

Representation
type: Class
comment: A graphical object aimed to represent schematically the conceptual, temporal or spatial structure of another object, that may or may not exist.
EMMO 967080e5 2f42 4eb2 a3a9 c58143e835f9: A graphical object aimed to represent schematically the conceptual, temporal or spatial structure of another object, that may or may not exist.

Graphical
type: Class
comment: A 'Perceptual' which stands for a real world object whose spatial configuration results from an explicit graphical procedure and shows an identifiable pattern.
comment: This concept includes only things that are purposely created by an agent.
example: 'Graphical' objects include writings, pictures, sketches ...
EMMO 967080e5 2f42 4eb2 a3a9 c58143e835f9: A 'Perceptual' which stands for a real world object whose spatial configuration results from an explicit graphical procedure and shows an identifiable pattern.
EMMO c7b62dd7 063a 4c2a 8504 42f7264ba83f: This concept includes only things that are purposely created by an agent.

Molecule
type: Class
subclass of: Restriction
comment: An atom_based state defined by an exact number of e-bonded atomic species and an electron cloud made of the shared electrons.
comment: An entity is called essential if removing one direct part will lead to a change in entity class. An entity is called redundant if removing one direct part will not lead to a change in entity class.
alternative label: ChemicalSubstance
example: H₂0, C₆H₁₂O₆, CH₄
EMMO 8a137e9f 579c 4e28 baca e8980eb0c3db: DisjointUnionOf: Heteronuclear, Homonuclear
EMMO 967080e5 2f42 4eb2 a3a9 c58143e835f9: An atom_based state defined by an exact number of e-bonded atomic species and an electron cloud made of the shared electrons.
EMMO c7b62dd7 063a 4c2a 8504 42f7264ba83f: An entity is called essential if removing one direct part will lead to a change in entity class. An entity is called redundant if removing one direct part will not lead to a change in entity class.
EMMO c7b62dd7 063a 4c2a 8504 42f7264ba83f: This definition states that this object is a non-periodic set of atoms or a set with a finite periodicity. Removing an atom from the state will result in another type of atom_based state. e.g. you cannot remove H from H₂0 without changing the molecule type (essential). However, you can remove a C from a nanotube (redundant). C60 fullerene is a molecule, since it has a finite periodicity and is made of a well defined number of atoms (essential). A C nanotube is not a molecule, since it has an infinite periodicity (redundant).

Exponent
type: Class

AlgebraicOperator
type: Class

CentiMole
type: Class
subclass of: Restriction
  some values from: Mole
subclass of: Restriction
  has value: 0.01
subclass of: Restriction
  has value: 0.0
comment: A centimole 0.01 N.
alternative label: centimole
EMMO 1f1b164d ec6a 4faa 8d5e 88bda62316cc: http://qudt.org/vocab/unit/CentiMOL
EMMO 7f1dec83 d85e 4e1b b7bd c9442d4f5a64: cmol
EMMO 967080e5 2f42 4eb2 a3a9 c58143e835f9: A centimole 0.01 N.

ProgrammingLanguage
type: Class
comment: A language object that follows syntactic rules of a programming language.
comment: A programming language object can also be a fragment (e.g. a C function) not suitable for exectution.
alternative label: Code
alternative label: SoftwareCode
EMMO 967080e5 2f42 4eb2 a3a9 c58143e835f9: A language object that follows syntactic rules of a programming language.
EMMO c7b62dd7 063a 4c2a 8504 42f7264ba83f: A programming language object can also be a fragment (e.g. a C function) not suitable for exectution.
EMMO c7b62dd7 063a 4c2a 8504 42f7264ba83f: Entities are not necessarily digital data, but can be code fragments printed on paper.

VolumicCrossSection
type: Class
subclass of: Restriction
comment: In nuclear physics, product of the number density of atoms of a given type and the cross section.
alternative label: MacroscopicCrossSection
EMMO 1f1b164d ec6a 4faa 8d5e 88bda62316cc: https://qudt.org/vocab/quantitykind/MacroscopicCrossSection
EMMO 26bf1bef d192 4da6 b0eb d2209698fb54: https://www.wikidata.org/wiki/Q98280520
EMMO 8de5d5bf db1c 40ac b698 095ba3b18578: 10-42.1
EMMO 967080e5 2f42 4eb2 a3a9 c58143e835f9: In nuclear physics, product of the number density of atoms of a given type and the cross section.
EMMO fe015383 afb3 44a6 ae86 043628697aa2: https://doi.org/10.1351/goldbook.M03674

KilogramMetrePerSecond
type: Class
subclass of: Restriction
  has value: 1.0
subclass of: Restriction
  has value: 0.0
comment: "Kilogram Meter Per Second" is a unit for 'Linear Momentum' expressed as kg-m/s. -- QUDT
alternative label: Kilogram Metre Per Second
EMMO 1f1b164d ec6a 4faa 8d5e 88bda62316cc: http://qudt.org/vocab/unit/KiloGM-M-PER-SEC
EMMO 33ae2d07 5526 4555 a0b4 8f4c031b5652: kg.m.s-1
EMMO 33ae2d07 5526 4555 a0b4 8f4c031b5652: kg.m/s
EMMO 7f1dec83 d85e 4e1b b7bd c9442d4f5a64: kg⋅m/s
EMMO 967080e5 2f42 4eb2 a3a9 c58143e835f9: "Kilogram Meter Per Second" is a unit for 'Linear Momentum' expressed as kg-m/s. -- QUDT

ScalarMeson
type: Class
comment: A meson with spin zero and even parity.
EMMO 967080e5 2f42 4eb2 a3a9 c58143e835f9: A meson with spin zero and even parity.
EMMO c84c6752 6d64 48cc 9500 e54a3c34898d: https://en.wikipedia.org/wiki/Scalar_meson

Meson
type: Class
subclass of: Restriction
comment: Hadronic subatomic particles composed of an equal number of quarks and antiquarks bound together by strong interactions.
comment: Most mesons are composed of one quark and one antiquark.
EMMO 8a137e9f 579c 4e28 baca e8980eb0c3db: EquivalentTo: PseudoscalarMeson or VectorMeson or ScalarMeson or PseudovectorMeson or TensorMeson
EMMO 967080e5 2f42 4eb2 a3a9 c58143e835f9: Hadronic subatomic particles composed of an equal number of quarks and antiquarks bound together by strong interactions.
EMMO c7b62dd7 063a 4c2a 8504 42f7264ba83f: Most mesons are composed of one quark and one antiquark.
EMMO c84c6752 6d64 48cc 9500 e54a3c34898d: https://en.wikipedia.org/wiki/Meson

ParticleEmissionRate
type: Class
comment: Differential quotient of N with respect to time, where N is the number of particles being emitted from an infinitesimally small volume element in the time interval of duration dt, and dt.
EMMO 26bf1bef d192 4da6 b0eb d2209698fb54: https://www.wikidata.org/wiki/Q98153151
EMMO 8de5d5bf db1c 40ac b698 095ba3b18578: 10-36
EMMO 967080e5 2f42 4eb2 a3a9 c58143e835f9: Differential quotient of N with respect to time, where N is the number of particles being emitted from an infinitesimally small volume element in the time interval of duration dt, and dt.

ReciprocalDuration
type: Class
subclass of: Restriction
comment: A quantity defined as the inverse of time.
alternative label: InverseDuration
alternative label: InverseTime
alternative label: ReciprocalTime
example: Frequency or rate.
EMMO 1f1b164d ec6a 4faa 8d5e 88bda62316cc: https://qudt.org/vocab/quantitykind/InverseTime
EMMO 26bf1bef d192 4da6 b0eb d2209698fb54: https://www.wikidata.org/wiki/Q98690850
EMMO 967080e5 2f42 4eb2 a3a9 c58143e835f9: A quantity defined as the inverse of time.

TeraCoulomb
type: Class
subclass of: Restriction
  some values from: Coulomb
subclass of: Restriction
  has value: 1000000000000.0
subclass of: Restriction
  has value: 0.0
comment: A TeraCoulomb is 10¹² C. -- QUDT
EMMO 1f1b164d ec6a 4faa 8d5e 88bda62316cc: http://qudt.org/vocab/unit/TeraC
EMMO 33ae2d07 5526 4555 a0b4 8f4c031b5652: TC
EMMO 7f1dec83 d85e 4e1b b7bd c9442d4f5a64: TC
EMMO 967080e5 2f42 4eb2 a3a9 c58143e835f9: A TeraCoulomb is 10¹² C. -- QUDT

ZeptoCoulomb
type: Class
subclass of: Restriction
  some values from: Coulomb
subclass of: Restriction
  has value: 1e-21
subclass of: Restriction
  has value: 0.0
comment: A ZeptoCoulomb is 10⁻²¹ C. -- QUDT
EMMO 1f1b164d ec6a 4faa 8d5e 88bda62316cc: http://qudt.org/vocab/unit/ZeptoC
EMMO 33ae2d07 5526 4555 a0b4 8f4c031b5652: zC
EMMO 7f1dec83 d85e 4e1b b7bd c9442d4f5a64: zC
EMMO 967080e5 2f42 4eb2 a3a9 c58143e835f9: A ZeptoCoulomb is 10⁻²¹ C. -- QUDT

ZeptoPrefixedUnit
type: Class
subclass of: Restriction
subclass of: Restriction
  has value: 1e-21
comment: Superclass for all units prefixed with "zepto" (1e-21).
EMMO 967080e5 2f42 4eb2 a3a9 c58143e835f9: Superclass for all units prefixed with "zepto" (1e-21).

ThomsonCoefficient
type: Class
subclass of: Restriction
comment: Quotient of Thomson heat power developed, and the electric current and temperature difference.
EMMO 1f1b164d ec6a 4faa 8d5e 88bda62316cc: https://qudt.org/vocab/quantitykind/ThomsonCoefficient
EMMO 26bf1bef d192 4da6 b0eb d2209698fb54: https://www.wikidata.org/wiki/Q105801233
EMMO 8de5d5bf db1c 40ac b698 095ba3b18578: 12-23
EMMO 967080e5 2f42 4eb2 a3a9 c58143e835f9: Quotient of Thomson heat power developed, and the electric current and temperature difference.

JouleThomsonCoefficient
type: Class
subclass of: Restriction
comment: Change of thermodynamic temperature with respect to pressure in a Joule-Thomson process at constant enthalpy.
EMMO 26bf1bef d192 4da6 b0eb d2209698fb54: https://www.wikidata.org/wiki/Q93946998
EMMO 8de5d5bf db1c 40ac b698 095ba3b18578: 5-24
EMMO 967080e5 2f42 4eb2 a3a9 c58143e835f9: Change of thermodynamic temperature with respect to pressure in a Joule-Thomson process at constant enthalpy.

MicroMolePerSecond
type: Class
subclass of: Restriction
  some values from: MolePerSecond
subclass of: Restriction
  has value: 1e-06
subclass of: Restriction
  has value: 0.0
comment: This unit is used commonly to describe Photosynthetic Photon Flux (PPF) - the total number of photons emitted by a light source each second within the PAR wavelength range. -- QUDT
alternative label: Micromoles per second
EMMO 1f1b164d ec6a 4faa 8d5e 88bda62316cc: http://qudt.org/vocab/unit/MicroMOL-PER-SEC
EMMO 33ae2d07 5526 4555 a0b4 8f4c031b5652: umol.s-1
EMMO 33ae2d07 5526 4555 a0b4 8f4c031b5652: umol/s
EMMO 7f1dec83 d85e 4e1b b7bd c9442d4f5a64: µmol/s
EMMO 967080e5 2f42 4eb2 a3a9 c58143e835f9: This unit is used commonly to describe Photosynthetic Photon Flux (PPF) - the total number of photons emitted by a light source each second within the PAR wavelength range. -- QUDT

CatalyticActivityUnit
type: Class
subclass of: Restriction
  has value: T-1 L0 M0 I0 Θ0 N+1 J0
comment: The class of units with dimensionality 'CatalyticActivity'.
EMMO 967080e5 2f42 4eb2 a3a9 c58143e835f9: The class of units with dimensionality 'CatalyticActivity'.

SpecificActivity
type: Class
subclass of: Restriction
comment: Quotient of the activity A of a sample and the mass m of that sample.
alternative label: MassicActivity
EMMO 1f1b164d ec6a 4faa 8d5e 88bda62316cc: https://qudt.org/vocab/quantitykind/SpecificActivity
EMMO 26bf1bef d192 4da6 b0eb d2209698fb54: https://www.wikidata.org/wiki/Q2823748
EMMO 50c298c2 55a2 4068 b3ac 4e948c33181f: https://www.electropedia.org/iev/iev.nsf/display
EMMO 8de5d5bf db1c 40ac b698 095ba3b18578: 10-28
EMMO 967080e5 2f42 4eb2 a3a9 c58143e835f9: Quotient of the activity A of a sample and the mass m of that sample.
EMMO fe015383 afb3 44a6 ae86 043628697aa2: https://doi.org/10.1351/goldbook.S05790

LatticePlaneSpacing
type: Class
comment: distance between successive lattice planes
EMMO 1f1b164d ec6a 4faa 8d5e 88bda62316cc: https://qudt.org/vocab/quantitykind/LatticePlaneSpacing
EMMO 26bf1bef d192 4da6 b0eb d2209698fb54: https://www.wikidata.org/wiki/Q105488046
EMMO 8de5d5bf db1c 40ac b698 095ba3b18578: 12-3
EMMO 967080e5 2f42 4eb2 a3a9 c58143e835f9: distance between successive lattice planes

Distance
type: Class
comment: Distance is the norm of Displacement.
comment: Shortest path length between two points in a metric space.
EMMO 1f1b164d ec6a 4faa 8d5e 88bda62316cc: https://qudt.org/vocab/quantitykind/Distance
EMMO 26bf1bef d192 4da6 b0eb d2209698fb54: https://www.wikidata.org/wiki/Q126017
EMMO 50c298c2 55a2 4068 b3ac 4e948c33181f: https://www.electropedia.org/iev/iev.nsf/display
EMMO 6dd685dd 1895 46e4 b227 be9f7d643c25: https://dbpedia.org/page/Distance
EMMO 8de5d5bf db1c 40ac b698 095ba3b18578: 3-1.8
EMMO 967080e5 2f42 4eb2 a3a9 c58143e835f9: Shortest path length between two points in a metric space.
EMMO c84c6752 6d64 48cc 9500 e54a3c34898d: https://en.wikipedia.org/wiki/Distance

HolisticSystem
type: Class
comment: A system is conceived as an aggregate of things that 'work' (or interact) together. While a system extends in time through distinct temporal parts (like every other 4D object), this elucdation focuses on a timescale in which the obejct shows a persistence in time.
comment: An object that is made of a set of sub objects working together as parts of a mechanism or an interconnecting network (natural or artificial); a complex whole.
EMMO 8a137e9f 579c 4e28 baca e8980eb0c3db: SubClassOf: hasComponent some Component
EMMO 967080e5 2f42 4eb2 a3a9 c58143e835f9: An object that is made of a set of sub objects working together as parts of a mechanism or an interconnecting network (natural or artificial); a complex whole.
EMMO c7b62dd7 063a 4c2a 8504 42f7264ba83f: A system is conceived as an aggregate of things that 'work' (or interact) together. While a system extends in time through distinct temporal parts (like every other 4D object), this elucdation focuses on a timescale in which the obejct shows a persistence in time.

Whole
type: Class
subclass of: Restriction
comment: A whole is always defined using a criterion expressed through the classical transitive parthood relation. This class is expected to host the definition of world objects as they appear in its wholeness, dependently on some of their parts and independently on the surroundings.
comment: The superclass of entities which are defined by requiring the existence of some parts (at least one) of specifically given types, where the specified types are different with respect to the type of the whole.
EMMO 967080e5 2f42 4eb2 a3a9 c58143e835f9: The superclass of entities which are defined by requiring the existence of some parts (at least one) of specifically given types, where the specified types are different with respect to the type of the whole.
EMMO c7b62dd7 063a 4c2a 8504 42f7264ba83f: A whole is always defined using a criterion expressed through the classical transitive parthood relation. This class is expected to host the definition of world objects as they appear in its wholeness, dependently on some of their parts and independently on the surroundings.
EMMO c7b62dd7 063a 4c2a 8504 42f7264ba83f: A whole is categorized as fundamental (or maximal) or redundant (non-maximal).

LinearExpansionCoefficient
type: Class
comment: Relative change of length per change of temperature.
EMMO 1f1b164d ec6a 4faa 8d5e 88bda62316cc: https://qudt.org/vocab/quantitykind/LinearExpansionCoefficient
EMMO 26bf1bef d192 4da6 b0eb d2209698fb54: https://www.wikidata.org/wiki/Q74760821
EMMO 50c298c2 55a2 4068 b3ac 4e948c33181f: https://www.electropedia.org/iev/iev.nsf/display
EMMO 8de5d5bf db1c 40ac b698 095ba3b18578: 5-3.1
EMMO 967080e5 2f42 4eb2 a3a9 c58143e835f9: Relative change of length per change of temperature.

CoefficientOfThermalExpansion
type: Class
subclass of: Restriction
comment: Material property which describes how the size of an object changes with a change in temperature.
alternative label: ThermalExpansionCoefficient
EMMO 26bf1bef d192 4da6 b0eb d2209698fb54: https://www.wikidata.org/wiki/Q45760
EMMO 967080e5 2f42 4eb2 a3a9 c58143e835f9: Material property which describes how the size of an object changes with a change in temperature.

WattPerSteradian
type: Class
subclass of: Restriction
  has value: 1.0
subclass of: Restriction
  has value: 0.0
comment: `Watt Per Steradian (W/sr)` is the unit in the category of Radiant intensity. It is also known as watts per steradian. This unit is commonly used in the SI unit system. Watt Per Steradian (W/sr) has a dimension of M· L⁻²· T⁻³ where M is mass, L is length, and T is time. This unit is the standard SI unit in this category. -- QUDT
alternative label: Watt per Steradian
EMMO 1f1b164d ec6a 4faa 8d5e 88bda62316cc: http://qudt.org/vocab/unit/W-PER-SR
EMMO 33ae2d07 5526 4555 a0b4 8f4c031b5652: W.sr-1
EMMO 7f1dec83 d85e 4e1b b7bd c9442d4f5a64: W/sr
EMMO 967080e5 2f42 4eb2 a3a9 c58143e835f9: `Watt Per Steradian (W/sr)` is the unit in the category of Radiant intensity. It is also known as watts per steradian. This unit is commonly used in the SI unit system. Watt Per Steradian (W/sr) has a dimension of M· L⁻²· T⁻³ where M is mass, L is length, and T is time. This unit is the standard SI unit in this category. -- QUDT

MilliHenryPerKiloOhm
type: Class
subclass of: Restriction
  some values from: HenryPerKiloOhm
subclass of: Restriction
  has value: 1e-06
subclass of: Restriction
  has value: 0.0
comment: 0.001-fold of the SI derived unit henry divided by the 1 000-fold of the SI derived unit ohm -- QUDT
alternative label: Millihenry Per Kiloohm
EMMO 1f1b164d ec6a 4faa 8d5e 88bda62316cc: http://qudt.org/vocab/unit/MilliH-PER-KiloOHM
EMMO 33ae2d07 5526 4555 a0b4 8f4c031b5652: mH.kOhm-1
EMMO 7f1dec83 d85e 4e1b b7bd c9442d4f5a64: mH/kΩ
EMMO 967080e5 2f42 4eb2 a3a9 c58143e835f9: 0.001-fold of the SI derived unit henry divided by the 1 000-fold of the SI derived unit ohm -- QUDT

NonNuclear
type: Class
comment: The superclass for all classes of entities that have a proper parts of the same type φ of the whole, but have no φ proper part that is part of other φ proper parts.
EMMO 967080e5 2f42 4eb2 a3a9 c58143e835f9: The superclass for all classes of entities that have a proper parts of the same type φ of the whole, but have no φ proper part that is part of other φ proper parts.

Multiplex
type: Class
comment: The superclass for all classes of entities that have a proper parts of the same type of the whole that overlaps all the oter proper parts of the same type.
EMMO 967080e5 2f42 4eb2 a3a9 c58143e835f9: The superclass for all classes of entities that have a proper parts of the same type of the whole that overlaps all the oter proper parts of the same type.

SquareMetrePerSquareHertz
type: Class
subclass of: Restriction
  has value: 1.0
subclass of: Restriction
  has value: 0.0
comment: Square metres per square Hertz.
EMMO 1f1b164d ec6a 4faa 8d5e 88bda62316cc: http://qudt.org/vocab/unit/M2-PER-HZ2
EMMO 33ae2d07 5526 4555 a0b4 8f4c031b5652: m2.Hz-2
EMMO 7f1dec83 d85e 4e1b b7bd c9442d4f5a64: m²/Hz²
EMMO 967080e5 2f42 4eb2 a3a9 c58143e835f9: Square metres per square Hertz.

AreaSquareTimeUnit
type: Class
subclass of: Restriction
  has value: T+2 L+2 M0 I0 Θ0 N0 J0
comment: The class of units with dimensionality 'AreaSquareTime'.
EMMO 967080e5 2f42 4eb2 a3a9 c58143e835f9: The class of units with dimensionality 'AreaSquareTime'.

Bending
type: Class
comment: Forming of a solid body, whereby the plastic state is essentially brought about by a bending stress

FlexuralForming
type: Class
comment: Forming of a solid body, whereby the plastic state is essentially brought about by a bending stress.
alternative label: Biegeumformen

MetrologicalUncertainty
type: Class
comment: In general, for a given set of information, it is understood that the measurement uncertainty is associated with a stated quantity value. A modification of this value results in a modification of the associated uncertainty.
comment: Metrological uncertainty in EMMO is a slight generalisation of the VIM term 'measurement uncertainty', which is defined as "a non-negative parameter characterising the dispersion of the quantity being measured".
comment: Metrological uncertainty includes components arising from systematic effects, such as components associated with corrections and the assigned quantity values of measurement standards, as well as the definitional uncertainty. Sometimes estimated systematic effects are not corrected for but, instead, associated measurement uncertainty components are incorporated.
comment: The uncertainty of a quantity obtained through a well-defined procedure, characterising of the dispersion of the quantity.
alternative label: A metrological uncertainty can be assigned to any objective property via the 'hasMetrologicalUncertainty' relation.
example: - Standard deviation - Half-width of an interval with a stated coverage probability
EMMO 967080e5 2f42 4eb2 a3a9 c58143e835f9: The uncertainty of a quantity obtained through a well-defined procedure, characterising of the dispersion of the quantity.
EMMO c7b62dd7 063a 4c2a 8504 42f7264ba83f: Metrological uncertainty in EMMO is a slight generalisation of the VIM term 'measurement uncertainty', which is defined as "a non-negative parameter characterising the dispersion of the quantity being measured".

RadonSymbol
type: Class
subclass of: Restriction
  has value: Rn
comment: The symbol that stands for the radon atom.
EMMO 967080e5 2f42 4eb2 a3a9 c58143e835f9: The symbol that stands for the radon atom.

Wavelength
type: Class
comment: Length of the repetition interval of a wave.
EMMO 1f1b164d ec6a 4faa 8d5e 88bda62316cc: https://qudt.org/vocab/quantitykind/Wavelength
EMMO 26bf1bef d192 4da6 b0eb d2209698fb54: https://www.wikidata.org/wiki/Q41364
EMMO 50c298c2 55a2 4068 b3ac 4e948c33181f: https://www.electropedia.org/iev/iev.nsf/display
EMMO 6dd685dd 1895 46e4 b227 be9f7d643c25: https://dbpedia.org/page/Wavelength
EMMO 8de5d5bf db1c 40ac b698 095ba3b18578: 3-19
EMMO 967080e5 2f42 4eb2 a3a9 c58143e835f9: Length of the repetition interval of a wave.
EMMO c84c6752 6d64 48cc 9500 e54a3c34898d: https://en.wikipedia.org/wiki/Wavelength
EMMO fe015383 afb3 44a6 ae86 043628697aa2: https://doi.org/10.1351/goldbook.W06659

Length
type: Class
subclass of: Restriction
comment: Extend of a spatial dimension.
comment: Length is a non-negative additive quantity attributed to a one-dimensional object in space.
EMMO 1f1b164d ec6a 4faa 8d5e 88bda62316cc: http://qudt.org/vocab/quantitykind/Length
EMMO 8de5d5bf db1c 40ac b698 095ba3b18578: 3-1.1
EMMO 967080e5 2f42 4eb2 a3a9 c58143e835f9: Extend of a spatial dimension.
EMMO fe015383 afb3 44a6 ae86 043628697aa2: https://doi.org/10.1351/goldbook.L03498

FromWorkPIecetoWorkPiece
type: Class

HeliumAtom
type: Class
subclass of: Restriction
subclass of: Restriction
  has value: 4.002602
subclass of: Restriction
  has value: 2
comment: Atom subclass for helium.
EMMO 967080e5 2f42 4eb2 a3a9 c58143e835f9: Atom subclass for helium.

Volt
type: Class
subclass of: Restriction
  has value: V
comment: SI unit for electric potential difference.
comment: The volt is the unit of electric potential difference—electric potential difference is also known as voltage. The size of 1 volt is officially defined as the potential difference between two points of a wire carrying a current of 1 ampere when the power dissipated in the wire is 1 watt.
EMMO 0b1cbe60 d380 4787 b92e be26bdacf2c2: VLT
EMMO 1f1b164d ec6a 4faa 8d5e 88bda62316cc: http://qudt.org/vocab/unit/V
EMMO 33ae2d07 5526 4555 a0b4 8f4c031b5652: V
EMMO 6dd685dd 1895 46e4 b227 be9f7d643c25: http://dbpedia.org/resource/Volt
EMMO 967080e5 2f42 4eb2 a3a9 c58143e835f9: SI unit for electric potential difference.
EMMO c7b62dd7 063a 4c2a 8504 42f7264ba83f: The volt is the unit of electric potential difference—electric potential difference is also known as voltage. The size of 1 volt is officially defined as the potential difference between two points of a wire carrying a current of 1 ampere when the power dissipated in the wire is 1 watt.
EMMO c84c6752 6d64 48cc 9500 e54a3c34898d: http://en.wikipedia.org/wiki/Volt
EMMO fe015383 afb3 44a6 ae86 043628697aa2: https://doi.org/10.1351/goldbook.V06634

TeraWatt
type: Class
subclass of: Restriction
  some values from: Watt
subclass of: Restriction
  has value: 1000000000000.0
subclass of: Restriction
  has value: 0.0
comment: 1,000,000,000,000-fold of the SI derived unit watt -- QUDT
EMMO 1f1b164d ec6a 4faa 8d5e 88bda62316cc: http://qudt.org/vocab/unit/TeraW
EMMO 33ae2d07 5526 4555 a0b4 8f4c031b5652: TW
EMMO 7f1dec83 d85e 4e1b b7bd c9442d4f5a64: TW
EMMO 967080e5 2f42 4eb2 a3a9 c58143e835f9: 1,000,000,000,000-fold of the SI derived unit watt -- QUDT

PotassiumAtom
type: Class
subclass of: Restriction
subclass of: Restriction
  has value: 39.0983
subclass of: Restriction
  has value: 19
comment: Atom subclass for potassium.
EMMO 967080e5 2f42 4eb2 a3a9 c58143e835f9: Atom subclass for potassium.

PerThermalTransmittanceUnit
type: Class
subclass of: Restriction
  has value: T+3 L0 M-1 I0 Θ+1 N0 J0
comment: The class of units with dimensionality 'PerThermalTransmittance'.
EMMO 967080e5 2f42 4eb2 a3a9 c58143e835f9: The class of units with dimensionality 'PerThermalTransmittance'.

Watt
type: Class
subclass of: Restriction
  has value: W
comment: SI unit for power.
comment: The SI unit of power. Power is the rate at which work is done, or (equivalently) the rate at which energy is expended. One watt is equal to a power rate of one joule of work per second of time. This unit is used both in mechanics and in electricity, so it links the mechanical and electrical units to one another. In mechanical terms, one watt equals about 0.001 341 02 horsepower (hp) or 0.737 562 foot-pound per second (lbf/s). In electrical terms, one watt is the power produced by a current of one ampere flowing through an electric potential of one volt. The name of the unit honors James Watt (1736-1819), the British engineer whose improvements to the steam engine are often credited with igniting the Industrial Revolution. -- QUDT
EMMO 0b1cbe60 d380 4787 b92e be26bdacf2c2: WTT
EMMO 1f1b164d ec6a 4faa 8d5e 88bda62316cc: http://qudt.org/vocab/unit/W
EMMO 33ae2d07 5526 4555 a0b4 8f4c031b5652: W
EMMO 6dd685dd 1895 46e4 b227 be9f7d643c25: http://dbpedia.org/resource/Watt
EMMO 967080e5 2f42 4eb2 a3a9 c58143e835f9: SI unit for power.
EMMO c7b62dd7 063a 4c2a 8504 42f7264ba83f: The SI unit of power. Power is the rate at which work is done, or (equivalently) the rate at which energy is expended. One watt is equal to a power rate of one joule of work per second of time. This unit is used both in mechanics and in electricity, so it links the mechanical and electrical units to one another. In mechanical terms, one watt equals about 0.001 341 02 horsepower (hp) or 0.737 562 foot-pound per second (lbf/s). In electrical terms, one watt is the power produced by a current of one ampere flowing through an electric potential of one volt. The name of the unit honors James Watt (1736-1819), the British engineer whose improvements to the steam engine are often credited with igniting the Industrial Revolution. -- QUDT
EMMO c84c6752 6d64 48cc 9500 e54a3c34898d: http://en.wikipedia.org/wiki/Watt
EMMO fe015383 afb3 44a6 ae86 043628697aa2: https://doi.org/10.1351/goldbook.W06656

MilliMolePerSquareMetrePerSecond
type: Class
subclass of: Restriction
  has value: 0.001
subclass of: Restriction
  has value: 0.0
alternative label: Millimoles per square metre per second
EMMO 1f1b164d ec6a 4faa 8d5e 88bda62316cc: http://qudt.org/vocab/unit/MilliMOL-PER-M2-SEC
EMMO 33ae2d07 5526 4555 a0b4 8f4c031b5652: mmol.m-2.s-1
EMMO 33ae2d07 5526 4555 a0b4 8f4c031b5652: mmol/m2/s1
EMMO 7f1dec83 d85e 4e1b b7bd c9442d4f5a64: µg/(m²⋅s)

AmountPerAreaTimeUnit
type: Class
subclass of: Restriction
  has value: T-1 L-2 M0 I0 Θ0 N+1 J0
comment: The class of units with dimensionality 'AmountPerAreaTime'.
EMMO 967080e5 2f42 4eb2 a3a9 c58143e835f9: The class of units with dimensionality 'AmountPerAreaTime'.

MolePerCubicMetre
type: Class
subclass of: Restriction
  has value: 1.0
subclass of: Restriction
  has value: 0.0
comment: The SI derived unit for amount-of-substance concentration is the mole/cubic meter. -- QUDT
alternative label: Mole per Cubic Metre
EMMO 1f1b164d ec6a 4faa 8d5e 88bda62316cc: http://qudt.org/vocab/unit/MOL-PER-M3
EMMO 33ae2d07 5526 4555 a0b4 8f4c031b5652: mol.m-3
EMMO 33ae2d07 5526 4555 a0b4 8f4c031b5652: mol/m3
EMMO 7f1dec83 d85e 4e1b b7bd c9442d4f5a64: mol/m³
EMMO 967080e5 2f42 4eb2 a3a9 c58143e835f9: The SI derived unit for amount-of-substance concentration is the mole/cubic meter. -- QUDT

MegaCoulombPerSquareMetre
type: Class
subclass of: Restriction
  some values from: CoulombPerSquareMetre
subclass of: Restriction
  has value: 1000000.0
subclass of: Restriction
  has value: 0.0
comment: 1 000 000-fold of the SI derived unit coulomb divided by the power of the SI base unit metre with the exponent 2 -- QUDT
alternative label: Megacoulomb Per Square Metre
EMMO 1f1b164d ec6a 4faa 8d5e 88bda62316cc: http://qudt.org/vocab/unit/MegaC-PER-M2
EMMO 33ae2d07 5526 4555 a0b4 8f4c031b5652: MC.m-2
EMMO 7f1dec83 d85e 4e1b b7bd c9442d4f5a64: MC/m²
EMMO 967080e5 2f42 4eb2 a3a9 c58143e835f9: 1 000 000-fold of the SI derived unit coulomb divided by the power of the SI base unit metre with the exponent 2 -- QUDT

ElectricDisplacementFieldUnit
type: Class
subclass of: Restriction
  has value: T+1 L-2 M0 I+1 Θ0 N0 J0
comment: The class of units with dimensionality 'ElectricDisplacementField'.
EMMO 967080e5 2f42 4eb2 a3a9 c58143e835f9: The class of units with dimensionality 'ElectricDisplacementField'.

AreaPerQuarticTimeUnit
type: Class
subclass of: Restriction
  has value: T-4 L+2 M0 I0 Θ0 N0 J0
comment: The class of units with dimensionality 'AreaPerQuarticTime'.
EMMO 967080e5 2f42 4eb2 a3a9 c58143e835f9: The class of units with dimensionality 'AreaPerQuarticTime'.

SpecificHelmholtzEnergy
type: Class
comment: Helmholtz energy per unit mass.
EMMO 1f1b164d ec6a 4faa 8d5e 88bda62316cc: https://qudt.org/vocab/quantitykind/SpecificHelmholtzEnergy
EMMO 26bf1bef d192 4da6 b0eb d2209698fb54: https://www.wikidata.org/wiki/Q76359554
EMMO 8de5d5bf db1c 40ac b698 095ba3b18578: 5-21.4
EMMO 967080e5 2f42 4eb2 a3a9 c58143e835f9: Helmholtz energy per unit mass.

SpecificEnergy
type: Class
subclass of: Restriction
comment: Energy per unit mass
EMMO 1f1b164d ec6a 4faa 8d5e 88bda62316cc: https://qudt.org/vocab/quantitykind/SpecificEnergy
EMMO 26bf1bef d192 4da6 b0eb d2209698fb54: https://www.wikidata.org/wiki/Q3023293
EMMO 6dd685dd 1895 46e4 b227 be9f7d643c25: https://dbpedia.org/page/Specific_energy
EMMO 8de5d5bf db1c 40ac b698 095ba3b18578: 5-21.1
EMMO 967080e5 2f42 4eb2 a3a9 c58143e835f9: Energy per unit mass
EMMO c84c6752 6d64 48cc 9500 e54a3c34898d: https://en.wikipedia.org/wiki/Specific_energy

3DPrinting
type: Class
comment: Fabrication of objects through the deposition of a material using a print head, nozzle or another printer technology.
comment: This term is often used in a non-technical context synonymously with additive manufacturing and, in these cases, typically associated with machines used for non-industrial purposes including personal use.
comment: fabrication of objects through the deposition of a material using a print head, nozzle or another printer technology Note 1 to entry: This term is often used in a non-technical context synonymously with additive manufacturing (3.1.2) and, in these cases, typically associated with machines used for non-industrial purposes including personal use.
EMMO 967080e5 2f42 4eb2 a3a9 c58143e835f9: Fabrication of objects through the deposition of a material using a print head, nozzle or another printer technology.
EMMO c7b62dd7 063a 4c2a 8504 42f7264ba83f: This term is often used in a non-technical context synonymously with additive manufacturing and, in these cases, typically associated with machines used for non-industrial purposes including personal use.

CentiMolePerKilogram
type: Class
subclass of: Restriction
  has value: 0.01
subclass of: Restriction
  has value: 0.0
comment: 1/100 of SI unit of amount of substance per kilogram -- QUDT
alternative label: Centimole per kilogram
EMMO 1f1b164d ec6a 4faa 8d5e 88bda62316cc: http://qudt.org/vocab/unit/CentiMOL-PER-KiloGM
EMMO 33ae2d07 5526 4555 a0b4 8f4c031b5652: cmol.kg-1
EMMO 33ae2d07 5526 4555 a0b4 8f4c031b5652: cmol/kg
EMMO 7f1dec83 d85e 4e1b b7bd c9442d4f5a64: cmol/kg
EMMO 967080e5 2f42 4eb2 a3a9 c58143e835f9: 1/100 of SI unit of amount of substance per kilogram -- QUDT

MeanFreePath
type: Class
comment: The mean free path may thus be specified either for all interactions, i.e. total mean free path, or for particular types of interaction such as scattering, capture, or ionization.
comment: in a given medium, average distance that particles of a specified type travel between successive interactions of a specified type.
EMMO 1f1b164d ec6a 4faa 8d5e 88bda62316cc: https://qudt.org/vocab/quantitykind/MeanFreePath
EMMO 26bf1bef d192 4da6 b0eb d2209698fb54: https://www.wikidata.org/wiki/Q756307
EMMO 50c298c2 55a2 4068 b3ac 4e948c33181f: https://www.electropedia.org/iev/iev.nsf/display
EMMO 8de5d5bf db1c 40ac b698 095ba3b18578: 9-38
EMMO 967080e5 2f42 4eb2 a3a9 c58143e835f9: in a given medium, average distance that particles of a specified type travel between successive interactions of a specified type.
EMMO fe015383 afb3 44a6 ae86 043628697aa2: https://doi.org/10.1351/goldbook.M03778

PathLength
type: Class
comment: Length of a rectifiable curve between two of its points.
alternative label: ArcLength
EMMO 26bf1bef d192 4da6 b0eb d2209698fb54: https://www.wikidata.org/wiki/Q7144654
EMMO 6dd685dd 1895 46e4 b227 be9f7d643c25: https://dbpedia.org/page/Arc_length
EMMO 8de5d5bf db1c 40ac b698 095ba3b18578: 3-1.7
EMMO 967080e5 2f42 4eb2 a3a9 c58143e835f9: Length of a rectifiable curve between two of its points.
EMMO c84c6752 6d64 48cc 9500 e54a3c34898d: https://en.wikipedia.org/wiki/Arc_length

Moulding
type: Class
comment: Free forming is pressure forming with tools that do not or only partially contain the shape of the workpiece and move against each other (from: DIN 8583 Part 3/05.70).
alternative label: Gesenkformen

CompressiveForming
type: Class
comment: Forming of a solid body, whereby the plastic state is essentially brought about by uniaxial or multiaxial compressive stress.
comment: lasciano tensioni residue di compressione
alternative label: Druckumformen

FromNotProperShapeToWorkPiece
type: Class
comment: From Powder, from liquid, from gas
comment: da una forma non propria ad una forma propria
EMMO c7b62dd7 063a 4c2a 8504 42f7264ba83f: From Powder, from liquid, from gas
EMMO c7b62dd7 063a 4c2a 8504 42f7264ba83f: Powder: particles that are usually less than 1 mm in size

AdditiveManufacturing
type: Class
comment: process of joining materials to make parts from 3D model data, usually layer upon layer, as opposed to subtractive manufacturing (3.1.29) and formative manufacturing methodologies,
alternative label: GenerativeManufacturing
EMMO c7b62dd7 063a 4c2a 8504 42f7264ba83f: process of joining materials to make parts from 3D model data, usually layer upon layer, as opposed to subtractive manufacturing (3.1.29) and formative manufacturing methodologies,

KiloPascalPerKelvin
type: Class
subclass of: Restriction
  some values from: PascalPerKelvin
subclass of: Restriction
  has value: 1000.0
subclass of: Restriction
  has value: 0.0
comment: 1 000-fold of the SI derived unit pascal divided by the SI base unit kelvin -- QUDT
alternative label: Kilopascal Per Kelvin
EMMO 1f1b164d ec6a 4faa 8d5e 88bda62316cc: http://qudt.org/vocab/unit/KiloPA-PER-K
EMMO 33ae2d07 5526 4555 a0b4 8f4c031b5652: kPa.K-1
EMMO 7f1dec83 d85e 4e1b b7bd c9442d4f5a64: kPa/K
EMMO 967080e5 2f42 4eb2 a3a9 c58143e835f9: 1 000-fold of the SI derived unit pascal divided by the SI base unit kelvin -- QUDT

GigaCoulomb
type: Class
subclass of: Restriction
  some values from: Coulomb
subclass of: Restriction
  has value: 1000000000.0
subclass of: Restriction
  has value: 0.0
EMMO 1f1b164d ec6a 4faa 8d5e 88bda62316cc: http://qudt.org/vocab/unit/GigaC
EMMO 33ae2d07 5526 4555 a0b4 8f4c031b5652: GC
EMMO 7f1dec83 d85e 4e1b b7bd c9442d4f5a64: GC

GigaPrefixedUnit
type: Class
subclass of: Restriction
subclass of: Restriction
  has value: 1000000000.0
comment: Superclass for all units prefixed with "giga" (1e9).
EMMO 967080e5 2f42 4eb2 a3a9 c58143e835f9: Superclass for all units prefixed with "giga" (1e9).

MilliBecquerelPerKilogram
type: Class
subclass of: Restriction
  some values from: BecquerelPerKilogram
subclass of: Restriction
  has value: 0.001
subclass of: Restriction
  has value: 0.0
comment: One radioactive disintegration per thousand seconds from an SI standard unit of mass of sample. -- QUDT
alternative label: Millibecquerels per kilogram
EMMO 1f1b164d ec6a 4faa 8d5e 88bda62316cc: http://qudt.org/vocab/unit/MilliBQ-PER-KiloGM
EMMO 33ae2d07 5526 4555 a0b4 8f4c031b5652: mBq.kg-1
EMMO 7f1dec83 d85e 4e1b b7bd c9442d4f5a64: mBq/kg
EMMO 967080e5 2f42 4eb2 a3a9 c58143e835f9: One radioactive disintegration per thousand seconds from an SI standard unit of mass of sample. -- QUDT

PerTimeMassUnit
type: Class
subclass of: Restriction
  has value: T-1 L0 M-1 I0 Θ0 N0 J0
comment: The class of units with dimensionality 'PerTimeMass'.
EMMO 967080e5 2f42 4eb2 a3a9 c58143e835f9: The class of units with dimensionality 'PerTimeMass'.

AcceptorDensity
type: Class
subclass of: Restriction
comment: quotient of number of acceptor levels and volume.
EMMO 1f1b164d ec6a 4faa 8d5e 88bda62316cc: https://qudt.org/vocab/quantitykind/AcceptorDensity
EMMO 26bf1bef d192 4da6 b0eb d2209698fb54: https://www.wikidata.org/wiki/Q105979968
EMMO 8de5d5bf db1c 40ac b698 095ba3b18578: 12-29.5
EMMO 967080e5 2f42 4eb2 a3a9 c58143e835f9: quotient of number of acceptor levels and volume.

MachineCell
type: Class
comment: A group of machineries used to process a group of similar parts.
comment: Is not simply a collection of machineries, since the connection between them is due to the parallel flow of processed parts that comes from a unique source and ends into a common repository.
EMMO 967080e5 2f42 4eb2 a3a9 c58143e835f9: A group of machineries used to process a group of similar parts.

ManufacturingSystem
type: Class
comment: A system arranged to setup a specific manufacturing process.
EMMO 967080e5 2f42 4eb2 a3a9 c58143e835f9: A system arranged to setup a specific manufacturing process.

Simulation
type: Class
comment: A estimation of a property using a functional icon.
alternative label: Modelling
example: I calculate the electrical conductivity of an Ar-He plasma with the Chapman-Enskog method and use the value as property for it.
EMMO 967080e5 2f42 4eb2 a3a9 c58143e835f9: A estimation of a property using a functional icon.

SquareMetreKelvin
type: Class
subclass of: Restriction
  has value: 1.0
subclass of: Restriction
  has value: 0.0
comment: `Square Meter Kelvin` is a unit for 'Area Temperature' expressed as m²-K. -- QUDT
alternative label: Square Metre Kelvin
EMMO 1f1b164d ec6a 4faa 8d5e 88bda62316cc: http://qudt.org/vocab/unit/M2-K
EMMO 33ae2d07 5526 4555 a0b4 8f4c031b5652: m2.K
EMMO 7f1dec83 d85e 4e1b b7bd c9442d4f5a64: m²⋅K
EMMO 967080e5 2f42 4eb2 a3a9 c58143e835f9: `Square Meter Kelvin` is a unit for 'Area Temperature' expressed as m²-K. -- QUDT

AreaTemperatureUnit
type: Class
subclass of: Restriction
  has value: T0 L+2 M0 I0 Θ+1 N0 J0
comment: The class of units with dimensionality 'AreaTemperature'.
EMMO 967080e5 2f42 4eb2 a3a9 c58143e835f9: The class of units with dimensionality 'AreaTemperature'.

DeciSiemens
type: Class
subclass of: Restriction
  some values from: Siemens
subclass of: Restriction
  has value: 0.1
subclass of: Restriction
  has value: 0.0
comment: A decisiemens is 0.1 S.
alternative label: decisiemens
EMMO 1f1b164d ec6a 4faa 8d5e 88bda62316cc: http://qudt.org/vocab/unit/DeciS
EMMO 7f1dec83 d85e 4e1b b7bd c9442d4f5a64: dS
EMMO 967080e5 2f42 4eb2 a3a9 c58143e835f9: A decisiemens is 0.1 S.

DeciPrefixedUnit
type: Class
subclass of: Restriction
subclass of: Restriction
  has value: 0.1
comment: Superclass for all units prefixed with "deci" (0.1).
EMMO 967080e5 2f42 4eb2 a3a9 c58143e835f9: Superclass for all units prefixed with "deci" (0.1).

SulfurSymbol
type: Class
subclass of: Restriction
  has value: S
comment: The symbol that stands for the sulfur atom.
EMMO 967080e5 2f42 4eb2 a3a9 c58143e835f9: The symbol that stands for the sulfur atom.

StaticFrictionForce
type: Class
comment: Fhe force of friction on an object that is not moving.
alternative label: StaticFriction
EMMO 1f1b164d ec6a 4faa 8d5e 88bda62316cc: https://qudt.org/vocab/quantitykind/StaticFriction
EMMO 26bf1bef d192 4da6 b0eb d2209698fb54: https://www.wikidata.org/wiki/Q90862568
EMMO 8de5d5bf db1c 40ac b698 095ba3b18578: 4-9.3
EMMO 967080e5 2f42 4eb2 a3a9 c58143e835f9: Fhe force of friction on an object that is not moving.

Force
type: Class
subclass of: Restriction
comment: Any interaction that, when unopposed, will change the motion of an object
EMMO 1f1b164d ec6a 4faa 8d5e 88bda62316cc: http://qudt.org/vocab/quantitykind/Force
EMMO 8de5d5bf db1c 40ac b698 095ba3b18578: 4-9.1
EMMO 967080e5 2f42 4eb2 a3a9 c58143e835f9: Any interaction that, when unopposed, will change the motion of an object
EMMO fe015383 afb3 44a6 ae86 043628697aa2: https://doi.org/10.1351/goldbook.F02480

ArrayData
type: Class
comment: An array is a datatype representing an ordered collection of elements (or values) that can be accessed by indexes. Arrays have an analog mathematical counterpart in vectors and matrixes, but are separate concepts. Arrays may be multidimensional.
comment: In the EMMO we use the following JSON based syntax to represent arrays: - mono-dimensional array [v1,v2,...,vn] (vector) - bi-dimensional array [[v1,v2,...,vn],[w1,w2,...,2n]] (matrix) This notation can be extended to multidimensional arrays.
EMMO 31252f35 c767 4b97 a877 1235076c3e13: An array is a datatype representing an ordered collection of elements (or values) that can be accessed by indexes. Arrays have an analog mathematical counterpart in vectors and matrixes, but are separate concepts. Arrays may be multidimensional.
EMMO 8a137e9f 579c 4e28 baca e8980eb0c3db: SubClassOf: hasScalarData some ScalarData
EMMO 8a137e9f 579c 4e28 baca e8980eb0c3db: SubClassOf: hasSpatialTile some SymbolicData
EMMO c7b62dd7 063a 4c2a 8504 42f7264ba83f: In the EMMO we use the following JSON based syntax to represent arrays: - mono-dimensional array [v1,v2,...,vn] (vector) - bi-dimensional array [[v1,v2,...,vn],[w1,w2,...,2n]] (matrix) This notation can be extended to multidimensional arrays.
EMMO c7b62dd7 063a 4c2a 8504 42f7264ba83f: The structure of an array is expressed mereologically. It consists of a set of equally sized tiles. The tiles of an n-dimensional array are (n-1) dimensional arrays. The tiles of an (n-1)-dimensional array are (n-2) dimensional arrays, and so forth down to 1-dimensional arrays (vectors), whos tiles are scalar data.

AbsoluteActivity
type: Class
comment: The exponential of the ratio of the chemical potential to R*T where R is the gas constant and T the thermodynamic temperature.
EMMO 1f1b164d ec6a 4faa 8d5e 88bda62316cc: https://qudt.org/vocab/quantitykind/AbsoluteActivity
EMMO 26bf1bef d192 4da6 b0eb d2209698fb54: https://www.wikidata.org/wiki/Q56638155
EMMO 8de5d5bf db1c 40ac b698 095ba3b18578: 9-18
EMMO 967080e5 2f42 4eb2 a3a9 c58143e835f9: The exponential of the ratio of the chemical potential to R*T where R is the gas constant and T the thermodynamic temperature.
EMMO fe015383 afb3 44a6 ae86 043628697aa2: https://goldbook.iupac.org/terms/view/A00019

MegaHertzPerKelvin
type: Class
subclass of: Restriction
  some values from: HertzPerKelvin
subclass of: Restriction
  has value: 1000000.0
subclass of: Restriction
  has value: 0.0
comment: `Mega Hertz per Kelvin` is a unit for 'Inverse Time Temperature' expressed as MHz K⁻¹. -- QUDT
alternative label: Mega Hertz per Kelvin
EMMO 1f1b164d ec6a 4faa 8d5e 88bda62316cc: http://qudt.org/vocab/unit/MegaHZ-PER-K
EMMO 33ae2d07 5526 4555 a0b4 8f4c031b5652: MHz.K-1
EMMO 7f1dec83 d85e 4e1b b7bd c9442d4f5a64: MHz/K
EMMO 967080e5 2f42 4eb2 a3a9 c58143e835f9: `Mega Hertz per Kelvin` is a unit for 'Inverse Time Temperature' expressed as MHz K⁻¹. -- QUDT

PerTemperatureTimeUnit
type: Class
subclass of: Restriction
  has value: T-1 L0 M0 I0 Θ-1 N0 J0
comment: The class of units with dimensionality 'PerTemperatureTime'.
EMMO 967080e5 2f42 4eb2 a3a9 c58143e835f9: The class of units with dimensionality 'PerTemperatureTime'.

AmperePerSquareCentiMetre
type: Class
subclass of: Restriction
  has value: 10000.0
subclass of: Restriction
  has value: 0.0
comment: SI base unit ampere divided by the 0.0001-fold of the power of the SI base unit metre by exponent 2 -- QUDT
alternative label: Ampere Per Square Centimetre
EMMO 1f1b164d ec6a 4faa 8d5e 88bda62316cc: http://qudt.org/vocab/unit/A-PER-CentiM2
EMMO 33ae2d07 5526 4555 a0b4 8f4c031b5652: A.cm-2
EMMO 33ae2d07 5526 4555 a0b4 8f4c031b5652: A/cm2
EMMO 7f1dec83 d85e 4e1b b7bd c9442d4f5a64: A/cm²
EMMO 967080e5 2f42 4eb2 a3a9 c58143e835f9: SI base unit ampere divided by the 0.0001-fold of the power of the SI base unit metre by exponent 2 -- QUDT

ElectricCurrentDensityUnit
type: Class
subclass of: Restriction
  has value: T0 L-2 M0 I+1 Θ0 N0 J0
comment: The class of units with dimensionality 'ElectricCurrentDensity'.
EMMO 967080e5 2f42 4eb2 a3a9 c58143e835f9: The class of units with dimensionality 'ElectricCurrentDensity'.

TokenData
type: Class

SpecificEnergyImparted
type: Class
comment: In nuclear physics, energy imparted per mass.
EMMO 1f1b164d ec6a 4faa 8d5e 88bda62316cc: https://qudt.org/vocab/quantitykind/SpecificEnergyImparted
EMMO 26bf1bef d192 4da6 b0eb d2209698fb54: https://www.wikidata.org/wiki/Q99566195
EMMO 8de5d5bf db1c 40ac b698 095ba3b18578: 10-81.2
EMMO 967080e5 2f42 4eb2 a3a9 c58143e835f9: In nuclear physics, energy imparted per mass.

Agency
type: Class
subclass of: Restriction
comment: A process that occurs because of the exercise of the capacity to act of an agent.
alternative label: AgentDrivenProcess
EMMO 967080e5 2f42 4eb2 a3a9 c58143e835f9: A process that occurs because of the exercise of the capacity to act of an agent.

ProcessByAgency
type: Class

SpatialSequence
type: Class
comment: A monodimensional arrangement of tiles.
alternative label: Sequence
EMMO 967080e5 2f42 4eb2 a3a9 c58143e835f9: A monodimensional arrangement of tiles.

Arrangement
type: Class
comment: A causal object which is tessellated with only spatial direct parts.
comment: The definition of an arrangement implies that its spatial direct parts are not gained or lost during its temporal extension (they exist from the left to the right side of the time interval), so that the cardinality of spatial direct parts in an arrangement is constant. This does not mean that there cannot be a change in the internal structure of the arrangement direct parts. It means only that this change must not affect the existence of the direct part itself.
alternative label: MereologicalState
example: e.g. the existent in my glass is declared at t = t_start as made of two direct parts: the ice and the water. It will continue to exists as state as long as the ice is completely melt at t = t_end. The new state will be completely made of water. Between t_start and t_end there is an exchange of molecules between the ice and the water, but this does not affect the existence of the two states. If we partition the existent in my glass as ice surrounded by several molecules (we do not use the object water as direct part) then the appearance of a molecule coming from the ice will cause a state to end and another state to begin.
EMMO 967080e5 2f42 4eb2 a3a9 c58143e835f9: A causal object which is tessellated with only spatial direct parts.
EMMO c7b62dd7 063a 4c2a 8504 42f7264ba83f: The definition of an arrangement implies that its spatial direct parts are not gained or lost during its temporal extension (they exist from the left to the right side of the time interval), so that the cardinality of spatial direct parts in an arrangement is constant. This does not mean that there cannot be a change in the internal structure of the arrangement direct parts. It means only that this change must not affect the existence of the direct part itself.
EMMO c7b62dd7 063a 4c2a 8504 42f7264ba83f: The use of spatial direct parthood in state definition means that an arrangement cannot overlap in space another arrangement that is direct part of the same whole.

Pico
type: Class
subclass of: Restriction
  has value: p
subclass of: Restriction
  has value: 1e-12
comment: SI prefix who's value is 1e-12.
EMMO 967080e5 2f42 4eb2 a3a9 c58143e835f9: SI prefix who's value is 1e-12.

PhaseAngle
type: Class
comment: Angular measure between the positive real axis and the radius of the polar representation of the complex number in the complex plane.
EMMO 26bf1bef d192 4da6 b0eb d2209698fb54: https://www.wikidata.org/wiki/Q415829
EMMO 50c298c2 55a2 4068 b3ac 4e948c33181f: https://www.electropedia.org/iev/iev.nsf/display
EMMO 8de5d5bf db1c 40ac b698 095ba3b18578: 3-7
EMMO 967080e5 2f42 4eb2 a3a9 c58143e835f9: Angular measure between the positive real axis and the radius of the polar representation of the complex number in the complex plane.

PerKelvin
type: Class
subclass of: Restriction
  has value: 1.0
subclass of: Restriction
  has value: 0.0
comment: Per Kelvin Unit is a denominator unit with dimensions /K. -- QUDT
alternative label: Reciprocal Kelvin
EMMO 1f1b164d ec6a 4faa 8d5e 88bda62316cc: http://qudt.org/vocab/unit/PER-K
EMMO 33ae2d07 5526 4555 a0b4 8f4c031b5652: K-1
EMMO 7f1dec83 d85e 4e1b b7bd c9442d4f5a64: /K
EMMO 967080e5 2f42 4eb2 a3a9 c58143e835f9: Per Kelvin Unit is a denominator unit with dimensions /K. -- QUDT

PerTemperatureUnit
type: Class
subclass of: Restriction
  has value: T0 L0 M0 I0 Θ-1 N0 J0
comment: The class of units with dimensionality 'PerTemperature'.
EMMO 967080e5 2f42 4eb2 a3a9 c58143e835f9: The class of units with dimensionality 'PerTemperature'.

Fugacity
type: Class
subclass of: Restriction
comment: Measure of the tendency of a substance to leave a phase.
EMMO 1f1b164d ec6a 4faa 8d5e 88bda62316cc: https://qudt.org/vocab/quantitykind/Fugacity
EMMO 26bf1bef d192 4da6 b0eb d2209698fb54: https://www.wikidata.org/wiki/Q898412
EMMO 8de5d5bf db1c 40ac b698 095ba3b18578: 9-20
EMMO 967080e5 2f42 4eb2 a3a9 c58143e835f9: Measure of the tendency of a substance to leave a phase.
EMMO fe015383 afb3 44a6 ae86 043628697aa2: https://doi.org/10.1351/goldbook.F02543

SquareSecond
type: Class
subclass of: Restriction
  has value: 1.0
subclass of: Restriction
  has value: 0.0
comment: "Square Second" is a unit for 'Square Time' expressed as s². -- QUDT
alternative label: Square Second
EMMO 1f1b164d ec6a 4faa 8d5e 88bda62316cc: http://qudt.org/vocab/unit/SEC2
EMMO 33ae2d07 5526 4555 a0b4 8f4c031b5652: s2
EMMO 7f1dec83 d85e 4e1b b7bd c9442d4f5a64: s²
EMMO 967080e5 2f42 4eb2 a3a9 c58143e835f9: "Square Second" is a unit for 'Square Time' expressed as s². -- QUDT

SquareTimeUnit
type: Class
subclass of: Restriction
  has value: T+2 L0 M0 I0 Θ0 N0 J0
comment: The class of units with dimensionality 'SquareTime'.
EMMO 967080e5 2f42 4eb2 a3a9 c58143e835f9: The class of units with dimensionality 'SquareTime'.

VanadiumSymbol
type: Class
subclass of: Restriction
  has value: V
comment: The symbol that stands for the vanadium atom.
EMMO 967080e5 2f42 4eb2 a3a9 c58143e835f9: The symbol that stands for the vanadium atom.

DecaPascal
type: Class
subclass of: Restriction
  some values from: Pascal
subclass of: Restriction
  has value: 10.0
subclass of: Restriction
  has value: 0.0
comment: 10-fold of the derived SI unit pascal -- QUDT
EMMO 1f1b164d ec6a 4faa 8d5e 88bda62316cc: http://qudt.org/vocab/unit/DecaPA
EMMO 33ae2d07 5526 4555 a0b4 8f4c031b5652: daPa
EMMO 7f1dec83 d85e 4e1b b7bd c9442d4f5a64: daPa
EMMO 967080e5 2f42 4eb2 a3a9 c58143e835f9: 10-fold of the derived SI unit pascal -- QUDT

DecaPrefixedUnit
type: Class
subclass of: Restriction
subclass of: Restriction
  has value: 10.0
comment: Superclass for all units prefixed with "deca" (10).
alternative label: DekaPrefixedUnit
EMMO 967080e5 2f42 4eb2 a3a9 c58143e835f9: Superclass for all units prefixed with "deca" (10).

Cogniser
type: Class
subclass of: Restriction
comment: An interpreter who establish the connection between an icon an an object recognizing their resemblance (e.g. logical, pictorial)
example: The scientist that connects an equation to a physical phenomenon.
EMMO 967080e5 2f42 4eb2 a3a9 c58143e835f9: An interpreter who establish the connection between an icon an an object recognizing their resemblance (e.g. logical, pictorial)

MeitneriumAtom
type: Class
subclass of: Restriction
subclass of: Restriction
  has value: 278.156
subclass of: Restriction
  has value: 109
comment: Atom subclass for meitnerium.
EMMO 967080e5 2f42 4eb2 a3a9 c58143e835f9: Atom subclass for meitnerium.

SquareMetrePerNewton
type: Class
subclass of: Restriction
  has value: 1.0
subclass of: Restriction
  has value: 0.0
comment: power of the SI base unit metre with the exponent 2 divided by the derived SI unit newton -- QUDT
alternative label: Square Metre Per Newton
EMMO 1f1b164d ec6a 4faa 8d5e 88bda62316cc: http://qudt.org/vocab/unit/M2-PER-N
EMMO 33ae2d07 5526 4555 a0b4 8f4c031b5652: m2.N-1
EMMO 7f1dec83 d85e 4e1b b7bd c9442d4f5a64: m²/N
EMMO 967080e5 2f42 4eb2 a3a9 c58143e835f9: power of the SI base unit metre with the exponent 2 divided by the derived SI unit newton -- QUDT

PerPressureUnit
type: Class
subclass of: Restriction
  has value: T+2 L+1 M-1 I0 Θ0 N0 J0
comment: The class of units with dimensionality 'PerPressure'.
EMMO 967080e5 2f42 4eb2 a3a9 c58143e835f9: The class of units with dimensionality 'PerPressure'.

FemtoGram
type: Class
subclass of: Restriction
  some values from: Gram
subclass of: Restriction
  has value: 1e-18
subclass of: Restriction
  has value: 0.0
EMMO 1f1b164d ec6a 4faa 8d5e 88bda62316cc: http://qudt.org/vocab/unit/FemtoGM
EMMO 7f1dec83 d85e 4e1b b7bd c9442d4f5a64: fg

FemtoPrefixedUnit
type: Class
subclass of: Restriction
subclass of: Restriction
  has value: 1e-15
comment: Superclass for all units prefixed with "femto" (1e-15).
EMMO 967080e5 2f42 4eb2 a3a9 c58143e835f9: Superclass for all units prefixed with "femto" (1e-15).

IsochoricHeatCapacity
type: Class
comment: Heat capacity at constant volume.
alternative label: HeatCapacityAtConstantVolume
EMMO 26bf1bef d192 4da6 b0eb d2209698fb54: https://www.wikidata.org/wiki/Q112187521
EMMO 50c298c2 55a2 4068 b3ac 4e948c33181f: https://www.electropedia.org/iev/iev.nsf/display
EMMO 8de5d5bf db1c 40ac b698 095ba3b18578: 5-16.3
EMMO 967080e5 2f42 4eb2 a3a9 c58143e835f9: Heat capacity at constant volume.

SquarePascalPerSquareSecond
type: Class
subclass of: Restriction
  has value: 1.0
subclass of: Restriction
  has value: 0.0
comment: Square Pascal per square second.
EMMO 1f1b164d ec6a 4faa 8d5e 88bda62316cc: http://qudt.org/vocab/unit/PA2-PER-SEC2
EMMO 33ae2d07 5526 4555 a0b4 8f4c031b5652: Pa2.s-2
EMMO 7f1dec83 d85e 4e1b b7bd c9442d4f5a64: Pa²/s²
EMMO 967080e5 2f42 4eb2 a3a9 c58143e835f9: Square Pascal per square second.

SquarePressurePerSquareTimeUnit
type: Class
subclass of: Restriction
  has value: T-6 L-2 M+2 I0 Θ0 N0 J0
comment: The class of units with dimensionality 'SquarePressurePerSquareTime'.
EMMO 967080e5 2f42 4eb2 a3a9 c58143e835f9: The class of units with dimensionality 'SquarePressurePerSquareTime'.

Yocto
type: Class
subclass of: Restriction
  has value: y
subclass of: Restriction
  has value: 1e-24
comment: SI prefix who's value is 1e-24.
EMMO 967080e5 2f42 4eb2 a3a9 c58143e835f9: SI prefix who's value is 1e-24.

ManufacturedProduct
type: Class
comment: An object that has been designed and manufactured for a particular purpose.
alternative label: Artifact
alternative label: Engineered
alternative label: TangibleProduct
example: Car, tire, composite material.
EMMO 967080e5 2f42 4eb2 a3a9 c58143e835f9: An object that has been designed and manufactured for a particular purpose.

Product
type: Class
equivalent class: Class
subclass of: Restriction
comment: The overall lifetime of an holistic that has been the output of an intentional process.
comment: This concepts encompass the overall lifetime of a product. Is temporaly fundamental, meaning that it can have other products as holistic spatial parts, but its holistic temporal parts are not products. In other words, the individual must encompass the whole lifetime from creation to disposal. A product can be a tangible object (e.g. a manufactured object), a process (e.g. service). It can be the outcome of a natural or an artificially driven process. It must have and initial stage of its life that is also an outcome of a intentional process.
alternative label: Output
EMMO 3aa37f92 8dc5 4ee4 8438 e41e6ae20c62: https://www.iso.org/obp/ui/#iso:std:iso:9000:ed-3:v1:en:term:3.4.2
EMMO 964568dd 64d2 454b a12f ac389f1c5e7f: https://www.iso.org/obp/ui/#iso:std:iso:14040:ed-2:v1:en:term:3.9
EMMO 967080e5 2f42 4eb2 a3a9 c58143e835f9: The overall lifetime of an holistic that has been the output of an intentional process.
EMMO c7b62dd7 063a 4c2a 8504 42f7264ba83f: This concepts encompass the overall lifetime of a product. Is temporaly fundamental, meaning that it can have other products as holistic spatial parts, but its holistic temporal parts are not products. In other words, the individual must encompass the whole lifetime from creation to disposal. A product can be a tangible object (e.g. a manufactured object), a process (e.g. service). It can be the outcome of a natural or an artificially driven process. It must have and initial stage of its life that is also an outcome of a intentional process.

Learning
type: Class
comment: A semiosis where the interpreter perceives a referent, that generates the interpretant as interpreter's internal representation.The interpretant is not commmunicated to the external world, but kept in the internal representational space of the interpreter.
EMMO 967080e5 2f42 4eb2 a3a9 c58143e835f9: A semiosis where the interpreter perceives a referent, that generates the interpretant as interpreter's internal representation.The interpretant is not commmunicated to the external world, but kept in the internal representational space of the interpreter.

UraniumAtom
type: Class
subclass of: Restriction
subclass of: Restriction
  has value: 238.02891
subclass of: Restriction
  has value: 92
comment: Atom subclass for uranium.
EMMO 967080e5 2f42 4eb2 a3a9 c58143e835f9: Atom subclass for uranium.

MegaGram
type: Class
subclass of: Restriction
  some values from: Gram
subclass of: Restriction
  has value: 1000.0
subclass of: Restriction
  has value: 0.0
comment: 1 000-fold of the SI base unit kilogram -- QUDT
EMMO 1f1b164d ec6a 4faa 8d5e 88bda62316cc: http://qudt.org/vocab/unit/MegaGM
EMMO 33ae2d07 5526 4555 a0b4 8f4c031b5652: Mg
EMMO 7f1dec83 d85e 4e1b b7bd c9442d4f5a64: Mg
EMMO 967080e5 2f42 4eb2 a3a9 c58143e835f9: 1 000-fold of the SI base unit kilogram -- QUDT

WattPerMetre
type: Class
subclass of: Restriction
  has value: 1.0
subclass of: Restriction
  has value: 0.0
comment: Watts per metre.
EMMO 1f1b164d ec6a 4faa 8d5e 88bda62316cc: http://qudt.org/vocab/unit/W-PER-M
EMMO 33ae2d07 5526 4555 a0b4 8f4c031b5652: W.m-1
EMMO 7f1dec83 d85e 4e1b b7bd c9442d4f5a64: W/m
EMMO 967080e5 2f42 4eb2 a3a9 c58143e835f9: Watts per metre.

MassLengthPerCubicTimeUnit
type: Class
subclass of: Restriction
  has value: T-3 L+1 M+1 I0 Θ0 N0 J0
comment: The class of units with dimensionality 'MassLengthPerCubicTime'.
EMMO 967080e5 2f42 4eb2 a3a9 c58143e835f9: The class of units with dimensionality 'MassLengthPerCubicTime'.

MolarInternalEnergy
type: Class
comment: Internal energy per amount of substance.
EMMO 26bf1bef d192 4da6 b0eb d2209698fb54: https://www.wikidata.org/wiki/Q88523106
EMMO 8de5d5bf db1c 40ac b698 095ba3b18578: 9-6.1
EMMO 967080e5 2f42 4eb2 a3a9 c58143e835f9: Internal energy per amount of substance.

ElectroSinterForging
type: Class

Sintering
type: Class
comment: Sintering is the process of forming a solid mass of material through heat and pressure without melting to the point of liquefaction. This process involves the atoms in materials diffusing across the particle boundaries and fusing together into one piece.
comment: Sintering occurs naturally in mineral deposits, and is used as a manufacturing process for materials including ceramics, metals and plastics. Because the sintering temperature doesn’t reach the materials’ melting point, it is often used for materials with high melting points, such as molybdenum and tungsten.
see also: ISO 3252:2019 Powder metallurgy sintering: thermal treatment of a powder or compact, at a temperature below the melting point of the main constituent, for the purpose of increasing its strength by the metallurgical bonding of its particles
see also: ISO/ASTM TR 52906:2022 Additive manufacturing sintering: process of heating a powder metal compact to increase density and/or improve mechanical properties via solid state diffusion
alternative label: Sintern
EMMO 967080e5 2f42 4eb2 a3a9 c58143e835f9: Sintering is the process of forming a solid mass of material through heat and pressure without melting to the point of liquefaction. This process involves the atoms in materials diffusing across the particle boundaries and fusing together into one piece.
EMMO c7b62dd7 063a 4c2a 8504 42f7264ba83f: Sintering occurs naturally in mineral deposits, and is used as a manufacturing process for materials including ceramics, metals and plastics. Because the sintering temperature doesn’t reach the materials’ melting point, it is often used for materials with high melting points, such as molybdenum and tungsten.

JouleMetrePerMole
type: Class
subclass of: Restriction
  has value: 1.0
subclass of: Restriction
  has value: 0.0
comment: `Joule Meter per Mole` is a unit for 'Length Molar Energy' expressed as J · m · mol⁻¹. -- QUDT
alternative label: Joule Metre per Mole
EMMO 1f1b164d ec6a 4faa 8d5e 88bda62316cc: http://qudt.org/vocab/unit/J-M-PER-MOL
EMMO 33ae2d07 5526 4555 a0b4 8f4c031b5652: J.m.mol-1
EMMO 7f1dec83 d85e 4e1b b7bd c9442d4f5a64: J⋅m/mol
EMMO 967080e5 2f42 4eb2 a3a9 c58143e835f9: `Joule Meter per Mole` is a unit for 'Length Molar Energy' expressed as J · m · mol⁻¹. -- QUDT

EnergyLengthPerAmountUnit
type: Class
subclass of: Restriction
  has value: T-2 L+3 M+1 I0 Θ0 N-1 J0
comment: The class of units with dimensionality 'EnergyLengthPerAmount'.
EMMO 967080e5 2f42 4eb2 a3a9 c58143e835f9: The class of units with dimensionality 'EnergyLengthPerAmount'.

KelvinPerMetre
type: Class
subclass of: Restriction
  has value: 1.0
subclass of: Restriction
  has value: 0.0
comment: A change of temperature on the Kelvin temperature scale in one SI unit of length. -- QUDT
alternative label: KelvinPerMeter
EMMO 1f1b164d ec6a 4faa 8d5e 88bda62316cc: http://qudt.org/vocab/unit/K-PER-M
EMMO 33ae2d07 5526 4555 a0b4 8f4c031b5652: K.m-1
EMMO 7f1dec83 d85e 4e1b b7bd c9442d4f5a64: K/m
EMMO 967080e5 2f42 4eb2 a3a9 c58143e835f9: A change of temperature on the Kelvin temperature scale in one SI unit of length. -- QUDT

TemperaturePerLengthUnit
type: Class
subclass of: Restriction
  has value: T0 L-1 M0 I0 Θ+1 N0 J0
comment: The class of units with dimensionality 'TemperaturePerLength'.
EMMO 967080e5 2f42 4eb2 a3a9 c58143e835f9: The class of units with dimensionality 'TemperaturePerLength'.

Laplacian
type: Class
subclass of: Restriction
  has value: Δ

DifferentialOperator
type: Class

QuantityValue
type: Class
subclass of: Restriction
  qualified cardinality: 1
subclass of: Restriction
  qualified cardinality: 1
comment: A quantity value is not necessarily a property, since it is possible to write "10 kg", without assigning this quantity to a specific object.
comment: A symbolic that has parts a numerical object and a reference expressing the value of a quantity (expressed as the product of the numerical and the unit).
comment: Following the International Vocabulary of Metrology (VIM), EMMO distinguishes between a quantity (a property) and the quantity value (a numerical and a reference). So, for the EMMO the symbol "kg" is not a physical quantity but simply a 'Symbolic' object categorized as a 'MeasurementUnit'. While the string "1 kg" is a 'QuantityValue'.
example: 6.8 m 0.9 km 8 K 6 MeV 43.5 HRC(150 kg)
EMMO 967080e5 2f42 4eb2 a3a9 c58143e835f9: A symbolic that has parts a numerical object and a reference expressing the value of a quantity (expressed as the product of the numerical and the unit).
EMMO bb49844b 45d7 4f0d 8cae 8e552cbc20d6: quantity value
EMMO c7b62dd7 063a 4c2a 8504 42f7264ba83f: A quantity value is not necessarily a property, since it is possible to write "10 kg", without assigning this quantity to a specific object.

Experiment
type: Class
comment: An experiment is a process that is intended to replicate a physical phenomenon in a controlled environment.
EMMO 967080e5 2f42 4eb2 a3a9 c58143e835f9: An experiment is a process that is intended to replicate a physical phenomenon in a controlled environment.

Observation
type: Class
subclass of: Restriction
comment: A characterisation of an object with an actual interaction.
EMMO 967080e5 2f42 4eb2 a3a9 c58143e835f9: A characterisation of an object with an actual interaction.

StringData
type: Class
comment: Since a string is a simple type that can contain only characters but not other child elements, is often not suitable for representing human text, that may need additional elements for control of aspects such as bidirectional formatting or ruby annotation.
comment: Symbolic data that consist of a sequence of characters.
EMMO 8a137e9f 579c 4e28 baca e8980eb0c3db: EquivalentTo: hasDataValue some xsd:string
EMMO 967080e5 2f42 4eb2 a3a9 c58143e835f9: Symbolic data that consist of a sequence of characters.
EMMO c7b62dd7 063a 4c2a 8504 42f7264ba83f: Since a string is a simple type that can contain only characters but not other child elements, is often not suitable for representing human text, that may need additional elements for control of aspects such as bidirectional formatting or ruby annotation.

NuclearMagneton
type: Class
subclass of: Restriction
comment: Absolute value of the magnetic moment of a nucleus.
EMMO 26bf1bef d192 4da6 b0eb d2209698fb54: https://www.wikidata.org/wiki/Q1166093
EMMO 8de5d5bf db1c 40ac b698 095ba3b18578: 10-9.3
EMMO 967080e5 2f42 4eb2 a3a9 c58143e835f9: Absolute value of the magnetic moment of a nucleus.
EMMO fe015383 afb3 44a6 ae86 043628697aa2: https://doi.org/10.1351/goldbook.N04236

CandelaPerSquareMetre
type: Class
subclass of: Restriction
  has value: 1.0
subclass of: Restriction
  has value: 0.0
comment: The candela per square metre (cd/m²) is the derived SI unit of luminance. The unit is based on the candela, the SI unit of luminous intensity, and the square metre, the SI unit of area. Nit (nt) is a deprecated non-SI name also used for this unit (1 nit = 1 cd/m²). As a measure of light emitted per unit area, this unit is frequently used to specify the brightness of a display device. Most consumer desktop liquid crystal displays have luminances of 200 to 300 cd/m²; the sRGB spec for monitors targets 80 cd/m2. HDTVs range from 450 to about 1000 cd/m2. Typically, calibrated monitors should have a brightness of 120 cd/m². Nit is believed to come from the Latin word nitere, to shine. -- QUDT
alternative label: candela per square metre
EMMO 1f1b164d ec6a 4faa 8d5e 88bda62316cc: http://qudt.org/vocab/unit/CD-PER-M2
EMMO 33ae2d07 5526 4555 a0b4 8f4c031b5652: cd.m-2
EMMO 33ae2d07 5526 4555 a0b4 8f4c031b5652: cd/m2
EMMO 7f1dec83 d85e 4e1b b7bd c9442d4f5a64: cd/m²
EMMO 967080e5 2f42 4eb2 a3a9 c58143e835f9: The candela per square metre (cd/m²) is the derived SI unit of luminance. The unit is based on the candela, the SI unit of luminous intensity, and the square metre, the SI unit of area. Nit (nt) is a deprecated non-SI name also used for this unit (1 nit = 1 cd/m²). As a measure of light emitted per unit area, this unit is frequently used to specify the brightness of a display device. Most consumer desktop liquid crystal displays have luminances of 200 to 300 cd/m²; the sRGB spec for monitors targets 80 cd/m2. HDTVs range from 450 to about 1000 cd/m2. Typically, calibrated monitors should have a brightness of 120 cd/m². Nit is believed to come from the Latin word nitere, to shine. -- QUDT

LuminanceUnit
type: Class
subclass of: Restriction
  has value: T0 L-2 M0 I0 Θ0 N0 J+1
comment: The class of units with dimensionality 'Luminance'.
EMMO 967080e5 2f42 4eb2 a3a9 c58143e835f9: The class of units with dimensionality 'Luminance'.

PascalSecondPerCubicMetre
type: Class
subclass of: Restriction
  has value: 1.0
subclass of: Restriction
  has value: 0.0
comment: `Pascal Second Per Cubic Meter` (Pa-s/m³) is a unit in the category of Acoustic impedance. It is also known as `pascal-second/cubic meter`. It has a dimension of ML⁻⁴T⁻¹ where M is mass, L is length, and T is time. This unit is the standard SI unit in this category. -- QUDT
alternative label: Pascal Second Per Cubic Metre
EMMO 1f1b164d ec6a 4faa 8d5e 88bda62316cc: http://qudt.org/vocab/unit/PA-SEC-PER-M3
EMMO 33ae2d07 5526 4555 a0b4 8f4c031b5652: Pa.s.m-3
EMMO 7f1dec83 d85e 4e1b b7bd c9442d4f5a64: Pa⋅s/m³
EMMO 967080e5 2f42 4eb2 a3a9 c58143e835f9: `Pascal Second Per Cubic Meter` (Pa-s/m³) is a unit in the category of Acoustic impedance. It is also known as `pascal-second/cubic meter`. It has a dimension of ML⁻⁴T⁻¹ where M is mass, L is length, and T is time. This unit is the standard SI unit in this category. -- QUDT

MassPerQuarticLengthTimeUnit
type: Class
subclass of: Restriction
  has value: T-1 L-4 M+1 I0 Θ0 N0 J0
comment: The class of units with dimensionality 'MassPerQuarticLengthTime'.
EMMO 967080e5 2f42 4eb2 a3a9 c58143e835f9: The class of units with dimensionality 'MassPerQuarticLengthTime'.

TennessineSymbol
type: Class
subclass of: Restriction
  has value: Ts
comment: The symbol that stands for the tennessine atom.
EMMO 967080e5 2f42 4eb2 a3a9 c58143e835f9: The symbol that stands for the tennessine atom.

MilliCoulombPerCubicMetre
type: Class
subclass of: Restriction
  some values from: CoulombPerCubicMetre
subclass of: Restriction
  has value: 0.001
subclass of: Restriction
  has value: 0.0
comment: 0.001-fold of the SI derived unit coulomb divided by the power of the SI base unit metre with the exponent 3 -- QUDT
alternative label: Millicoulomb Per Cubic Metre
EMMO 1f1b164d ec6a 4faa 8d5e 88bda62316cc: http://qudt.org/vocab/unit/MilliC-PER-M3
EMMO 33ae2d07 5526 4555 a0b4 8f4c031b5652: mC.m-3
EMMO 7f1dec83 d85e 4e1b b7bd c9442d4f5a64: mC/m³
EMMO 967080e5 2f42 4eb2 a3a9 c58143e835f9: 0.001-fold of the SI derived unit coulomb divided by the power of the SI base unit metre with the exponent 3 -- QUDT

Degree
type: Class
subclass of: Restriction
  has value: 0.01745329
subclass of: Restriction
  has value: 0.0
subclass of: Restriction
  has value: °
comment: A degree (in full, a degree of arc, arc degree, or arcdegree), usually denoted by ° (the degree symbol), is a measurement of plane angle, representing 1/360 of a full rotation; one degree is equivalent to 2π /360 rad, 0.017453 rad. It is not an SI unit, as the SI unit for angles is radian, but is an accepted SI unit. -- QUDT
comment: Degree is a measurement of plane angle, defined by representing a full rotation as 360 degrees.
EMMO 0b1cbe60 d380 4787 b92e be26bdacf2c2: DD
EMMO 1f1b164d ec6a 4faa 8d5e 88bda62316cc: http://qudt.org/vocab/unit/DEG
EMMO 33ae2d07 5526 4555 a0b4 8f4c031b5652: deg
EMMO 6dd685dd 1895 46e4 b227 be9f7d643c25: http://dbpedia.org/page/Degree_(angle)
EMMO 70fe84ff 99b6 4206 a9fc 9a8931836d84: Degree is a measurement of plane angle, defined by representing a full rotation as 360 degrees.
EMMO 967080e5 2f42 4eb2 a3a9 c58143e835f9: A degree (in full, a degree of arc, arc degree, or arcdegree), usually denoted by ° (the degree symbol), is a measurement of plane angle, representing 1/360 of a full rotation; one degree is equivalent to 2π /360 rad, 0.017453 rad. It is not an SI unit, as the SI unit for angles is radian, but is an accepted SI unit. -- QUDT
EMMO fe015383 afb3 44a6 ae86 043628697aa2: https://doi.org/10.1351/goldbook.D01560

LengthFractionUnit
type: Class
comment: Unit for quantities of dimension one that are the fraction of two lengths.
example: Unit for plane angle.
EMMO 967080e5 2f42 4eb2 a3a9 c58143e835f9: Unit for quantities of dimension one that are the fraction of two lengths.

LaserCutting
type: Class

ThermalCutting
type: Class
comment: Thermal ablation is the separation of material particles in solid, liquid or gaseous state by heat processes as well as the removal of these material particles by mechanical or electromagnetic forces (from: DIN
alternative label: Thermisches Abtragen
EMMO c7b62dd7 063a 4c2a 8504 42f7264ba83f: Thermal ablation is the separation of material particles in solid, liquid or gaseous state by heat processes as well as the removal of these material particles by mechanical or electromagnetic forces (from: DIN

NewtonPerCentiMetre
type: Class
subclass of: Restriction
  has value: 100.0
subclass of: Restriction
  has value: 0.0
comment: SI derived unit newton divided by the 0.01-fold of the SI base unit metre -- QUDT
alternative label: Newton Per Centimetre
EMMO 1f1b164d ec6a 4faa 8d5e 88bda62316cc: http://qudt.org/vocab/unit/N-PER-CentiM
EMMO 33ae2d07 5526 4555 a0b4 8f4c031b5652: N.cm-1
EMMO 7f1dec83 d85e 4e1b b7bd c9442d4f5a64: N/cm
EMMO 967080e5 2f42 4eb2 a3a9 c58143e835f9: SI derived unit newton divided by the 0.01-fold of the SI base unit metre -- QUDT

ForcePerLengthUnit
type: Class
subclass of: Restriction
  has value: T-2 L0 M+1 I0 Θ0 N0 J0
comment: The class of units with dimensionality 'ForcePerLength'.
EMMO 967080e5 2f42 4eb2 a3a9 c58143e835f9: The class of units with dimensionality 'ForcePerLength'.

FormingFromPlastic
type: Class

Base64Binary
type: Class
comment: Base-64 encoding of binary data.
EMMO 8a137e9f 579c 4e28 baca e8980eb0c3db: EquivalentTo: hasDataValue some xsd:base64Binary
EMMO 967080e5 2f42 4eb2 a3a9 c58143e835f9: Base-64 encoding of binary data.

BinaryData
type: Class
comment: Symbolic data that can be represented as a sequence of zeros and ones.
EMMO 967080e5 2f42 4eb2 a3a9 c58143e835f9: Symbolic data that can be represented as a sequence of zeros and ones.

InteractingSystem
type: Class
comment: A causally bonded system is a system in which there are at least two causal paths that are interacting.
EMMO 8a137e9f 579c 4e28 baca e8980eb0c3db: DisjointUnionOf: PhysicalObject, PhysicalPhenomenon
EMMO 967080e5 2f42 4eb2 a3a9 c58143e835f9: A causally bonded system is a system in which there are at least two causal paths that are interacting.

GenericPhysicalSystem
type: Class
comment: A causal system posessing bonding that can not be representated by a simple Feynman diagram.
EMMO 8a137e9f 579c 4e28 baca e8980eb0c3db: DisjointUnionOf: InteractingSystem, ParticlesSystem
EMMO 967080e5 2f42 4eb2 a3a9 c58143e835f9: A causal system posessing bonding that can not be representated by a simple Feynman diagram.

ParticlesSystem
type: Class
comment: A causal multipath system is a system made of causal paths that are not interacting between each others, or possibly merge and fork.
comment: A physically unbounded system is a combination of elementary particles chains tha may include also decays and/or annihilations, without any space-like interaction between elementary particles.
alternative label: NonInteractingSystem
EMMO 967080e5 2f42 4eb2 a3a9 c58143e835f9: A causal multipath system is a system made of causal paths that are not interacting between each others, or possibly merge and fork.
EMMO c7b62dd7 063a 4c2a 8504 42f7264ba83f: A physically unbounded system is a combination of elementary particles chains tha may include also decays and/or annihilations, without any space-like interaction between elementary particles.

UnsignedByteData
type: Class
comment: A data representing 8-bit non-negative integer number, 0...255.
EMMO 8a137e9f 579c 4e28 baca e8980eb0c3db: EquivalentTo: hasDataValue some xsd:unsignedByte
EMMO 967080e5 2f42 4eb2 a3a9 c58143e835f9: A data representing 8-bit non-negative integer number, 0...255.

PascalMetrePerSquareSecond
type: Class
subclass of: Restriction
  has value: 1.0
subclass of: Restriction
  has value: 0.0
comment: Pascal metre per square second.
EMMO 1f1b164d ec6a 4faa 8d5e 88bda62316cc: http://qudt.org/vocab/unit/PA-M-PER-SEC2
EMMO 33ae2d07 5526 4555 a0b4 8f4c031b5652: Pa.m.s-2
EMMO 7f1dec83 d85e 4e1b b7bd c9442d4f5a64: Pa⋅m/s²
EMMO 967080e5 2f42 4eb2 a3a9 c58143e835f9: Pascal metre per square second.

PascalPerSecond
type: Class
subclass of: Restriction
  has value: 1.0
subclass of: Restriction
  has value: 0.0
comment: A rate of change of pressure measured as the number of Pascals in a period of one second. -- QUDT
alternative label: Pascal per Second
EMMO 1f1b164d ec6a 4faa 8d5e 88bda62316cc: http://qudt.org/vocab/unit/PA-PER-SEC
EMMO 33ae2d07 5526 4555 a0b4 8f4c031b5652: Pa.s-1
EMMO 33ae2d07 5526 4555 a0b4 8f4c031b5652: Pa/s
EMMO 7f1dec83 d85e 4e1b b7bd c9442d4f5a64: P/s
EMMO 967080e5 2f42 4eb2 a3a9 c58143e835f9: A rate of change of pressure measured as the number of Pascals in a period of one second. -- QUDT

PraseodymiumSymbol
type: Class
subclass of: Restriction
  has value: Pr
comment: The symbol that stands for the praseodymium atom.
EMMO 967080e5 2f42 4eb2 a3a9 c58143e835f9: The symbol that stands for the praseodymium atom.

ArtificialAgency
type: Class
comment: An intentional agency exercised by artificial systems that have internal states that enables adaptive regulation of the agent’s coupling with the environment and metabolic self-maintenance.
EMMO 967080e5 2f42 4eb2 a3a9 c58143e835f9: An intentional agency exercised by artificial systems that have internal states that enables adaptive regulation of the agent’s coupling with the environment and metabolic self-maintenance.

MilliMetre
type: Class
subclass of: Restriction
  some values from: Metre
subclass of: Restriction
  has value: 0.001
subclass of: Restriction
  has value: 0.0
comment: The millimetre (International spelling as used by the International Bureau of Weights and Measures) or millimeter (American spelling) (SI unit symbol mm) is a unit of length in the metric system, equal to one thousandth of a metre, which is the SI base unit of length. It is equal to 1000 micrometres or 1000000 nanometres. A millimetre is equal to exactly 5/127 (approximately 0.039370) of an inch. -- QUDT
EMMO 1f1b164d ec6a 4faa 8d5e 88bda62316cc: http://qudt.org/vocab/unit/MilliM
EMMO 33ae2d07 5526 4555 a0b4 8f4c031b5652: mm
EMMO 7f1dec83 d85e 4e1b b7bd c9442d4f5a64: mm
EMMO 967080e5 2f42 4eb2 a3a9 c58143e835f9: The millimetre (International spelling as used by the International Bureau of Weights and Measures) or millimeter (American spelling) (SI unit symbol mm) is a unit of length in the metric system, equal to one thousandth of a metre, which is the SI base unit of length. It is equal to 1000 micrometres or 1000000 nanometres. A millimetre is equal to exactly 5/127 (approximately 0.039370) of an inch. -- QUDT
EMMO c84c6752 6d64 48cc 9500 e54a3c34898d: http://en.wikipedia.org/wiki/Millimetre

Illuminance
type: Class
subclass of: Restriction
comment: The total luminous flux incident on a surface, per unit area.
EMMO 1f1b164d ec6a 4faa 8d5e 88bda62316cc: http://qudt.org/vocab/quantitykind/Illuminance
EMMO 967080e5 2f42 4eb2 a3a9 c58143e835f9: The total luminous flux incident on a surface, per unit area.
EMMO fe015383 afb3 44a6 ae86 043628697aa2: https://doi.org/10.1351/goldbook.I02941

StandardAmountConcentration
type: Class
comment: Chosen value of amount concentration, usually equal to 1 mol dm−3.
alternative label: StandardConcentration
alternative label: StandardMolarConcentration
EMMO 26bf1bef d192 4da6 b0eb d2209698fb54: https://www.wikidata.org/wiki/Q88871689
EMMO 8de5d5bf db1c 40ac b698 095ba3b18578: 9-12.2
EMMO 967080e5 2f42 4eb2 a3a9 c58143e835f9: Chosen value of amount concentration, usually equal to 1 mol dm−3.
EMMO fe015383 afb3 44a6 ae86 043628697aa2: https://doi.org/10.1351/goldbook.S05909

AmountConcentration
type: Class
subclass of: Restriction
comment: The amount of a constituent divided by the volume of the mixture.
alternative label: Concentration
alternative label: MolarConcentration
alternative label: Molarity
EMMO 1f1b164d ec6a 4faa 8d5e 88bda62316cc: http://qudt.org/vocab/quantitykind/AmountOfSubstanceConcentrationOfB
EMMO 967080e5 2f42 4eb2 a3a9 c58143e835f9: The amount of a constituent divided by the volume of the mixture.
EMMO fe015383 afb3 44a6 ae86 043628697aa2: https://doi.org/10.1351/goldbook.A00295

GasLiquidSuspension
type: Class
comment: A coarse dispersion of liquid in a gas continuum phase.
example: Rain, spray.
EMMO 967080e5 2f42 4eb2 a3a9 c58143e835f9: A coarse dispersion of liquid in a gas continuum phase.

GasMixture
type: Class
equivalent class: Class

Suspension
type: Class
comment: An heterogeneous mixture that contains coarsly dispersed particles (no Tyndall effect), that generally tend to separate in time to the dispersion medium phase.
comment: Suspensions show no significant effect on light.
EMMO 967080e5 2f42 4eb2 a3a9 c58143e835f9: An heterogeneous mixture that contains coarsly dispersed particles (no Tyndall effect), that generally tend to separate in time to the dispersion medium phase.

SIUnitSymbol
type: Class
disjoint union of:
  rest:
    rest: nil
comment: A unit symbol that belongs to the SI system. Is either a SI base unit or a SI special unit.
EMMO 967080e5 2f42 4eb2 a3a9 c58143e835f9: A unit symbol that belongs to the SI system. Is either a SI base unit or a SI special unit.

MeasurementUnitByDimensionality
type: Class

SICoherentUnit
type: Class
disjoint union of:
  rest:
    rest:
      rest: nil
comment: A unit that can be expressed as a product of powers of SI base units with no pre-factor or offset.
comment: Derived units are defined as products of powers of the base units. When the numerical factor of this product is one, the derived units are called coherent derived units. The base and coherent derived units of the SI form a coherent set, designated the set of coherent SI units.
EMMO 967080e5 2f42 4eb2 a3a9 c58143e835f9: A unit that can be expressed as a product of powers of SI base units with no pre-factor or offset.
EMMO c7b62dd7 063a 4c2a 8504 42f7264ba83f: Derived units are defined as products of powers of the base units. When the numerical factor of this product is one, the derived units are called coherent derived units. The base and coherent derived units of the SI form a coherent set, designated the set of coherent SI units.

Process
type: Class
comment: A process can be defined only according to an entity type. The minimum process is an entity made of two entities of different types that are temporally related.
comment: The superclass for causal structure classes whose individuals have some temporal item parts that are not of the same type of the whole.
alternative label: Occurrent
alternative label: Perdurant
example: Practically speaking, the Process class can be populated by primitive subclasses (e.g. Cooking) for each of which holds the axiom that not all the item temporal parts are of the same type of the whole (e.g. breaking an egg, which is not necessarily a cooking process) and there are at least two temporal item parts of different types (e.g. breaking and egg and turning on the stove). The intended usage is not for an individual to belong directly to Process, but to belong to a specific subclass of Process that identifies entities with a specific non-type-persistent structure.
EMMO 8a137e9f 579c 4e28 baca e8980eb0c3db: Equivalent To: Behaviour or ConstitutiveProcess or Stage or SubProcess
EMMO 967080e5 2f42 4eb2 a3a9 c58143e835f9: The superclass for causal structure classes whose individuals have some temporal item parts that are not of the same type of the whole.
EMMO c7b62dd7 063a 4c2a 8504 42f7264ba83f: A process can be defined only according to an entity type. The minimum process is an entity made of two entities of different types that are temporally related.
EMMO c7b62dd7 063a 4c2a 8504 42f7264ba83f: Following the common definition of process, the reader may think that every entity in the EMMO should be a process, since every 4D entity0 always has a time dimension. However, in the EMMO we restrict the concept of process to items whose temporal parts show a change in type (i.e. every 4D object unfolds in time, but not every 4D time unfolding may be of interest for the ontologist and categorized as a process). The definition of every specific process subclass requires a reference type, that is expressed by some but not all temporal parts.

PicoGramPerKilogram
type: Class
subclass of: Restriction
  some values from: GramPerKilogram
subclass of: Restriction
  has value: 1e-15
subclass of: Restriction
  has value: 0.0
comment: One part per 10**15 by mass of the measurand in the matrix. -- QUDT
alternative label: Picograms per kilogram
EMMO 1f1b164d ec6a 4faa 8d5e 88bda62316cc: http://qudt.org/vocab/unit/PicoGM-PER-KiloGM
EMMO 33ae2d07 5526 4555 a0b4 8f4c031b5652: pg.kg-1
EMMO 7f1dec83 d85e 4e1b b7bd c9442d4f5a64: pg/kg
EMMO 967080e5 2f42 4eb2 a3a9 c58143e835f9: One part per 10**15 by mass of the measurand in the matrix. -- QUDT

MassFractionUnit
type: Class
comment: Unit for quantities of dimension one that are the fraction of two masses.
example: Unit for mass fraction.
EMMO 967080e5 2f42 4eb2 a3a9 c58143e835f9: Unit for quantities of dimension one that are the fraction of two masses.

SexticMetre
type: Class
comment: Metre to the power of six.
EMMO 1f1b164d ec6a 4faa 8d5e 88bda62316cc: http://qudt.org/vocab/unit/M6
EMMO 7f1dec83 d85e 4e1b b7bd c9442d4f5a64: m⁶
EMMO 967080e5 2f42 4eb2 a3a9 c58143e835f9: Metre to the power of six.

SexticLengthUnit
type: Class
subclass of: Restriction
  has value: T0 L+6 M0 I0 Θ0 N0 J0
comment: The class of units with dimensionality 'SexticLength'.
EMMO 967080e5 2f42 4eb2 a3a9 c58143e835f9: The class of units with dimensionality 'SexticLength'.

GigaCoulombPerCubicMetre
type: Class
subclass of: Restriction
  some values from: CoulombPerCubicMetre
subclass of: Restriction
  has value: 1000000000.0
subclass of: Restriction
  has value: 0.0
comment: 1 000 000 000-fold of the SI derived unit coulomb divided by the power of the SI base unit metre with the exponent 3 -- QUDT
alternative label: Gigacoulomb Per Cubic Metre
EMMO 1f1b164d ec6a 4faa 8d5e 88bda62316cc: http://qudt.org/vocab/unit/GigaC-PER-M3
EMMO 33ae2d07 5526 4555 a0b4 8f4c031b5652: GC.m-3
EMMO 7f1dec83 d85e 4e1b b7bd c9442d4f5a64: GC/m³
EMMO 967080e5 2f42 4eb2 a3a9 c58143e835f9: 1 000 000 000-fold of the SI derived unit coulomb divided by the power of the SI base unit metre with the exponent 3 -- QUDT

CoulombPerKilogram
type: Class
subclass of: Restriction
  has value: 1.0
subclass of: Restriction
  has value: 0.0
comment: `Coulomb Per Kilogram (C/kg)` is the unit in the category of Exposure. It is also known as coulombs per kilogram, coulomb/kilogram. This unit is commonly used in the SI unit system. Coulomb Per Kilogram (C/kg) has a dimension of M⁻¹TI where M is mass, T is time, and I is electric current. This unit is the standard SI unit in this category. -- QUDT
alternative label: Coulomb per Kilogram
EMMO 1f1b164d ec6a 4faa 8d5e 88bda62316cc: http://qudt.org/vocab/unit/C-PER-KiloGM
EMMO 33ae2d07 5526 4555 a0b4 8f4c031b5652: C.kg-1
EMMO 33ae2d07 5526 4555 a0b4 8f4c031b5652: C/kg
EMMO 7f1dec83 d85e 4e1b b7bd c9442d4f5a64: C/kg
EMMO 967080e5 2f42 4eb2 a3a9 c58143e835f9: `Coulomb Per Kilogram (C/kg)` is the unit in the category of Exposure. It is also known as coulombs per kilogram, coulomb/kilogram. This unit is commonly used in the SI unit system. Coulomb Per Kilogram (C/kg) has a dimension of M⁻¹TI where M is mass, T is time, and I is electric current. This unit is the standard SI unit in this category. -- QUDT

ElectricChargePerMassUnit
type: Class
subclass of: Restriction
  has value: T+1 L0 M-1 I+1 Θ0 N0 J0
comment: The class of units with dimensionality 'ElectricChargePerMass'.
EMMO 967080e5 2f42 4eb2 a3a9 c58143e835f9: The class of units with dimensionality 'ElectricChargePerMass'.

MicroMetre
type: Class
subclass of: Restriction
  some values from: Metre
subclass of: Restriction
  has value: 1e-06
subclass of: Restriction
  has value: 0.0
comment: "Micrometer" is a unit for 'Length' expressed as microm. -- QUDT
alternative label: MicroMeter
alternative label: Microm
EMMO 1f1b164d ec6a 4faa 8d5e 88bda62316cc: http://qudt.org/vocab/unit/MicroM
EMMO 33ae2d07 5526 4555 a0b4 8f4c031b5652: um
EMMO 7f1dec83 d85e 4e1b b7bd c9442d4f5a64: µm
EMMO 967080e5 2f42 4eb2 a3a9 c58143e835f9: "Micrometer" is a unit for 'Length' expressed as microm. -- QUDT
EMMO c84c6752 6d64 48cc 9500 e54a3c34898d: http://en.wikipedia.org/wiki/Micrometer

MomentOfIntertia
type: Class
subclass of: Restriction
comment: Scalar measure of the rotational inertia with respect to a fixed axis of rotation.
EMMO 1f1b164d ec6a 4faa 8d5e 88bda62316cc: https://qudt.org/vocab/quantitykind/MomentOfInertia
EMMO 26bf1bef d192 4da6 b0eb d2209698fb54: https://www.wikidata.org/wiki/Q165618
EMMO 50c298c2 55a2 4068 b3ac 4e948c33181f: https://www.electropedia.org/iev/iev.nsf/display
EMMO 8de5d5bf db1c 40ac b698 095ba3b18578: 4-7
EMMO 967080e5 2f42 4eb2 a3a9 c58143e835f9: Scalar measure of the rotational inertia with respect to a fixed axis of rotation.
EMMO fe015383 afb3 44a6 ae86 043628697aa2: https://doi.org/10.1351/goldbook.M04006

NewtonSquareMetre
type: Class
subclass of: Restriction
  has value: 1.0
subclass of: Restriction
  has value: 0.0
comment: Newton square metre.
EMMO 1f1b164d ec6a 4faa 8d5e 88bda62316cc: http://qudt.org/vocab/unit/N-M2
EMMO 7f1dec83 d85e 4e1b b7bd c9442d4f5a64: N⋅m²
EMMO 967080e5 2f42 4eb2 a3a9 c58143e835f9: Newton square metre.

ForceAreaUnit
type: Class
subclass of: Restriction
  has value: T-2 L+3 M+1 I0 Θ0 N0 J0
comment: The class of units with dimensionality 'ForceArea'.
EMMO 967080e5 2f42 4eb2 a3a9 c58143e835f9: The class of units with dimensionality 'ForceArea'.

Gas
type: Class
comment: Gas is a compressible fluid, a state of matter that has no fixed shape and no fixed volume.
EMMO 967080e5 2f42 4eb2 a3a9 c58143e835f9: Gas is a compressible fluid, a state of matter that has no fixed shape and no fixed volume.

Organisation
type: Class
comment: An holistic system of people that has its own functions with responsibilities, authorities and relationships to achieve its objectives.
see also: ISO 55000:2014 organization: person or group of people that has its own functions with responsibilities, authorities and relationships to achieve its objectives
EMMO 967080e5 2f42 4eb2 a3a9 c58143e835f9: An holistic system of people that has its own functions with responsibilities, authorities and relationships to achieve its objectives.

MilliMetrePerSecond
type: Class
subclass of: Restriction
  some values from: MetrePerSecond
subclass of: Restriction
  has value: 0.001
subclass of: Restriction
  has value: 0.0
comment: 0.001-fold of the SI base unit metre divided by the SI base unit second -- QUDT
alternative label: Millimetre Per Second
EMMO 1f1b164d ec6a 4faa 8d5e 88bda62316cc: http://qudt.org/vocab/unit/MilliM-PER-SEC
EMMO 33ae2d07 5526 4555 a0b4 8f4c031b5652: mm.s-1
EMMO 7f1dec83 d85e 4e1b b7bd c9442d4f5a64: mm/s
EMMO 967080e5 2f42 4eb2 a3a9 c58143e835f9: 0.001-fold of the SI base unit metre divided by the SI base unit second -- QUDT

Sawing
type: Class
comment: Process of cutting a workpiece into smaller parts that are either doughter parts, samples (e.g. for testing) or scrap.
comment: Cutting with circular or straight cutting motion, using a multi-toothed tool of small cutting width, the cutting motion being performed by the tool
alternative label: Sägen
EMMO 967080e5 2f42 4eb2 a3a9 c58143e835f9: Process of cutting a workpiece into smaller parts that are either doughter parts, samples (e.g. for testing) or scrap.

ElectricPotential
type: Class
subclass of: Restriction
comment: Energy required to move a unit charge through an electric field from a reference point.
comment: The electric potential is not unique, since any constant scalar field quantity can be added to it without changing its gradient.
alternative label: ElectroStaticPotential
EMMO 1f1b164d ec6a 4faa 8d5e 88bda62316cc: http://qudt.org/vocab/quantitykind/ElectricPotential
EMMO 50c298c2 55a2 4068 b3ac 4e948c33181f: https://www.electropedia.org/iev/iev.nsf/display
EMMO 6dd685dd 1895 46e4 b227 be9f7d643c25: https://dbpedia.org/page/Electric_potential
EMMO 8de5d5bf db1c 40ac b698 095ba3b18578: 6-11.1
EMMO 967080e5 2f42 4eb2 a3a9 c58143e835f9: Energy required to move a unit charge through an electric field from a reference point.
EMMO c84c6752 6d64 48cc 9500 e54a3c34898d: https://en.wikipedia.org/wiki/Electric_potential
EMMO fe015383 afb3 44a6 ae86 043628697aa2: https://doi.org/10.1351/goldbook.E01935

MicroGram
type: Class
subclass of: Restriction
  has value: 1e-09
subclass of: Restriction
  has value: 0.0
comment: 0.000000001-fold of the SI base unit kilogram -- QUDT
EMMO 1f1b164d ec6a 4faa 8d5e 88bda62316cc: http://qudt.org/vocab/unit/MicroGM
EMMO 33ae2d07 5526 4555 a0b4 8f4c031b5652: ug
EMMO 7f1dec83 d85e 4e1b b7bd c9442d4f5a64: μg
EMMO 967080e5 2f42 4eb2 a3a9 c58143e835f9: 0.000000001-fold of the SI base unit kilogram -- QUDT

Expressing
type: Class
comment: A semiosis where the interpreter wants to express an interpretant (e.g., an idea, a reasoning, a distant entity) to the rest of the world by the production of a sign. In the intention of the interpreter, the sign should impress another agent with an intended interpretation that should match his one.
EMMO 967080e5 2f42 4eb2 a3a9 c58143e835f9: A semiosis where the interpreter wants to express an interpretant (e.g., an idea, a reasoning, a distant entity) to the rest of the world by the production of a sign. In the intention of the interpreter, the sign should impress another agent with an intended interpretation that should match his one.

MilliGramPerKilogram
type: Class
subclass of: Restriction
  some values from: GramPerKilogram
subclass of: Restriction
  has value: 1e-06
subclass of: Restriction
  has value: 0.0
comment: 0.000001-fold of the SI base unit kilogram divided by the SI base unit kilogram -- QUDT
alternative label: Milligram Per Kilogram
EMMO 1f1b164d ec6a 4faa 8d5e 88bda62316cc: http://qudt.org/vocab/unit/MilliGM-PER-KiloGM
EMMO 33ae2d07 5526 4555 a0b4 8f4c031b5652: mg.kg-1
EMMO 33ae2d07 5526 4555 a0b4 8f4c031b5652: mg/kg
EMMO 7f1dec83 d85e 4e1b b7bd c9442d4f5a64: mg/kg
EMMO 967080e5 2f42 4eb2 a3a9 c58143e835f9: 0.000001-fold of the SI base unit kilogram divided by the SI base unit kilogram -- QUDT

Porosity
type: Class
comment: Ratio of void volume and total volume of a porous material.
EMMO 26bf1bef d192 4da6 b0eb d2209698fb54: https://www.wikidata.org/wiki/Q622669
EMMO 50c298c2 55a2 4068 b3ac 4e948c33181f: https://www.electropedia.org/iev/iev.nsf/display
EMMO 967080e5 2f42 4eb2 a3a9 c58143e835f9: Ratio of void volume and total volume of a porous material.
EMMO fe015383 afb3 44a6 ae86 043628697aa2: https://doi.org/10.1351/goldbook.P04762

StandardAbsoluteActivityOfSolution
type: Class
comment: Property of a solute in a solution.
alternative label: StandardAbsoluteActivity
EMMO 26bf1bef d192 4da6 b0eb d2209698fb54: https://www.wikidata.org/wiki/Q89485936
EMMO 8de5d5bf db1c 40ac b698 095ba3b18578: 9-26
EMMO 967080e5 2f42 4eb2 a3a9 c58143e835f9: Property of a solute in a solution.

MilliBecquerelPerGram
type: Class
subclass of: Restriction
  has value: 1.0
subclass of: Restriction
  has value: 0.0
comment: One radioactive disintegration per thousand seconds per 1000th SI unit of sample mass. -- QUDT
alternative label: Millibecquerels per gram
EMMO 1f1b164d ec6a 4faa 8d5e 88bda62316cc: http://qudt.org/vocab/unit/MilliBQ-PER-GM
EMMO 33ae2d07 5526 4555 a0b4 8f4c031b5652: mBq.g-1
EMMO 7f1dec83 d85e 4e1b b7bd c9442d4f5a64: mBq/g
EMMO 967080e5 2f42 4eb2 a3a9 c58143e835f9: One radioactive disintegration per thousand seconds per 1000th SI unit of sample mass. -- QUDT

MaterialLaw
type: Class
comment: A law that provides a connection between a material property and other properties of the object.
EMMO 967080e5 2f42 4eb2 a3a9 c58143e835f9: A law that provides a connection between a material property and other properties of the object.

NaturalLaw
type: Class
comment: A scientific theory that focuses on a specific phenomena, for which a single statement (not necessariliy in mathematical form) can be expressed.
EMMO 967080e5 2f42 4eb2 a3a9 c58143e835f9: A scientific theory that focuses on a specific phenomena, for which a single statement (not necessariliy in mathematical form) can be expressed.

ModelledProperty
type: Class
comment: A quantity obtained from a well-defined modelling procedure.
EMMO 967080e5 2f42 4eb2 a3a9 c58143e835f9: A quantity obtained from a well-defined modelling procedure.

CanonicalPartitionFunction
type: Class
comment: In physics, a partition function describes the statistical properties of a system in thermodynamic equilibrium. Partition functions are functions of the thermodynamic state variables, such as the temperature and volume. Most of the aggregate thermodynamic variables of the system, such as the total energy, free energy, entropy, and pressure, can be expressed in terms of the partition function or its derivatives. The partition function is dimensionless.
comment: Sum over quantum states of energy in a system in equilibrium.
EMMO 1f1b164d ec6a 4faa 8d5e 88bda62316cc: https://qudt.org/vocab/quantitykind/CanonicalPartitionFunction
EMMO 26bf1bef d192 4da6 b0eb d2209698fb54: https://www.wikidata.org/wiki/Q96142389
EMMO 8de5d5bf db1c 40ac b698 095ba3b18578: 9-35.2
EMMO 967080e5 2f42 4eb2 a3a9 c58143e835f9: Sum over quantum states of energy in a system in equilibrium.
EMMO c7b62dd7 063a 4c2a 8504 42f7264ba83f: In physics, a partition function describes the statistical properties of a system in thermodynamic equilibrium. Partition functions are functions of the thermodynamic state variables, such as the temperature and volume. Most of the aggregate thermodynamic variables of the system, such as the total energy, free energy, entropy, and pressure, can be expressed in terms of the partition function or its derivatives. The partition function is dimensionless.

MicroVolt
type: Class
subclass of: Restriction
  some values from: Volt
subclass of: Restriction
  has value: 1e-06
subclass of: Restriction
  has value: 0.0
comment: 0.000001-fold of the SI derived unit volt -- QUDT
EMMO 1f1b164d ec6a 4faa 8d5e 88bda62316cc: http://qudt.org/vocab/unit/MicroV
EMMO 33ae2d07 5526 4555 a0b4 8f4c031b5652: uV
EMMO 7f1dec83 d85e 4e1b b7bd c9442d4f5a64: µV
EMMO 967080e5 2f42 4eb2 a3a9 c58143e835f9: 0.000001-fold of the SI derived unit volt -- QUDT

NewtonSecond
type: Class
subclass of: Restriction
  has value: 1.0
subclass of: Restriction
  has value: 0.0
comment: product of the SI derived unit newton and the SI base unit second -- QUDT
alternative label: Newton Second
EMMO 1f1b164d ec6a 4faa 8d5e 88bda62316cc: http://qudt.org/vocab/unit/N-SEC
EMMO 33ae2d07 5526 4555 a0b4 8f4c031b5652: N.s
EMMO 7f1dec83 d85e 4e1b b7bd c9442d4f5a64: N⋅s
EMMO 967080e5 2f42 4eb2 a3a9 c58143e835f9: product of the SI derived unit newton and the SI base unit second -- QUDT

Zepto
type: Class
subclass of: Restriction
  has value: z
subclass of: Restriction
  has value: 1e-21
comment: SI prefix who's value is 1e-21.
EMMO 967080e5 2f42 4eb2 a3a9 c58143e835f9: SI prefix who's value is 1e-21.

PeriodDuration
type: Class
comment: duration of one cycle of a periodic event
alternative label: Period
EMMO 1f1b164d ec6a 4faa 8d5e 88bda62316cc: https://qudt.org/vocab/quantitykind/Period
EMMO 26bf1bef d192 4da6 b0eb d2209698fb54: https://www.wikidata.org/wiki/Q2642727
EMMO 50c298c2 55a2 4068 b3ac 4e948c33181f: https://www.electropedia.org/iev/iev.nsf/display
EMMO 8de5d5bf db1c 40ac b698 095ba3b18578: 3-14
EMMO 967080e5 2f42 4eb2 a3a9 c58143e835f9: duration of one cycle of a periodic event
EMMO fe015383 afb3 44a6 ae86 043628697aa2: https://doi.org/10.1351/goldbook.P04493

Duration
type: Class
comment: Physical quantity for describing the temporal distance between events.
EMMO 26bf1bef d192 4da6 b0eb d2209698fb54: https://www.wikidata.org/wiki/Q2199864
EMMO 50c298c2 55a2 4068 b3ac 4e948c33181f: https://www.electropedia.org/iev/iev.nsf/display
EMMO 8de5d5bf db1c 40ac b698 095ba3b18578: 3-9
EMMO 967080e5 2f42 4eb2 a3a9 c58143e835f9: Physical quantity for describing the temporal distance between events.

MilliHenryPerOhm
type: Class
subclass of: Restriction
  some values from: HenryPerOhm
subclass of: Restriction
  has value: 0.001
subclass of: Restriction
  has value: 0.0
comment: 0.001-fold of the SI derived unit henry divided by the SI derived unit ohm -- QUDT
alternative label: Millihenry Per Ohm
EMMO 1f1b164d ec6a 4faa 8d5e 88bda62316cc: http://qudt.org/vocab/unit/MilliH-PER-OHM
EMMO 33ae2d07 5526 4555 a0b4 8f4c031b5652: mH.Ohm-1
EMMO 7f1dec83 d85e 4e1b b7bd c9442d4f5a64: mH/Ω
EMMO 967080e5 2f42 4eb2 a3a9 c58143e835f9: 0.001-fold of the SI derived unit henry divided by the SI derived unit ohm -- QUDT

LarmonFrequency
type: Class
comment: Quotient of Larmor angular frequency and 2π.
EMMO 8de5d5bf db1c 40ac b698 095ba3b18578: 10-15.2
EMMO 967080e5 2f42 4eb2 a3a9 c58143e835f9: Quotient of Larmor angular frequency and 2π.

Frequency
type: Class
subclass of: Restriction
comment: Number of periods per time interval.
EMMO 1f1b164d ec6a 4faa 8d5e 88bda62316cc: http://qudt.org/vocab/quantitykind/Frequency
EMMO 26bf1bef d192 4da6 b0eb d2209698fb54: https://www.wikidata.org/wiki/Q11652
EMMO 50c298c2 55a2 4068 b3ac 4e948c33181f: https://www.electropedia.org/iev/iev.nsf/display
EMMO 8de5d5bf db1c 40ac b698 095ba3b18578: 3-15.1
EMMO 967080e5 2f42 4eb2 a3a9 c58143e835f9: Number of periods per time interval.
EMMO fe015383 afb3 44a6 ae86 043628697aa2: https://doi.org/10.1351/goldbook.FT07383

RybergConstant
type: Class
comment: The Rydberg constant represents the limiting value of the highest wavenumber (the inverse wavelength) of any photon that can be emitted from the hydrogen atom, or, alternatively, the wavenumber of the lowest-energy photon capable of ionizing the hydrogen atom from its ground state.
EMMO 1f1b164d ec6a 4faa 8d5e 88bda62316cc: http://qudt.org/vocab/constant/RydbergConstant
EMMO 967080e5 2f42 4eb2 a3a9 c58143e835f9: The Rydberg constant represents the limiting value of the highest wavenumber (the inverse wavelength) of any photon that can be emitted from the hydrogen atom, or, alternatively, the wavenumber of the lowest-energy photon capable of ionizing the hydrogen atom from its ground state.
EMMO fe015383 afb3 44a6 ae86 043628697aa2: https://doi.org/10.1351/goldbook.R05430

Wavenumber
type: Class
comment: Reciprocal of the wavelength.
comment: The number of waves per unit length along the direction of propagation.
alternative label: Repetency
EMMO 1f1b164d ec6a 4faa 8d5e 88bda62316cc: https://qudt.org/vocab/quantitykind/Wavenumber
EMMO 26bf1bef d192 4da6 b0eb d2209698fb54: https://www.wikidata.org/wiki/Q192510
EMMO 50c298c2 55a2 4068 b3ac 4e948c33181f: https://www.electropedia.org/iev/iev.nsf/display
EMMO 6dd685dd 1895 46e4 b227 be9f7d643c25: https://dbpedia.org/page/Wavenumber
EMMO 8de5d5bf db1c 40ac b698 095ba3b18578: 3-18
EMMO 967080e5 2f42 4eb2 a3a9 c58143e835f9: Reciprocal of the wavelength.
EMMO c7b62dd7 063a 4c2a 8504 42f7264ba83f: The number of waves per unit length along the direction of propagation.
EMMO c84c6752 6d64 48cc 9500 e54a3c34898d: https://en.wikipedia.org/wiki/Wavenumber
EMMO fe015383 afb3 44a6 ae86 043628697aa2: https://doi.org/10.1351/goldbook.W06664

LithiumAtom
type: Class
subclass of: Restriction
subclass of: Restriction
  has value: 6.94
subclass of: Restriction
  has value: 3
comment: Atom subclass for lithium.
EMMO 967080e5 2f42 4eb2 a3a9 c58143e835f9: Atom subclass for lithium.

KilogramKelvin
type: Class
subclass of: Restriction
  has value: 1.0
subclass of: Restriction
  has value: 0.0
comment: `Kilogram Kelvin` is a unit for 'Mass Temperature' expressed as kg-K. -- QUDT
alternative label: Kilogram Kelvin
EMMO 1f1b164d ec6a 4faa 8d5e 88bda62316cc: http://qudt.org/vocab/unit/KiloGM-K
EMMO 33ae2d07 5526 4555 a0b4 8f4c031b5652: kg.K
EMMO 7f1dec83 d85e 4e1b b7bd c9442d4f5a64: kg⋅K
EMMO 967080e5 2f42 4eb2 a3a9 c58143e835f9: `Kilogram Kelvin` is a unit for 'Mass Temperature' expressed as kg-K. -- QUDT

MassTemperatureUnit
type: Class
subclass of: Restriction
  has value: T0 L0 M+1 I0 Θ+1 N0 J0
comment: The class of units with dimensionality 'MassTemperature'.
EMMO 967080e5 2f42 4eb2 a3a9 c58143e835f9: The class of units with dimensionality 'MassTemperature'.

KiloJoule
type: Class
subclass of: Restriction
  some values from: Joule
subclass of: Restriction
  has value: 1000.0
subclass of: Restriction
  has value: 0.0
comment: 1 000-fold of the SI derived unit joule -- QUDT
EMMO 1f1b164d ec6a 4faa 8d5e 88bda62316cc: http://qudt.org/vocab/unit/KiloJ
EMMO 33ae2d07 5526 4555 a0b4 8f4c031b5652: kJ
EMMO 7f1dec83 d85e 4e1b b7bd c9442d4f5a64: kJ
EMMO 967080e5 2f42 4eb2 a3a9 c58143e835f9: 1 000-fold of the SI derived unit joule -- QUDT

SandMolds
type: Class

FormingFromPowder
type: Class

LorenzNumberUnit
type: Class
subclass of: Restriction
  has value: T-6 L+4 M+2 I-2 Θ0 N0 J0
comment: The class of units with dimensionality 'LorenzNumber'.
EMMO 967080e5 2f42 4eb2 a3a9 c58143e835f9: The class of units with dimensionality 'LorenzNumber'.

DeciGram
type: Class
subclass of: Restriction
  some values from: Gram
subclass of: Restriction
  has value: 0.0001
subclass of: Restriction
  has value: 0.0
comment: 0.0001-fold of the SI base unit kilogram -- QUDT
EMMO 1f1b164d ec6a 4faa 8d5e 88bda62316cc: http://qudt.org/vocab/unit/DeciGM
EMMO 33ae2d07 5526 4555 a0b4 8f4c031b5652: dg
EMMO 7f1dec83 d85e 4e1b b7bd c9442d4f5a64: dg
EMMO 967080e5 2f42 4eb2 a3a9 c58143e835f9: 0.0001-fold of the SI base unit kilogram -- QUDT

ChemicalRepresentation
type: Class
comment: A representation of objects belonging to the chemistry field.
EMMO 967080e5 2f42 4eb2 a3a9 c58143e835f9: A representation of objects belonging to the chemistry field.

MixingRatio
type: Class
comment: Ratio of the mass of water vapour to the mass of dry air in a given volume of air.
comment: The mixing ratio at saturation is denoted xsat.
alternative label: MassRatioOfWaterVapourToDryGas
EMMO 26bf1bef d192 4da6 b0eb d2209698fb54: https://www.wikidata.org/wiki/Q76378940
EMMO 50c298c2 55a2 4068 b3ac 4e948c33181f: https://www.electropedia.org/iev/iev.nsf/display
EMMO 8de5d5bf db1c 40ac b698 095ba3b18578: 5-30
EMMO 967080e5 2f42 4eb2 a3a9 c58143e835f9: Ratio of the mass of water vapour to the mass of dry air in a given volume of air.

YtterbiumAtom
type: Class
subclass of: Restriction
subclass of: Restriction
  has value: 173.054
subclass of: Restriction
  has value: 70
comment: Atom subclass for ytterbium.
EMMO 967080e5 2f42 4eb2 a3a9 c58143e835f9: Atom subclass for ytterbium.

Solution
type: Class
comment: A solution is a homogeneous mixture composed of two or more substances.
comment: Solutions are characterized by the occurrence of Rayleigh scattering on light,
EMMO 967080e5 2f42 4eb2 a3a9 c58143e835f9: A solution is a homogeneous mixture composed of two or more substances.

Dispersion
type: Class
disjoint union of:
  rest:
    rest:
      rest: nil
comment: A material in which distributed particles of one phase are dispersed in a different continuous phase.
EMMO 967080e5 2f42 4eb2 a3a9 c58143e835f9: A material in which distributed particles of one phase are dispersed in a different continuous phase.

PhaseHomogeneousMixture
type: Class
comment: A single phase mixture.
EMMO 967080e5 2f42 4eb2 a3a9 c58143e835f9: A single phase mixture.

GramPerKilogram
type: Class
subclass of: Restriction
  has value: 0.001
subclass of: Restriction
  has value: 0.0
comment: 0,001 fold of the SI base unit kilogram divided by the SI base unit kilogram -- QUDT
alternative label: Gram Per Kilogram
EMMO 1f1b164d ec6a 4faa 8d5e 88bda62316cc: http://qudt.org/vocab/unit/GM-PER-KiloGM
EMMO 33ae2d07 5526 4555 a0b4 8f4c031b5652: g.kg-1
EMMO 33ae2d07 5526 4555 a0b4 8f4c031b5652: g/kg
EMMO 7f1dec83 d85e 4e1b b7bd c9442d4f5a64: g/kg
EMMO 967080e5 2f42 4eb2 a3a9 c58143e835f9: 0,001 fold of the SI base unit kilogram divided by the SI base unit kilogram -- QUDT

AmericiumSymbol
type: Class
subclass of: Restriction
  has value: Am
comment: The symbol that stands for the americium atom.
EMMO 967080e5 2f42 4eb2 a3a9 c58143e835f9: The symbol that stands for the americium atom.

WattPerSquareMetreQuarticKelvin
type: Class
comment: Watt Per Square Meter Per Quartic Kelvin (W/m2·K4) is a unit in the category of light. -- QUDT
alternative label: Watt per Square Metre Quartic Kelvin
EMMO 1f1b164d ec6a 4faa 8d5e 88bda62316cc: http://qudt.org/vocab/unit/W-PER-M2-K4
EMMO 33ae2d07 5526 4555 a0b4 8f4c031b5652: W.m-2.K-4
EMMO 7f1dec83 d85e 4e1b b7bd c9442d4f5a64: W/(m²⋅K⁴)
EMMO 967080e5 2f42 4eb2 a3a9 c58143e835f9: Watt Per Square Meter Per Quartic Kelvin (W/m2·K4) is a unit in the category of light. -- QUDT

MassPerCubicTimeQuarticTemperatureUnit
type: Class
subclass of: Restriction
  has value: T-3 L0 M+1 I0 Θ-4 N0 J0
comment: The class of units with dimensionality 'MassPerCubicTimeQuarticTemperature'.
EMMO 967080e5 2f42 4eb2 a3a9 c58143e835f9: The class of units with dimensionality 'MassPerCubicTimeQuarticTemperature'.

ReciprocalLength
type: Class
subclass of: Restriction
comment: The inverse of length.
alternative label: InverseLength
EMMO 1f1b164d ec6a 4faa 8d5e 88bda62316cc: http://qudt.org/vocab/quantitykind/InverseLength
EMMO 967080e5 2f42 4eb2 a3a9 c58143e835f9: The inverse of length.
EMMO c84c6752 6d64 48cc 9500 e54a3c34898d: https://en.wikipedia.org/wiki/Reciprocal_length

BoronAtom
type: Class
subclass of: Restriction
subclass of: Restriction
  has value: 10.81
subclass of: Restriction
  has value: 5
comment: Atom subclass for boron.
EMMO 967080e5 2f42 4eb2 a3a9 c58143e835f9: Atom subclass for boron.

MilliVoltPerMetre
type: Class
subclass of: Restriction
  some values from: VoltPerMetre
subclass of: Restriction
  has value: 0.001
subclass of: Restriction
  has value: 0.0
comment: 0.000001-fold of the SI derived unit volt divided by the SI base unit metre -- QUDT
alternative label: Millivolt Per Metre
EMMO 1f1b164d ec6a 4faa 8d5e 88bda62316cc: http://qudt.org/vocab/unit/MilliV-PER-M
EMMO 33ae2d07 5526 4555 a0b4 8f4c031b5652: mV.m-1
EMMO 7f1dec83 d85e 4e1b b7bd c9442d4f5a64: mV/m
EMMO 967080e5 2f42 4eb2 a3a9 c58143e835f9: 0.000001-fold of the SI derived unit volt divided by the SI base unit metre -- QUDT

LeadSymbol
type: Class
subclass of: Restriction
  has value: Pb
comment: The symbol that stands for the lead atom.
EMMO 967080e5 2f42 4eb2 a3a9 c58143e835f9: The symbol that stands for the lead atom.

CubicExpansionCoefficient
type: Class
comment: Quantity characterizing the variation with thermodynamic temperature T of the volume V of a body, under given conditions.
comment: alpha_V = (1/V) * (dV/dT)
EMMO 1f1b164d ec6a 4faa 8d5e 88bda62316cc: https://qudt.org/vocab/quantitykind/CubicExpansionCoefficient
EMMO 26bf1bef d192 4da6 b0eb d2209698fb54: https://www.wikidata.org/wiki/Q74761076
EMMO 50c298c2 55a2 4068 b3ac 4e948c33181f: https://www.electropedia.org/iev/iev.nsf/display
EMMO 8de5d5bf db1c 40ac b698 095ba3b18578: 5-3.2
EMMO 967080e5 2f42 4eb2 a3a9 c58143e835f9: Quantity characterizing the variation with thermodynamic temperature T of the volume V of a body, under given conditions.

MolarGibbsEnergy
type: Class
comment: Gibbs energy per amount of substance.
EMMO 26bf1bef d192 4da6 b0eb d2209698fb54: https://www.wikidata.org/wiki/Q88863324
EMMO 8de5d5bf db1c 40ac b698 095ba3b18578: 9-6.4
EMMO 967080e5 2f42 4eb2 a3a9 c58143e835f9: Gibbs energy per amount of substance.

KiloNewtonSquareMetre
type: Class
subclass of: Restriction
  some values from: NewtonSquareMetre
subclass of: Restriction
  has value: 1000.0
subclass of: Restriction
  has value: 0.0
alternative label: Kilo Newton Square Metre
EMMO 1f1b164d ec6a 4faa 8d5e 88bda62316cc: http://qudt.org/vocab/unit/KiloN-M2
EMMO 7f1dec83 d85e 4e1b b7bd c9442d4f5a64: kN⋅m²

Mega
type: Class
subclass of: Restriction
  has value: M
subclass of: Restriction
  has value: 1000000.0
comment: SI prefix who's value is 1e6.
EMMO 967080e5 2f42 4eb2 a3a9 c58143e835f9: SI prefix who's value is 1e6.

NeonAtom
type: Class
subclass of: Restriction
subclass of: Restriction
  has value: 20.1797
subclass of: Restriction
  has value: 10
comment: Atom subclass for neon.
EMMO 967080e5 2f42 4eb2 a3a9 c58143e835f9: Atom subclass for neon.

PhaseSpeedOfElectromagneticWaves
type: Class
comment: Angular frequency divided by angular wavenumber.
EMMO 1f1b164d ec6a 4faa 8d5e 88bda62316cc: https://qudt.org/vocab/quantitykind/ElectromagneticWavePhaseSpeed
EMMO 26bf1bef d192 4da6 b0eb d2209698fb54: https://www.wikidata.org/wiki/Q77990619
EMMO 8de5d5bf db1c 40ac b698 095ba3b18578: 6-35.1
EMMO 967080e5 2f42 4eb2 a3a9 c58143e835f9: Angular frequency divided by angular wavenumber.

Speed
type: Class
subclass of: Restriction
comment: Length per unit time.
comment: Speed in the absolute value of the velocity.
EMMO 1f1b164d ec6a 4faa 8d5e 88bda62316cc: http://qudt.org/vocab/quantitykind/Speed
EMMO 8de5d5bf db1c 40ac b698 095ba3b18578: 3-8.2
EMMO 967080e5 2f42 4eb2 a3a9 c58143e835f9: Length per unit time.
EMMO c7b62dd7 063a 4c2a 8504 42f7264ba83f: Speed in the absolute value of the velocity.
EMMO fe015383 afb3 44a6 ae86 043628697aa2: https://doi.org/10.1351/goldbook.S05852

KilogramSquareMetre
type: Class
subclass of: Restriction
  has value: 1.0
subclass of: Restriction
  has value: 0.0
comment: "Kilogram Square Meter" is a unit for 'Moment Of Inertia' expressed as kg-m². -- QUDT
alternative label: Kilogram Square Metre
EMMO 1f1b164d ec6a 4faa 8d5e 88bda62316cc: http://qudt.org/vocab/unit/KiloGM-M2
EMMO 33ae2d07 5526 4555 a0b4 8f4c031b5652: kg.m2
EMMO 7f1dec83 d85e 4e1b b7bd c9442d4f5a64: kg⋅m²
EMMO 967080e5 2f42 4eb2 a3a9 c58143e835f9: "Kilogram Square Meter" is a unit for 'Moment Of Inertia' expressed as kg-m². -- QUDT

QualityFactor
type: Class
comment: Dimensionless quantity in electromagnetism.
EMMO 1f1b164d ec6a 4faa 8d5e 88bda62316cc: https://qudt.org/vocab/quantitykind/QualityFactor
EMMO 26bf1bef d192 4da6 b0eb d2209698fb54: https://www.wikidata.org/wiki/Q79467569
EMMO 50c298c2 55a2 4068 b3ac 4e948c33181f: https://www.electropedia.org/iev/iev.nsf/display
EMMO 8de5d5bf db1c 40ac b698 095ba3b18578: 6-53
EMMO 967080e5 2f42 4eb2 a3a9 c58143e835f9: Dimensionless quantity in electromagnetism.

FundamentalReciprocalLatticeVector
type: Class
subclass of: Restriction
comment: Fundamental translation vectors for the reciprocal lattice.
EMMO 1f1b164d ec6a 4faa 8d5e 88bda62316cc: https://qudt.org/vocab/quantitykind/FundamentalReciprocalLatticeVector
EMMO 26bf1bef d192 4da6 b0eb d2209698fb54: https://www.wikidata.org/wiki/Q105475399
EMMO 8de5d5bf db1c 40ac b698 095ba3b18578: 12-2.2
EMMO 967080e5 2f42 4eb2 a3a9 c58143e835f9: Fundamental translation vectors for the reciprocal lattice.

Neper
type: Class
subclass of: Restriction
  has value: 1.0
subclass of: Restriction
  has value: 0.0
subclass of: Restriction
  has value: Np
comment: The neper is a logarithmic unit for ratios of measurements of physical field and power quantities, such as gain and loss of electronic signals. It has the unit symbol Np. The unit's name is derived from the name of John Napier, the inventor of logarithms. As is the case for the decibel and bel, the neper is not a unit in the International System of Units (SI), but it is accepted for use alongside the SI. Like the decibel, the neper is a unit in a logarithmic scale. While the bel uses the decadic (base-10) logarithm to compute ratios, the neper uses the natural logarithm, based on Euler's number -- QUDT
comment: Unit of measurement for quantities of type level or level difference, which are defined as the natural logarithm of the ratio of power- or field-type quantities. The value of a ratio in nepers is given by `ln(x1/x2)` where `x1` and `x2` are the values of interest (amplitudes), and ln is the natural logarithm. When the values are quadratic in the amplitude (e.g. power), they are first linearised by taking the square root before the logarithm is taken, or equivalently the result is halved. Wikipedia
EMMO 0b1cbe60 d380 4787 b92e be26bdacf2c2: C50
EMMO 1f1b164d ec6a 4faa 8d5e 88bda62316cc: http://qudt.org/vocab/unit/NP
EMMO 33ae2d07 5526 4555 a0b4 8f4c031b5652: Np
EMMO 6dd685dd 1895 46e4 b227 be9f7d643c25: http://dbpedia.org/page/Neper
EMMO 70fe84ff 99b6 4206 a9fc 9a8931836d84: Unit of measurement for quantities of type level or level difference, which are defined as the natural logarithm of the ratio of power- or field-type quantities. The value of a ratio in nepers is given by `ln(x1/x2)` where `x1` and `x2` are the values of interest (amplitudes), and ln is the natural logarithm. When the values are quadratic in the amplitude (e.g. power), they are first linearised by taking the square root before the logarithm is taken, or equivalently the result is halved. Wikipedia
EMMO 967080e5 2f42 4eb2 a3a9 c58143e835f9: The neper is a logarithmic unit for ratios of measurements of physical field and power quantities, such as gain and loss of electronic signals. It has the unit symbol Np. The unit's name is derived from the name of John Napier, the inventor of logarithms. As is the case for the decibel and bel, the neper is not a unit in the International System of Units (SI), but it is accepted for use alongside the SI. Like the decibel, the neper is a unit in a logarithmic scale. While the bel uses the decadic (base-10) logarithm to compute ratios, the neper uses the natural logarithm, based on Euler's number -- QUDT
EMMO c84c6752 6d64 48cc 9500 e54a3c34898d: https://en.wikipedia.org/wiki/Neper
EMMO fe015383 afb3 44a6 ae86 043628697aa2: https://doi.org/10.1351/goldbook.N04106

XenonAtom
type: Class
subclass of: Restriction
subclass of: Restriction
  has value: 131.293
subclass of: Restriction
  has value: 54
comment: Atom subclass for xenon.
EMMO 967080e5 2f42 4eb2 a3a9 c58143e835f9: Atom subclass for xenon.

PerNanoMetre
type: Class
subclass of: Restriction
  has value: 1000000000.0
subclass of: Restriction
  has value: 0.0
comment: Per Nanometer Unit is a denominator unit with dimensions /nm. -- QUDT
alternative label: ReciprocalNanoMetre
EMMO 1f1b164d ec6a 4faa 8d5e 88bda62316cc: http://qudt.org/vocab/unit/PER-NanoM
EMMO 33ae2d07 5526 4555 a0b4 8f4c031b5652: /nm
EMMO 33ae2d07 5526 4555 a0b4 8f4c031b5652: nm-1
EMMO 7f1dec83 d85e 4e1b b7bd c9442d4f5a64: /nm
EMMO 967080e5 2f42 4eb2 a3a9 c58143e835f9: Per Nanometer Unit is a denominator unit with dimensions /nm. -- QUDT

FemtoMetre
type: Class
subclass of: Restriction
  some values from: Metre
subclass of: Restriction
  has value: 1e-15
subclass of: Restriction
  has value: 0.0
comment: The `femtometre` is an SI unit of length equal to 10⁻¹⁵ meter. This distance can also be called `fermi` and was so named in honour of Enrico Fermi. It is often encountered in nuclear physics as a characteristic of this scale. The symbol for the fermi is also fm. -- QUDT
EMMO 1f1b164d ec6a 4faa 8d5e 88bda62316cc: http://qudt.org/vocab/unit/FemtoM
EMMO 33ae2d07 5526 4555 a0b4 8f4c031b5652: fm
EMMO 7f1dec83 d85e 4e1b b7bd c9442d4f5a64: fm
EMMO 967080e5 2f42 4eb2 a3a9 c58143e835f9: The `femtometre` is an SI unit of length equal to 10⁻¹⁵ meter. This distance can also be called `fermi` and was so named in honour of Enrico Fermi. It is often encountered in nuclear physics as a characteristic of this scale. The symbol for the fermi is also fm. -- QUDT

KelvinMetre
type: Class
subclass of: Restriction
  has value: 1.0
subclass of: Restriction
  has value: 0.0
comment: Kelvin metre.
EMMO 1f1b164d ec6a 4faa 8d5e 88bda62316cc: http://qudt.org/vocab/unit/K-M
EMMO 33ae2d07 5526 4555 a0b4 8f4c031b5652: K.m
EMMO 7f1dec83 d85e 4e1b b7bd c9442d4f5a64: K⋅m
EMMO 967080e5 2f42 4eb2 a3a9 c58143e835f9: Kelvin metre.

LengthTemperatureUnit
type: Class
subclass of: Restriction
  has value: T0 L+1 M0 I0 Θ+1 N0 J0
comment: The class of units with dimensionality 'LengthTemperature'.
EMMO 967080e5 2f42 4eb2 a3a9 c58143e835f9: The class of units with dimensionality 'LengthTemperature'.

Time
type: Class
subclass of: Restriction
comment: One-dimensional subspace of space-time, which is locally orthogonal to space.
comment: The indefinite continued progress of existence and events that occur in apparently irreversible succession from the past through the present to the future.
comment: Time can be seen as the duration of an event or, more operationally, as "what clocks read".
EMMO 1f1b164d ec6a 4faa 8d5e 88bda62316cc: http://qudt.org/vocab/quantitykind/Time
EMMO 70fe84ff 99b6 4206 a9fc 9a8931836d84: One-dimensional subspace of space-time, which is locally orthogonal to space.
EMMO 8de5d5bf db1c 40ac b698 095ba3b18578: 3-7
EMMO 967080e5 2f42 4eb2 a3a9 c58143e835f9: The indefinite continued progress of existence and events that occur in apparently irreversible succession from the past through the present to the future.
EMMO fe015383 afb3 44a6 ae86 043628697aa2: https://doi.org/10.1351/goldbook.T06375

GigaHertzMetre
type: Class
subclass of: Restriction
  some values from: HertzMetre
subclass of: Restriction
  has value: 1000000000.0
subclass of: Restriction
  has value: 0.0
comment: product of the 1 000 000 000-fold of the SI derived unit hertz and the SI base unit metre -- QUDT
alternative label: Gigahertz Metre
EMMO 1f1b164d ec6a 4faa 8d5e 88bda62316cc: http://qudt.org/vocab/unit/GigaHZ-M
EMMO 33ae2d07 5526 4555 a0b4 8f4c031b5652: GHz.m
EMMO 7f1dec83 d85e 4e1b b7bd c9442d4f5a64: GHz⋅M
EMMO 967080e5 2f42 4eb2 a3a9 c58143e835f9: product of the 1 000 000 000-fold of the SI derived unit hertz and the SI base unit metre -- QUDT

Interpreter
type: Class
subclass of: Restriction
comment: The entity (or agent, or observer, or cognitive entity) who connects 'Sign', 'Interpretant' and 'Object'.
comment: The interpreter is not the ontologist, being the ontologist acting outside the ontology at the meta-ontology level. On the contrary, the interpreter is an agent recognized by the ontologist. The semiotic branch of the EMMO is the tool used by the ontologist to represent an interpreter's semiotic activity.
example: For example, the ontologist may be interest in cataloguing in the EMMO how the same object (e.g. a cat) is addressed using different signs (e.g. cat, gatto, chat) by different interpreters (e.g. english, italian or french people). The same applies for the results of measurements: the ontologist may be interest to represent in the EMMO how different measurement processes (i.e. semiosis) lead to different quantitative results (i.e. signs) according to different measurement devices (i.e. interpreters).
EMMO 8a137e9f 579c 4e28 baca e8980eb0c3db: EquivalentTo. Cogniser or Declarer or Deducer
EMMO 967080e5 2f42 4eb2 a3a9 c58143e835f9: The entity (or agent, or observer, or cognitive entity) who connects 'Sign', 'Interpretant' and 'Object'.
EMMO c7b62dd7 063a 4c2a 8504 42f7264ba83f: The interpreter is not the ontologist, being the ontologist acting outside the ontology at the meta-ontology level. On the contrary, the interpreter is an agent recognized by the ontologist. The semiotic branch of the EMMO is the tool used by the ontologist to represent an interpreter's semiotic activity.

HalfLife
type: Class
comment: Mean duration required for the decay of one half of the atoms or nuclei.
EMMO 1f1b164d ec6a 4faa 8d5e 88bda62316cc: https://qudt.org/vocab/quantitykind/Half-Life
EMMO 26bf1bef d192 4da6 b0eb d2209698fb54: https://www.wikidata.org/wiki/Q98118544
EMMO 50c298c2 55a2 4068 b3ac 4e948c33181f: https://www.electropedia.org/iev/iev.nsf/display
EMMO 8de5d5bf db1c 40ac b698 095ba3b18578: 10-31
EMMO 967080e5 2f42 4eb2 a3a9 c58143e835f9: Mean duration required for the decay of one half of the atoms or nuclei.

DeciSiemensPerMetre
type: Class
subclass of: Restriction
  some values from: SiemensPerMetre
subclass of: Restriction
  has value: 0.1
subclass of: Restriction
  has value: 0.0
comment: Decisiemens per metre. -- QUDT
alternative label: decisiemens per metre
EMMO 1f1b164d ec6a 4faa 8d5e 88bda62316cc: http://qudt.org/vocab/unit/DeciS-PER-M
EMMO 33ae2d07 5526 4555 a0b4 8f4c031b5652: dS.m-1
EMMO 33ae2d07 5526 4555 a0b4 8f4c031b5652: dS/m
EMMO 7f1dec83 d85e 4e1b b7bd c9442d4f5a64: dS/m
EMMO 967080e5 2f42 4eb2 a3a9 c58143e835f9: Decisiemens per metre. -- QUDT

TennessineAtom
type: Class
subclass of: Restriction
subclass of: Restriction
  has value: 293.208
subclass of: Restriction
  has value: 117
comment: Atom subclass for tennessine.
EMMO 967080e5 2f42 4eb2 a3a9 c58143e835f9: Atom subclass for tennessine.

CubicCentiMetrePerCubicCentiMetre
type: Class
subclass of: Restriction
  has value: 1.0
subclass of: Restriction
  has value: 0.0
comment: volume ratio consisting of the 0.000 001-fold of the power of the SI base unit metre with the exponent 3 divided by the power of the SI base unit metre with the exponent 3 -- QUDT
alternative label: Cubic Centimetre Per Cubic Centimetre
EMMO 1f1b164d ec6a 4faa 8d5e 88bda62316cc: http://qudt.org/vocab/unit/CentiM3-PER-CentiM3
EMMO 33ae2d07 5526 4555 a0b4 8f4c031b5652: cm3.cm-3
EMMO 33ae2d07 5526 4555 a0b4 8f4c031b5652: cm3/cm3
EMMO 7f1dec83 d85e 4e1b b7bd c9442d4f5a64: cm³/cm³
EMMO 967080e5 2f42 4eb2 a3a9 c58143e835f9: volume ratio consisting of the 0.000 001-fold of the power of the SI base unit metre with the exponent 3 divided by the power of the SI base unit metre with the exponent 3 -- QUDT

VolumeFractionUnit
type: Class
comment: Unit for quantities of dimension one that are the fraction of two volumes.
example: Unit for volume fraction.
EMMO 967080e5 2f42 4eb2 a3a9 c58143e835f9: Unit for quantities of dimension one that are the fraction of two volumes.

PaperManufacturing
type: Class

FormingFromChip
type: Class

ResemblanceIcon
type: Class
comment: An icon that focus on WHERE/WHEN the object is, in the sense of spatial or temporal shape.
comment: An icon that mimics the spatial or temporal shape of the object.
example: A geographical map that imitates the shape of the landscape and its properties at a specific historical time.
EMMO 967080e5 2f42 4eb2 a3a9 c58143e835f9: An icon that mimics the spatial or temporal shape of the object.
EMMO c7b62dd7 063a 4c2a 8504 42f7264ba83f: An icon that focus on WHERE/WHEN the object is, in the sense of spatial or temporal shape.
EMMO c7b62dd7 063a 4c2a 8504 42f7264ba83f: The subclass of icon inspired by Peirceian category a) the image, which depends on a simple quality (e.g. picture).

IonAtom
type: Class
comment: A standalone atom with an unbalanced number of electrons with respect to its atomic number.
comment: The ion_atom is the basic part of a pure ionic bonded compound i.e. without eclectron sharing,
EMMO 967080e5 2f42 4eb2 a3a9 c58143e835f9: A standalone atom with an unbalanced number of electrons with respect to its atomic number.

StandaloneAtom
type: Class
disjoint union of:
  rest:
    rest: nil
comment: A standalone atom can be bonded with other atoms by intermolecular forces (i.e. dipole–dipole, London dispersion force, hydrogen bonding), since this bonds does not involve electron sharing.
comment: An atom that does not share electrons with other atoms.
EMMO 967080e5 2f42 4eb2 a3a9 c58143e835f9: An atom that does not share electrons with other atoms.

VolumeUnit
type: Class
subclass of: Restriction
  has value: T0 L+3 M0 I0 Θ0 N0 J0
comment: The class of units with dimensionality 'Volume'.
EMMO 967080e5 2f42 4eb2 a3a9 c58143e835f9: The class of units with dimensionality 'Volume'.

FrequencyPerAreaTimeUnit
type: Class
subclass of: Restriction
  has value: T-2 L-2 M0 I0 Θ0 N0 J0
comment: The class of units with dimensionality 'FrequencyPerAreaTime'.
EMMO 967080e5 2f42 4eb2 a3a9 c58143e835f9: The class of units with dimensionality 'FrequencyPerAreaTime'.

MicroBecquerel
type: Class
subclass of: Restriction
  has value: 1e-06
subclass of: Restriction
  has value: 0.0
comment: 0.000001-fold of the SI derived unit becquerel -- QUDT
EMMO 1f1b164d ec6a 4faa 8d5e 88bda62316cc: http://qudt.org/vocab/unit/MicroBQ
EMMO 33ae2d07 5526 4555 a0b4 8f4c031b5652: uBq
EMMO 7f1dec83 d85e 4e1b b7bd c9442d4f5a64: μBq
EMMO 967080e5 2f42 4eb2 a3a9 c58143e835f9: 0.000001-fold of the SI derived unit becquerel -- QUDT

SystemUnit
type: Class
comment: A unit that belongs to one or more unit systems.
EMMO 967080e5 2f42 4eb2 a3a9 c58143e835f9: A unit that belongs to one or more unit systems.

FluorineSymbol
type: Class
subclass of: Restriction
  has value: F
comment: The symbol that stands for the fluorine atom.
EMMO 967080e5 2f42 4eb2 a3a9 c58143e835f9: The symbol that stands for the fluorine atom.

VoltPerMilliMetre
type: Class
subclass of: Restriction
  has value: 1000.0
subclass of: Restriction
  has value: 0.0
comment: SI derived unit volt divided by the 0.001-fold of the SI base unit metre -- QUDT
alternative label: Volt Per Millimetre
EMMO 1f1b164d ec6a 4faa 8d5e 88bda62316cc: http://qudt.org/vocab/unit/V-PER-MilliM
EMMO 33ae2d07 5526 4555 a0b4 8f4c031b5652: V.mm-1
EMMO 7f1dec83 d85e 4e1b b7bd c9442d4f5a64: V/mm
EMMO 967080e5 2f42 4eb2 a3a9 c58143e835f9: SI derived unit volt divided by the 0.001-fold of the SI base unit metre -- QUDT

MeasurementResult
type: Class
subclass of: Restriction
comment: A measurement result generally contains “relevant information” about the set of measured quantity properties, such that some may be more representative of the measured quantity than others. This may be expressed in the form of a probability density function (pdf).
comment: Result of a measurement. A set of quantites being attributed to a measurand (measured quantitative property) together with any other available relevant information, like measurement uncertainty. -- VIM
EMMO 967080e5 2f42 4eb2 a3a9 c58143e835f9: Result of a measurement. A set of quantites being attributed to a measurand (measured quantitative property) together with any other available relevant information, like measurement uncertainty. -- VIM
EMMO bb49844b 45d7 4f0d 8cae 8e552cbc20d6: measurement result
EMMO c7b62dd7 063a 4c2a 8504 42f7264ba83f: A measurement result generally contains “relevant information” about the set of measured quantity properties, such that some may be more representative of the measured quantity than others. This may be expressed in the form of a probability density function (pdf).
EMMO c7b62dd7 063a 4c2a 8504 42f7264ba83f: A measurement result has the measured quantity, measurement uncertainty and other relevant attributes as holistic parts.

PerMetreSecond
type: Class
subclass of: Restriction
  has value: 1.0
subclass of: Restriction
  has value: 0.0
comment: Per metre and second.
alternative label: ReciprocalMetreSecond
EMMO 1f1b164d ec6a 4faa 8d5e 88bda62316cc: http://qudt.org/vocab/unit/PER-M-SEC
EMMO 33ae2d07 5526 4555 a0b4 8f4c031b5652: m-1.s-1
EMMO 7f1dec83 d85e 4e1b b7bd c9442d4f5a64: /(m⋅s)
EMMO 967080e5 2f42 4eb2 a3a9 c58143e835f9: Per metre and second.

PerLengthTimeUnit
type: Class
subclass of: Restriction
  has value: T-1 L-1 M0 I0 Θ0 N0 J0
comment: The class of units with dimensionality 'PerLengthTime'.
EMMO 967080e5 2f42 4eb2 a3a9 c58143e835f9: The class of units with dimensionality 'PerLengthTime'.

SolidLiquidSuspension
type: Class
comment: A coarse dispersion of liquid in a solid continuum phase.
EMMO 967080e5 2f42 4eb2 a3a9 c58143e835f9: A coarse dispersion of liquid in a solid continuum phase.

SolidMixture
type: Class
equivalent class: Class

Quantum
type: Class
comment: A quantum is the EMMO mereological atomistic and causal reductionistic entity. To avoid confusion with the concept of atom coming from physics and to underline the causal reductionistic approach, we will use the expression quantum mereology, instead of atomistic mereology.
comment: A quantum is the most fundamental item of the EMMO (both mereologically and causally) and is considered causally self-connected by definition. The quantum concept recalls the fact that there is lower epistemological limit to our knowledge of the universe, related to the uncertainity principle. In the EMMO, space and time emerge following the network of causal connections between quantum objects. So quantum objects are adimensional objects, that precede space and time dimensions: they are simple beings (in greek οντα). Using physics concepts, we can think the quantum as an elementary particle (e.g. an electron) in a specific state between two causal interactions. A quantum stands for an incoming or outcoming real particle in a Feynman diagram.
comment: Q(x) ≡ ¬∃y(PP(y,x))
comment: The class of the mereological and causal fundamental entities having no proper parts
alternative label: RealParticle
example: From a physics perspective a quantum can be related to smallest identifiable entities, according to the limits imposed by the uncertainty principle in space and time measurements. However, the quantum mereotopology approach is not restricted only to physics. For example, in a manpower management ontology, a quantum can stand for an hour (time) of a worker (space) activity.
EMMO 31252f35 c767 4b97 a877 1235076c3e13: A quantum is the most fundamental item of the EMMO (both mereologically and causally) and is considered causally self-connected by definition. The quantum concept recalls the fact that there is lower epistemological limit to our knowledge of the universe, related to the uncertainity principle. In the EMMO, space and time emerge following the network of causal connections between quantum objects. So quantum objects are adimensional objects, that precede space and time dimensions: they are simple beings (in greek οντα). Using physics concepts, we can think the quantum as an elementary particle (e.g. an electron) in a specific state between two causal interactions. A quantum stands for an incoming or outcoming real particle in a Feynman diagram.
EMMO 70fe84ff 99b6 4206 a9fc 9a8931836d84: Q(x) ≡ ¬∃y(PP(y,x))
EMMO 967080e5 2f42 4eb2 a3a9 c58143e835f9: The class of the mereological and causal fundamental entities having no proper parts
EMMO c7b62dd7 063a 4c2a 8504 42f7264ba83f: A quantum is the EMMO mereological atomistic and causal reductionistic entity. To avoid confusion with the concept of atom coming from physics and to underline the causal reductionistic approach, we will use the expression quantum mereology, instead of atomistic mereology.

ContinuousCasting
type: Class

HertzPerTesla
type: Class
subclass of: Restriction
  has value: 1.0
subclass of: Restriction
  has value: 0.0
comment: "Hertz per Tesla" is a unit for 'Electric Charge Per Mass' expressed as Hz T⁻¹. -- QUDT
alternative label: Hertz per Tesla
EMMO 1f1b164d ec6a 4faa 8d5e 88bda62316cc: http://qudt.org/vocab/unit/HZ-PER-T
EMMO 33ae2d07 5526 4555 a0b4 8f4c031b5652: Hz.T-1
EMMO 7f1dec83 d85e 4e1b b7bd c9442d4f5a64: Hz/T
EMMO 967080e5 2f42 4eb2 a3a9 c58143e835f9: "Hertz per Tesla" is a unit for 'Electric Charge Per Mass' expressed as Hz T⁻¹. -- QUDT

MagnesiumSymbol
type: Class
subclass of: Restriction
  has value: Mg
comment: The symbol that stands for the magnesium atom.
EMMO 967080e5 2f42 4eb2 a3a9 c58143e835f9: The symbol that stands for the magnesium atom.

Permeance
type: Class
subclass of: Restriction
comment: Inverse of the reluctance.
EMMO 1f1b164d ec6a 4faa 8d5e 88bda62316cc: https://qudt.org/vocab/quantitykind/Permeance
EMMO 26bf1bef d192 4da6 b0eb d2209698fb54: https://www.wikidata.org/wiki/Q77997985
EMMO 50c298c2 55a2 4068 b3ac 4e948c33181f: https://www.electropedia.org/iev/iev.nsf/display
EMMO 8de5d5bf db1c 40ac b698 095ba3b18578: 6-40
EMMO 967080e5 2f42 4eb2 a3a9 c58143e835f9: Inverse of the reluctance.

RoentgeniumAtom
type: Class
subclass of: Restriction
subclass of: Restriction
  has value: 281.166
subclass of: Restriction
  has value: 111
comment: Atom subclass for roentgenium.
EMMO 967080e5 2f42 4eb2 a3a9 c58143e835f9: Atom subclass for roentgenium.

MicroHenryPerMetre
type: Class
subclass of: Restriction
  has value: 1e-06
subclass of: Restriction
  has value: 0.0
comment: 0.000001-fold of the SI derived unit henry divided by the SI base unit metre -- QUDT
alternative label: Microhenry Per Metre
EMMO 1f1b164d ec6a 4faa 8d5e 88bda62316cc: http://qudt.org/vocab/unit/MicroH-PER-M
EMMO 33ae2d07 5526 4555 a0b4 8f4c031b5652: uH.m-1
EMMO 7f1dec83 d85e 4e1b b7bd c9442d4f5a64: μH/m
EMMO 967080e5 2f42 4eb2 a3a9 c58143e835f9: 0.000001-fold of the SI derived unit henry divided by the SI base unit metre -- QUDT

NobeliumAtom
type: Class
subclass of: Restriction
subclass of: Restriction
  has value: 259.101
subclass of: Restriction
  has value: 102
comment: Atom subclass for nobelium.
EMMO 967080e5 2f42 4eb2 a3a9 c58143e835f9: Atom subclass for nobelium.

ThoriumAtom
type: Class
subclass of: Restriction
subclass of: Restriction
  has value: 232.0377
subclass of: Restriction
  has value: 90
comment: Atom subclass for thorium.
EMMO 967080e5 2f42 4eb2 a3a9 c58143e835f9: Atom subclass for thorium.

GramPerGram
type: Class
subclass of: Restriction
  has value: 1.0
subclass of: Restriction
  has value: 0.0
comment: mass ratio consisting of the 0.001-fold of the SI base unit kilogram divided by the 0.001-fold of the SI base unit kilogram. -- QUDT
alternative label: Gram Per Gram
EMMO 1f1b164d ec6a 4faa 8d5e 88bda62316cc: http://qudt.org/vocab/unit/GM-PER-GM
EMMO 33ae2d07 5526 4555 a0b4 8f4c031b5652: g.g-1
EMMO 33ae2d07 5526 4555 a0b4 8f4c031b5652: g/g
EMMO 7f1dec83 d85e 4e1b b7bd c9442d4f5a64: g/g
EMMO 967080e5 2f42 4eb2 a3a9 c58143e835f9: mass ratio consisting of the 0.001-fold of the SI base unit kilogram divided by the 0.001-fold of the SI base unit kilogram. -- QUDT

KilogramPerCubicMetre
type: Class
subclass of: Restriction
  has value: 1.0
subclass of: Restriction
  has value: 0.0
comment: Kilogram per cubic metre is an SI derived unit of density, defined by mass in kilograms divided by volume in cubic metres. The official SI symbolic abbreviation is kg . m⁻³, or equivalently either kg/m³. -- QUDT
alternative label: Kilogram per Cubic Metre
EMMO 1f1b164d ec6a 4faa 8d5e 88bda62316cc: http://qudt.org/vocab/unit/KiloGM-PER-M3
EMMO 33ae2d07 5526 4555 a0b4 8f4c031b5652: kg.m-3
EMMO 33ae2d07 5526 4555 a0b4 8f4c031b5652: kg/m3
EMMO 7f1dec83 d85e 4e1b b7bd c9442d4f5a64: kg/m³
EMMO 967080e5 2f42 4eb2 a3a9 c58143e835f9: Kilogram per cubic metre is an SI derived unit of density, defined by mass in kilograms divided by volume in cubic metres. The official SI symbolic abbreviation is kg . m⁻³, or equivalently either kg/m³. -- QUDT

Joule
type: Class
subclass of: Restriction
  has value: J
comment: SI unit for energy.
comment: The SI unit of work or energy, defined to be the work done by a force of one newton acting to move an object through a distance of one meter in the direction in which the force is applied. Equivalently, since kinetic energy is one half the mass times the square of the velocity, one joule is the kinetic energy of a mass of two kilograms moving at a velocity of 1 m/s. -- QUDT
EMMO 0b1cbe60 d380 4787 b92e be26bdacf2c2: JOU
EMMO 1f1b164d ec6a 4faa 8d5e 88bda62316cc: http://qudt.org/vocab/unit/J
EMMO 33ae2d07 5526 4555 a0b4 8f4c031b5652: J
EMMO 6dd685dd 1895 46e4 b227 be9f7d643c25: http://dbpedia.org/resource/Joule
EMMO 967080e5 2f42 4eb2 a3a9 c58143e835f9: SI unit for energy.
EMMO c7b62dd7 063a 4c2a 8504 42f7264ba83f: The SI unit of work or energy, defined to be the work done by a force of one newton acting to move an object through a distance of one meter in the direction in which the force is applied. Equivalently, since kinetic energy is one half the mass times the square of the velocity, one joule is the kinetic energy of a mass of two kilograms moving at a velocity of 1 m/s. -- QUDT
EMMO c84c6752 6d64 48cc 9500 e54a3c34898d: http://en.wikipedia.org/wiki/Joule
EMMO fe015383 afb3 44a6 ae86 043628697aa2: https://doi.org/10.1351/goldbook.J03363

ActiniumAtom
type: Class
subclass of: Restriction
subclass of: Restriction
  has value: 227.02775
subclass of: Restriction
  has value: 89
comment: Atom subclass for actinium.
EMMO 967080e5 2f42 4eb2 a3a9 c58143e835f9: Atom subclass for actinium.

RefractiveIndex
type: Class
comment: Factor by which the phase velocity of light is reduced in a medium.
EMMO 1f1b164d ec6a 4faa 8d5e 88bda62316cc: http://qudt.org/vocab/quantitykind/RefractiveIndex
EMMO 967080e5 2f42 4eb2 a3a9 c58143e835f9: Factor by which the phase velocity of light is reduced in a medium.
EMMO fe015383 afb3 44a6 ae86 043628697aa2: https://doi.org/10.1351/goldbook.R05240

AvogadroConstant
type: Class
subclass of: Restriction
comment: The DBpedia definition (http://dbpedia.org/page/Avogadro_constant) is outdated as May 20, 2019. It is now an exact quantity.
comment: The number of constituent particles, usually atoms or molecules, that are contained in the amount of substance given by one mole. It defines the base unit mole in the SI system.
EMMO 1f1b164d ec6a 4faa 8d5e 88bda62316cc: http://qudt.org/vocab/constant/AvogadroConstant
EMMO 967080e5 2f42 4eb2 a3a9 c58143e835f9: The number of constituent particles, usually atoms or molecules, that are contained in the amount of substance given by one mole. It defines the base unit mole in the SI system.
EMMO fe015383 afb3 44a6 ae86 043628697aa2: https://doi.org/10.1351/goldbook.A00543

Point
type: Class
comment: A zero-manifold of only one point.
EMMO 967080e5 2f42 4eb2 a3a9 c58143e835f9: A zero-manifold of only one point.

ZeroManifold
type: Class
comment: A topological space with the property that each point has a neighborhood that is homeomorphic to an open subset of 0-dimensional Euclidean space.
alternative label: 0-manifold
EMMO 967080e5 2f42 4eb2 a3a9 c58143e835f9: A topological space with the property that each point has a neighborhood that is homeomorphic to an open subset of 0-dimensional Euclidean space.

Determination
type: Class
subclass of: Restriction
comment: A 'Semiosis' that involves an 'Observer' that perceives another 'Physical' (the 'Object') through a specific perception mechanism and produces a 'Property' (the 'Sign') that stands for the result of that particular perception according to a well defined conventional procedure.
alternative label: Characterisation
example: Assigning the word "red" as sign for an object provides an information to all other interpreters about the outcome of a specific observation procedure according to the determiner.
EMMO 8a137e9f 579c 4e28 baca e8980eb0c3db: EquivalentTo: Estimation or Observation
EMMO 967080e5 2f42 4eb2 a3a9 c58143e835f9: A 'Semiosis' that involves an 'Observer' that perceives another 'Physical' (the 'Object') through a specific perception mechanism and produces a 'Property' (the 'Sign') that stands for the result of that particular perception according to a well defined conventional procedure.

KilogramPerSquareSecond
type: Class
subclass of: Restriction
  has value: 1.0
subclass of: Restriction
  has value: 0.0
alternative label: Kilogram per Square Second
EMMO 1f1b164d ec6a 4faa 8d5e 88bda62316cc: http://qudt.org/vocab/unit/KiloGM-PER-SEC2
EMMO 33ae2d07 5526 4555 a0b4 8f4c031b5652: kg.s-2
EMMO 33ae2d07 5526 4555 a0b4 8f4c031b5652: kg/s2
EMMO 7f1dec83 d85e 4e1b b7bd c9442d4f5a64: kg/s²

MagneticReluctanceUnit
type: Class
subclass of: Restriction
  has value: T+2 L-2 M-1 I+2 Θ0 N0 J0
comment: The class of units with dimensionality 'MagneticReluctance'.
EMMO 967080e5 2f42 4eb2 a3a9 c58143e835f9: The class of units with dimensionality 'MagneticReluctance'.

ThermalResistance
type: Class
subclass of: Restriction
comment: The name “thermal resistance” and the symbol R are used in building technology to designate thermal insulance.
comment: Thermodynamic temperature difference divided by heat flow rate.
EMMO 1f1b164d ec6a 4faa 8d5e 88bda62316cc: https://qudt.org/vocab/quantitykind/ThermalResistance
EMMO 26bf1bef d192 4da6 b0eb d2209698fb54: https://www.wikidata.org/wiki/Q899628
EMMO 50c298c2 55a2 4068 b3ac 4e948c33181f: https://www.electropedia.org/iev/iev.nsf/display
EMMO 8de5d5bf db1c 40ac b698 095ba3b18578: 5-12
EMMO 967080e5 2f42 4eb2 a3a9 c58143e835f9: Thermodynamic temperature difference divided by heat flow rate.

NeutronYieldPerAbsorption
type: Class
comment: Average number of fission neutrons, both prompt and delayed, emitted per neutron absorbed in a fissionable nuclide or in a nuclear fuel, as specified.
EMMO 1f1b164d ec6a 4faa 8d5e 88bda62316cc: https://qudt.org/vocab/quantitykind/NeutronYieldPerAbsorption
EMMO 26bf1bef d192 4da6 b0eb d2209698fb54: https://www.wikidata.org/wiki/Q99159075
EMMO 8de5d5bf db1c 40ac b698 095ba3b18578: 10-74.2
EMMO 967080e5 2f42 4eb2 a3a9 c58143e835f9: Average number of fission neutrons, both prompt and delayed, emitted per neutron absorbed in a fissionable nuclide or in a nuclear fuel, as specified.

PureNumberQuantity
type: Class
comment: A pure number, typically the number of something.
comment: According to the SI brochure counting does not automatically qualify a quantity as an amount of substance. This quantity is used only to describe the outcome of a counting process, without regard of the type of entities. There are also some quantities that cannot be described in terms of the seven base quantities of the SI, but have the nature of a count. Examples are a number of molecules, a number of cellular or biomolecular entities (for example copies of a particular nucleic acid sequence), or degeneracy in quantum mechanics. Counting quantities are also quantities with the associated unit one.
example: 1, i, π, the number of protons in the nucleus of an atom
EMMO 967080e5 2f42 4eb2 a3a9 c58143e835f9: A pure number, typically the number of something.

RadianPerMetre
type: Class
subclass of: Restriction
  has value: 1.0
subclass of: Restriction
  has value: 0.0
comment: Radian per metre.
EMMO 1f1b164d ec6a 4faa 8d5e 88bda62316cc: http://qudt.org/vocab/unit/RAD-PER-M
EMMO 33ae2d07 5526 4555 a0b4 8f4c031b5652: rad.m-1
EMMO 7f1dec83 d85e 4e1b b7bd c9442d4f5a64: rad/m
EMMO 967080e5 2f42 4eb2 a3a9 c58143e835f9: Radian per metre.

IntData
type: Class
comment: A data representing 32-bit integer number.
EMMO 8a137e9f 579c 4e28 baca e8980eb0c3db: EquivalentTo: hasDataValue some xsd:int
EMMO 967080e5 2f42 4eb2 a3a9 c58143e835f9: A data representing 32-bit integer number.

SquareMetreQuarticHertz
type: Class
comment: Square metre and quartic Hertz.
EMMO 1f1b164d ec6a 4faa 8d5e 88bda62316cc: http://qudt.org/vocab/unit/M2-HZ4
EMMO 33ae2d07 5526 4555 a0b4 8f4c031b5652: m2.Hz4
EMMO 7f1dec83 d85e 4e1b b7bd c9442d4f5a64: m²⋅Hz⁴
EMMO 967080e5 2f42 4eb2 a3a9 c58143e835f9: Square metre and quartic Hertz.

DegreeCelsiusKilogramPerSquareMetre
type: Class
comment: Derived unit for the product of the temperature in degrees Celsius and the mass density of a medium, integrated over vertical depth or height in metres. -- QUDT
alternative label: Degrees Celsius kilogram per square metre
EMMO 1f1b164d ec6a 4faa 8d5e 88bda62316cc: http://qudt.org/vocab/unit/DEG_C-KiloGM-PER-M2
EMMO 33ae2d07 5526 4555 a0b4 8f4c031b5652: Cel.kg.m-2
EMMO 7f1dec83 d85e 4e1b b7bd c9442d4f5a64: °C⋅kg/m²
EMMO 967080e5 2f42 4eb2 a3a9 c58143e835f9: Derived unit for the product of the temperature in degrees Celsius and the mass density of a medium, integrated over vertical depth or height in metres. -- QUDT

TemperatureMassPerAreaUnit
type: Class
subclass of: Restriction
  has value: T0 L-2 M+1 I0 Θ+1 N0 J0
comment: The class of units with dimensionality 'TemperatureMassPerArea'.
EMMO 967080e5 2f42 4eb2 a3a9 c58143e835f9: The class of units with dimensionality 'TemperatureMassPerArea'.

PseudovectorMeson
type: Class
comment: A meson with total spin 1 and even parity.
EMMO 967080e5 2f42 4eb2 a3a9 c58143e835f9: A meson with total spin 1 and even parity.
EMMO c84c6752 6d64 48cc 9500 e54a3c34898d: https://en.wikipedia.org/wiki/Pseudovector_meson

SquareMetrePerJoule
type: Class
subclass of: Restriction
  has value: 1.0
subclass of: Restriction
  has value: 0.0
comment: Square metre per Joule.
EMMO 1f1b164d ec6a 4faa 8d5e 88bda62316cc: http://qudt.org/vocab/unit/M2-PER-J
EMMO 33ae2d07 5526 4555 a0b4 8f4c031b5652: m2.J-1
EMMO 7f1dec83 d85e 4e1b b7bd c9442d4f5a64: m²/j
EMMO 967080e5 2f42 4eb2 a3a9 c58143e835f9: Square metre per Joule.

SquareTimePerMassUnit
type: Class
subclass of: Restriction
  has value: T+2 L0 M-1 I0 Θ0 N0 J0
comment: The class of units with dimensionality 'SquareTimePerMass'.
EMMO 967080e5 2f42 4eb2 a3a9 c58143e835f9: The class of units with dimensionality 'SquareTimePerMass'.

KelvinMetrePerSecond
type: Class
subclass of: Restriction
  has value: 1.0
subclass of: Restriction
  has value: 0.0
comment: Kelvin metre per second.
EMMO 1f1b164d ec6a 4faa 8d5e 88bda62316cc: http://qudt.org/vocab/unit/K-M-PER-SEC
EMMO 33ae2d07 5526 4555 a0b4 8f4c031b5652: K.m.s-1
EMMO 7f1dec83 d85e 4e1b b7bd c9442d4f5a64: K⋅m/s
EMMO 967080e5 2f42 4eb2 a3a9 c58143e835f9: Kelvin metre per second.

TemperatureLengthPerTimeUnit
type: Class
subclass of: Restriction
  has value: T-1 L+1 M0 I0 Θ+1 N0 J0
comment: The class of units with dimensionality 'TemperatureLengthPerTime'.
EMMO 967080e5 2f42 4eb2 a3a9 c58143e835f9: The class of units with dimensionality 'TemperatureLengthPerTime'.

CadmiumSymbol
type: Class
subclass of: Restriction
  has value: Cd
comment: The symbol that stands for the cadmium atom.
EMMO 967080e5 2f42 4eb2 a3a9 c58143e835f9: The symbol that stands for the cadmium atom.

Sign
type: Class
subclass of: Restriction
comment: A 'Sign' can have temporal-direct-parts which are 'Sign' themselves. A 'Sign' usually havs 'sign' spatial direct parts only up to a certain elementary semiotic level, in which the part is only a 'Physical' and no more a 'Sign' (i.e. it stands for nothing). This elementary semiotic level is peculiar to each particular system of signs (e.g. text, painting). Just like an 'Elementary' in the 'Physical' branch, each 'Sign' branch should have an a-tomistic mereological part.
comment: An 'Physical' that is used as sign ("semeion" in greek) that stands for another 'Physical' through an semiotic process.
example: A novel is made of chapters, paragraphs, sentences, words and characters (in a direct parthood mereological hierarchy). Each of them are 'sign'-s. A character can be the a-tomistic 'sign' for the class of texts. The horizontal segment in the character "A" is direct part of "A" but it is not a 'sign' itself. For plain text we can propose the ASCII symbols, for math the fundamental math symbols.
EMMO 8a137e9f 579c 4e28 baca e8980eb0c3db: EquivalentTo: Index or Conventional or Icon
EMMO 967080e5 2f42 4eb2 a3a9 c58143e835f9: An 'Physical' that is used as sign ("semeion" in greek) that stands for another 'Physical' through an semiotic process.
EMMO c7b62dd7 063a 4c2a 8504 42f7264ba83f: A 'Sign' can have temporal-direct-parts which are 'Sign' themselves. A 'Sign' usually havs 'sign' spatial direct parts only up to a certain elementary semiotic level, in which the part is only a 'Physical' and no more a 'Sign' (i.e. it stands for nothing). This elementary semiotic level is peculiar to each particular system of signs (e.g. text, painting). Just like an 'Elementary' in the 'Physical' branch, each 'Sign' branch should have an a-tomistic mereological part.
EMMO c7b62dd7 063a 4c2a 8504 42f7264ba83f: According to Peirce, 'Sign' includes three subcategories: - symbols: that stand for an object through convention - indeces: that stand for an object due to causal continguity - icons: that stand for an object due to similitudes e.g. in shape or composition

MicroJoule
type: Class
subclass of: Restriction
  some values from: Joule
subclass of: Restriction
  has value: 1e-06
subclass of: Restriction
  has value: 0.0
comment: 0.000001-fold of the SI derived unit joule -- QUDT
alternative label: Micro Joule
EMMO 1f1b164d ec6a 4faa 8d5e 88bda62316cc: http://qudt.org/vocab/unit/MicroJ
EMMO 7f1dec83 d85e 4e1b b7bd c9442d4f5a64: µJ
EMMO 967080e5 2f42 4eb2 a3a9 c58143e835f9: 0.000001-fold of the SI derived unit joule -- QUDT

Velocity
type: Class
subclass of: Restriction
comment: The velocity depends on the choice of the reference frame. Proper transformation between frames must be used: Galilean for non-relativistic description, Lorentzian for relativistic description. -- IEC, note 2
comment: The velocity is related to a point described by its position vector. The point may localize a particle, or be attached to any other object such as a body or a wave. -- IEC, note 1
comment: Vector quantity giving the rate of change of a position vector. -- ISO 80000-3
EMMO 1f1b164d ec6a 4faa 8d5e 88bda62316cc: http://qudt.org/vocab/quantitykind/Velocity
EMMO 26bf1bef d192 4da6 b0eb d2209698fb54: https://www.wikidata.org/wiki/Q11465
EMMO 8de5d5bf db1c 40ac b698 095ba3b18578: 3-8.1
EMMO 8de5d5bf db1c 40ac b698 095ba3b18578: 3‑10.1
EMMO 967080e5 2f42 4eb2 a3a9 c58143e835f9: Vector quantity giving the rate of change of a position vector. -- ISO 80000-3

Vector
type: Class
subclass of: Restriction
comment: 1-dimensional array who's spatial direct parts are numbers.
alternative label: 1DArray
alternative label: LinearArray
EMMO 967080e5 2f42 4eb2 a3a9 c58143e835f9: 1-dimensional array who's spatial direct parts are numbers.

AmperePerGram
type: Class
subclass of: Restriction
  has value: 1000.0
subclass of: Restriction
  has value: 0.0
comment: `Ampere per gram` is a practical unit to describe an (applied) current relative to the involved amount of material. This unit is often found in electrochemistry to standardize test conditions and compare various scales of investigated materials. -- QUDT
alternative label: Ampere per Gram
EMMO 1f1b164d ec6a 4faa 8d5e 88bda62316cc: http://qudt.org/vocab/unit/A-PER-GM
EMMO 7f1dec83 d85e 4e1b b7bd c9442d4f5a64: A⋅/g
EMMO 967080e5 2f42 4eb2 a3a9 c58143e835f9: `Ampere per gram` is a practical unit to describe an (applied) current relative to the involved amount of material. This unit is often found in electrochemistry to standardize test conditions and compare various scales of investigated materials. -- QUDT

Admittance
type: Class
comment: Inverse of the impendance.
alternative label: ComplexAdmittance
EMMO 1f1b164d ec6a 4faa 8d5e 88bda62316cc: https://qudt.org/vocab/quantitykind/Admittance
EMMO 26bf1bef d192 4da6 b0eb d2209698fb54: https://www.wikidata.org/wiki/Q214518
EMMO 50c298c2 55a2 4068 b3ac 4e948c33181f: https://www.electropedia.org/iev/iev.nsf/display
EMMO 6dd685dd 1895 46e4 b227 be9f7d643c25: https://dbpedia.org/page/Admittance
EMMO 8de5d5bf db1c 40ac b698 095ba3b18578: 6-52.1
EMMO 967080e5 2f42 4eb2 a3a9 c58143e835f9: Inverse of the impendance.

ProtonMass
type: Class
comment: The rest mass of a proton.
EMMO 1f1b164d ec6a 4faa 8d5e 88bda62316cc: http://qudt.org/vocab/constant/ProtonMass
EMMO fe015383 afb3 44a6 ae86 043628697aa2: https://doi.org/10.1351/goldbook.P04914

AverageEnergyLossPerElementaryChargeProduced
type: Class
comment: Quotient of the initial kinetic energy Ek of an ionizing charged particle and the total ionization Ni produced by that particle.
EMMO 1f1b164d ec6a 4faa 8d5e 88bda62316cc: https://qudt.org/vocab/quantitykind/AverageEnergyLossPerElementaryChargeProduced
EMMO 26bf1bef d192 4da6 b0eb d2209698fb54: https://www.wikidata.org/wiki/Q98793042
EMMO 8de5d5bf db1c 40ac b698 095ba3b18578: 10-60
EMMO 967080e5 2f42 4eb2 a3a9 c58143e835f9: Quotient of the initial kinetic energy Ek of an ionizing charged particle and the total ionization Ni produced by that particle.

MetallicPowderSintering
type: Class

Screwing
type: Class
comment: Screwing (screwing on, screwing in, screwing tight) is joining by pressing on by means of a self-locking thread (from: DIN 8593 Part 3/09.85).
alternative label: Schrauben

Pressing
type: Class
comment: A collective term for the processes in which, during joining, the parts to be joined and any auxiliary parts are essentially only elastically deformed and unintentional loosening is prevented by frictional connection.
alternative label: Anpressen

SeleniumAtom
type: Class
subclass of: Restriction
subclass of: Restriction
  has value: 78.971
subclass of: Restriction
  has value: 34
comment: Atom subclass for selenium.
EMMO 967080e5 2f42 4eb2 a3a9 c58143e835f9: Atom subclass for selenium.

MassConcentrationOfWaterVapour
type: Class
comment: Quotient of the mass of water vapour in moist gas by the total gas volume.
comment: The mass concentration of water at saturation is denoted vsat.
EMMO 1f1b164d ec6a 4faa 8d5e 88bda62316cc: https://qudt.org/vocab/quantitykind/MassConcentrationOfWaterVapour
EMMO 26bf1bef d192 4da6 b0eb d2209698fb54: https://www.wikidata.org/wiki/Q76378808
EMMO 50c298c2 55a2 4068 b3ac 4e948c33181f: https://www.electropedia.org/iev/iev.nsf/display
EMMO 967080e5 2f42 4eb2 a3a9 c58143e835f9: Quotient of the mass of water vapour in moist gas by the total gas volume.

MassConcentration
type: Class
comment: Mass of a constituent divided by the volume of the mixture.
EMMO 1f1b164d ec6a 4faa 8d5e 88bda62316cc: http://qudt.org/vocab/quantitykind/MassConcentration
EMMO 967080e5 2f42 4eb2 a3a9 c58143e835f9: Mass of a constituent divided by the volume of the mixture.
EMMO fe015383 afb3 44a6 ae86 043628697aa2: https://doi.org/10.1351/goldbook.M03713

AngularWaveNumber
type: Class
comment: In condensed matter physics, quotient of momentum and the reduced Planck constant.
alternative label: AngularRepetency
EMMO 1f1b164d ec6a 4faa 8d5e 88bda62316cc: https://qudt.org/vocab/quantitykind/AngularWavenumber
EMMO 26bf1bef d192 4da6 b0eb d2209698fb54: https://www.wikidata.org/wiki/Q105542089
EMMO 8de5d5bf db1c 40ac b698 095ba3b18578: 12-9.1
EMMO 967080e5 2f42 4eb2 a3a9 c58143e835f9: In condensed matter physics, quotient of momentum and the reduced Planck constant.

Fraction
type: Class
subclass of: Restriction
  has value: 1.0
subclass of: Restriction
  has value: 0.0
comment: Fraction is a unit for 'Dimensionless Ratio' expressed as the value of the ratio itself. -- QUDT
EMMO 1f1b164d ec6a 4faa 8d5e 88bda62316cc: http://qudt.org/vocab/unit/FRACTION
EMMO 7f1dec83 d85e 4e1b b7bd c9442d4f5a64: ÷
EMMO 967080e5 2f42 4eb2 a3a9 c58143e835f9: Fraction is a unit for 'Dimensionless Ratio' expressed as the value of the ratio itself. -- QUDT

MicroNewtonMetre
type: Class
subclass of: Restriction
  has value: 1e-06
subclass of: Restriction
  has value: 0.0
comment: 0.000001-fold of the product out of the derived SI newton and the SI base unit metre -- QUDT
alternative label: Micronewton Metre
EMMO 1f1b164d ec6a 4faa 8d5e 88bda62316cc: http://qudt.org/vocab/unit/MicroN-M
EMMO 33ae2d07 5526 4555 a0b4 8f4c031b5652: uN.m
EMMO 7f1dec83 d85e 4e1b b7bd c9442d4f5a64: μN⋅m
EMMO 967080e5 2f42 4eb2 a3a9 c58143e835f9: 0.000001-fold of the product out of the derived SI newton and the SI base unit metre -- QUDT

KilogramSquareSecond
type: Class
subclass of: Restriction
  has value: 1.0
subclass of: Restriction
  has value: 0.0
alternative label: Kilogram Square Second
EMMO 1f1b164d ec6a 4faa 8d5e 88bda62316cc: http://qudt.org/vocab/unit/KiloGM-SEC2
EMMO 33ae2d07 5526 4555 a0b4 8f4c031b5652: kg.s2
EMMO 7f1dec83 d85e 4e1b b7bd c9442d4f5a64: kg⋅s²

MassSquareTimeUnit
type: Class
subclass of: Restriction
  has value: T+2 L0 M+1 I0 Θ0 N0 J0
comment: The class of units with dimensionality 'MassSquareTime'.
EMMO 967080e5 2f42 4eb2 a3a9 c58143e835f9: The class of units with dimensionality 'MassSquareTime'.

IntrinsicCarrierDensity
type: Class
comment: Square root of the product of electron and hole density in a semiconductor.
EMMO 1f1b164d ec6a 4faa 8d5e 88bda62316cc: https://qudt.org/vocab/quantitykind/IntinsicCarrierDensity
EMMO 26bf1bef d192 4da6 b0eb d2209698fb54: https://www.wikidata.org/wiki/Q1303188
EMMO 8de5d5bf db1c 40ac b698 095ba3b18578: 12-29.3
EMMO 967080e5 2f42 4eb2 a3a9 c58143e835f9: Square root of the product of electron and hole density in a semiconductor.

ConcreteOrPlasterPouring
type: Class

FormingFromPulp
type: Class

DubniumAtom
type: Class
subclass of: Restriction
subclass of: Restriction
  has value: 268.126
subclass of: Restriction
  has value: 105
comment: Atom subclass for dubnium.
EMMO 967080e5 2f42 4eb2 a3a9 c58143e835f9: Atom subclass for dubnium.

MilliPascalSecond
type: Class
subclass of: Restriction
  some values from: PascalSecond
subclass of: Restriction
  has value: 0.001
subclass of: Restriction
  has value: 0.0
comment: 0.001-fold of the product of the SI derived unit pascal and the SI base unit second -- QUDT
alternative label: Millipascal Second
EMMO 1f1b164d ec6a 4faa 8d5e 88bda62316cc: http://qudt.org/vocab/unit/MilliPA-SEC
EMMO 33ae2d07 5526 4555 a0b4 8f4c031b5652: mPa.s
EMMO 7f1dec83 d85e 4e1b b7bd c9442d4f5a64: mPa⋅s
EMMO 967080e5 2f42 4eb2 a3a9 c58143e835f9: 0.001-fold of the product of the SI derived unit pascal and the SI base unit second -- QUDT

MassPerLengthTimeUnit
type: Class
subclass of: Restriction
  has value: T-1 L-1 M+1 I0 Θ0 N0 J0
comment: The class of units with dimensionality 'MassPerLengthTime'.
EMMO 967080e5 2f42 4eb2 a3a9 c58143e835f9: The class of units with dimensionality 'MassPerLengthTime'.

SIPrefix
type: Class
disjoint union of:
  rest:
    rest: nil
comment: Metric prefix defined in the SI system.
EMMO 967080e5 2f42 4eb2 a3a9 c58143e835f9: Metric prefix defined in the SI system.

MetricPrefix
type: Class
comment: Dimensionless multiplicative unit prefix.
EMMO 967080e5 2f42 4eb2 a3a9 c58143e835f9: Dimensionless multiplicative unit prefix.

DoubleData
type: Class
comment: A symbolic data representing a 64-bit floating point numbers incl. ±Inf, ±0, NaN.
EMMO 8a137e9f 579c 4e28 baca e8980eb0c3db: EquivalentTo: hasDataValue some xsd:double
EMMO 967080e5 2f42 4eb2 a3a9 c58143e835f9: A symbolic data representing a 64-bit floating point numbers incl. ±Inf, ±0, NaN.

MicroSiemensPerMetre
type: Class
subclass of: Restriction
  has value: 1e-06
subclass of: Restriction
  has value: 0.0
comment: 0.000001-fold of the SI derived unit Siemens divided by the SI base unit metre -- QUDT
alternative label: Microsiemens Per Metre
EMMO 1f1b164d ec6a 4faa 8d5e 88bda62316cc: http://qudt.org/vocab/unit/MicroS-PER-M
EMMO 33ae2d07 5526 4555 a0b4 8f4c031b5652: uS.m-1
EMMO 7f1dec83 d85e 4e1b b7bd c9442d4f5a64: μS/m
EMMO 967080e5 2f42 4eb2 a3a9 c58143e835f9: 0.000001-fold of the SI derived unit Siemens divided by the SI base unit metre -- QUDT

CausalSystem
type: Class
comment: A causal system provides the most general concept of system, being a union of causal structures interacting together. In its most simple form, a causal system is an interlacement of causal paths (the most simple structure type). A causal system is always a spatial-like structure, and is represented as a multiple topologically orderable direct acyclic graph, with quanta as nodes and causality relations as edges.
comment: The class of individuals representing a causal system.
example: A electron binded by a nucleus.
EMMO 31252f35 c767 4b97 a877 1235076c3e13: A causal system provides the most general concept of system, being a union of causal structures interacting together. In its most simple form, a causal system is an interlacement of causal paths (the most simple structure type). A causal system is always a spatial-like structure, and is represented as a multiple topologically orderable direct acyclic graph, with quanta as nodes and causality relations as edges.
EMMO 8a137e9f 579c 4e28 baca e8980eb0c3db: DisjointUnionOf: FundamentalPhysicalSystem, GenericPhysicalSystem
EMMO 967080e5 2f42 4eb2 a3a9 c58143e835f9: The class of individuals representing a causal system.

Data
type: Class
comment: A causal object whose properties variation are encoded by an agent and that can be decoded by another agent according to a specific rule.
comment: EncodedData is the class where inventions that don't actually exist would be placed. For example, the blueprint of a bridge is an encoded data. When the bridge will be built, than the blueprint will also be a semiotical entity. Another example is Superman, that exists only as a set of magazines, drawings, novels, movies, but not in the real world.
alternative label: EncodedContrast
alternative label: EncodedData
example: A Radio Morse Code transmission can be addressed by combination of perspectives. Physicalistic: the electromagnetic pulses can be defined as individual A (of type Field) and the strip of paper coming out a printer receiver can be defined as individual B (of type Matter). Data: both A and B are also DiscreteData class individuals. In particular they may belong to a MorseData class, subclass of DiscreteData. Perceptual: B is an individual belonging to the graphical entities expressing symbols. In particular is a formula under the MorseLanguage class, made of a combination of . and - symbols. Semiotics: A and B can be signs if they refers to something else (e.g. a report about a fact, names).
example: A signal through a cable. A sound wave. Words on a page. The pattern of excited states within a computer RAM.
EMMO 967080e5 2f42 4eb2 a3a9 c58143e835f9: A causal object whose properties variation are encoded by an agent and that can be decoded by another agent according to a specific rule.
EMMO c7b62dd7 063a 4c2a 8504 42f7264ba83f: EncodedData is the class where inventions that don't actually exist would be placed. For example, the blueprint of a bridge is an encoded data. When the bridge will be built, than the blueprint will also be a semiotical entity. Another example is Superman, that exists only as a set of magazines, drawings, novels, movies, but not in the real world.
EMMO c7b62dd7 063a 4c2a 8504 42f7264ba83f: Variations in data are generated by an agent (not necessarily human) and are intended to be decoded by the same or another agent using the same encoding rules. Data are always generated by an agent but not necessarily possess a semantic meaning, either because it's lost or unknown or because simply they possess none (e.g. a random generation of symbols). A data object may be used as the physical basis for a sign, under Semiotics perspective.
EMMO c7b62dd7 063a 4c2a 8504 42f7264ba83f: We call "decoding" the act of recognise the variation according to a particular rule and generate another equivalent schema (e.g. in the agent's cognitive apparatus, as another form of data). We call "interpreting" the act of providing semantic meaning to data, which is covered by the semiotic perspective.
EMMO c84c6752 6d64 48cc 9500 e54a3c34898d: https://no.wikipedia.org/wiki/Data

Contrast
type: Class
comment: A data is a causal object whose variations (non-uniformity) can be recognised and eventually interpreted. A data can be of different physical types (e.g., matter, wave, atomic excited states). How the variations are recognised and eventually decoded depends on the interpreting rules that characterise that type of data. Variations are pure physical variations and do not necessarily possess semantic meaning.
comment: A perspective in which entities are represented according to the variation of their properties.
see also: Luciano Floridi, "Information - A very Short Introduction", Oxford University Press., (2010) ISBN 978-0199551378
alternative label: Dedomena
alternative label: Pattern
EMMO 967080e5 2f42 4eb2 a3a9 c58143e835f9: A perspective in which entities are represented according to the variation of their properties.
EMMO c7b62dd7 063a 4c2a 8504 42f7264ba83f: A data is a causal object whose variations (non-uniformity) can be recognised and eventually interpreted. A data can be of different physical types (e.g., matter, wave, atomic excited states). How the variations are recognised and eventually decoded depends on the interpreting rules that characterise that type of data. Variations are pure physical variations and do not necessarily possess semantic meaning.
EMMO c7b62dd7 063a 4c2a 8504 42f7264ba83f: The covering axiom that defines the data class discriminates within all the possible causal objects between encoded or non encoded.

NonEncodedContrast
type: Class
comment: A non encoded contrast (e.g. a temperature variation) can be represented by data that describes (e.g. the string "today it's warmer than yesterday") or quantifies (e.g. Monday 28 °C, Tuesday 30 °C) it through a semiotic process.
comment: Contrast that occurs naturally without an encoding agent producing it.
alternative label: EnvironmentalData
example: A cloud in the sky. The radiative spectrum of a star.
EMMO 967080e5 2f42 4eb2 a3a9 c58143e835f9: Contrast that occurs naturally without an encoding agent producing it.
EMMO c7b62dd7 063a 4c2a 8504 42f7264ba83f: A non encoded contrast (e.g. a temperature variation) can be represented by data that describes (e.g. the string "today it's warmer than yesterday") or quantifies (e.g. Monday 28 °C, Tuesday 30 °C) it through a semiotic process.
EMMO c7b62dd7 063a 4c2a 8504 42f7264ba83f: This is a really broad class that gathers all physical phenomena in which a contrast occurs naturally, such as cloud patterns, tree rings, stains. It doesn't mean that such contrasts cannot be used to deduce something: in fact they can be seen as indexes (in semiotic sense) of a causally connected phenomena. Simply, there is no agent behind that contrast with the intention to transmit data.

CubicCentiMetrePerMole
type: Class
subclass of: Restriction
  has value: 1e-06
subclass of: Restriction
  has value: 0.0
comment: 0.000 001-fold of the power of the SI base unit metre with the exponent 3 divided by the SI base unit mol -- QUDT
alternative label: Cubic Centimetre Per Mole
EMMO 1f1b164d ec6a 4faa 8d5e 88bda62316cc: http://qudt.org/vocab/unit/CentiM3-PER-MOL
EMMO 33ae2d07 5526 4555 a0b4 8f4c031b5652: cm3.mol-1
EMMO 33ae2d07 5526 4555 a0b4 8f4c031b5652: cm3/mol
EMMO 7f1dec83 d85e 4e1b b7bd c9442d4f5a64: cm³/mol
EMMO 967080e5 2f42 4eb2 a3a9 c58143e835f9: 0.000 001-fold of the power of the SI base unit metre with the exponent 3 divided by the SI base unit mol -- QUDT

VolumePerAmountUnit
type: Class
subclass of: Restriction
  has value: T0 L+3 M0 I0 Θ0 N-1 J0
comment: The class of units with dimensionality 'VolumePerAmount'.
EMMO 967080e5 2f42 4eb2 a3a9 c58143e835f9: The class of units with dimensionality 'VolumePerAmount'.

Perspective
type: Class
comment: The class of causal objects that stand for world objects according to a specific representational perspective.
comment: This class is the practical implementation of the EMMO pluralistic approach for which the only objective categorization is provided by the Universe individual and all the Quantum individuals. Between these two extremes, there are several subjective ways to categorize real world objects, each one provide under a 'Perspective' subclass.
EMMO 967080e5 2f42 4eb2 a3a9 c58143e835f9: The class of causal objects that stand for world objects according to a specific representational perspective.
EMMO c7b62dd7 063a 4c2a 8504 42f7264ba83f: This class is the practical implementation of the EMMO pluralistic approach for which the only objective categorization is provided by the Universe individual and all the Quantum individuals. Between these two extremes, there are several subjective ways to categorize real world objects, each one provide under a 'Perspective' subclass.

TotalLinearStoppingPower
type: Class
subclass of: Restriction
comment: For charged particles of a given type and energy E0 the differential quotient of E with respect to x, where E is the mean energy lost by the charged particles in traversing a distance x in the given material.
alternative label: LinearStoppingPower
EMMO 1f1b164d ec6a 4faa 8d5e 88bda62316cc: https://qudt.org/vocab/quantitykind/TotalLinearStoppingPower
EMMO 26bf1bef d192 4da6 b0eb d2209698fb54: https://www.wikidata.org/wiki/Q908474
EMMO 50c298c2 55a2 4068 b3ac 4e948c33181f: https://www.electropedia.org/iev/iev.nsf/display
EMMO 8de5d5bf db1c 40ac b698 095ba3b18578: 10-54
EMMO 967080e5 2f42 4eb2 a3a9 c58143e835f9: For charged particles of a given type and energy E0 the differential quotient of E with respect to x, where E is the mean energy lost by the charged particles in traversing a distance x in the given material.
EMMO fe015383 afb3 44a6 ae86 043628697aa2: https://doi.org/10.1351/goldbook.S06035

AngularFrequency
type: Class
comment: Rate of change of the phase angle.
EMMO 1f1b164d ec6a 4faa 8d5e 88bda62316cc: https://qudt.org/vocab/quantitykind/AngularFrequency
EMMO 50c298c2 55a2 4068 b3ac 4e948c33181f: https://www.electropedia.org/iev/iev.nsf/display
EMMO 6dd685dd 1895 46e4 b227 be9f7d643c25: https://dbpedia.org/page/Angular_frequency
EMMO 8de5d5bf db1c 40ac b698 095ba3b18578: 3-18
EMMO 967080e5 2f42 4eb2 a3a9 c58143e835f9: Rate of change of the phase angle.
EMMO c84c6752 6d64 48cc 9500 e54a3c34898d: https://en.wikipedia.org/wiki/Angular_frequency
EMMO fe015383 afb3 44a6 ae86 043628697aa2: https://doi.org/10.1351/goldbook.A00352

PascalCubicMetrePerSecond
type: Class
subclass of: Restriction
  has value: 1.0
subclass of: Restriction
  has value: 0.0
comment: product out of the SI derived unit pascal and the power of the SI base unit metre with the exponent 3 divided by the SI base unit second -- QUDT
alternative label: Pascal Cubic Metre Per Second
EMMO 1f1b164d ec6a 4faa 8d5e 88bda62316cc: http://qudt.org/vocab/unit/PA-M3-PER-SEC
EMMO 33ae2d07 5526 4555 a0b4 8f4c031b5652: Pa.m3.s-1
EMMO 7f1dec83 d85e 4e1b b7bd c9442d4f5a64: Pa⋅m³/s
EMMO 967080e5 2f42 4eb2 a3a9 c58143e835f9: product out of the SI derived unit pascal and the power of the SI base unit metre with the exponent 3 divided by the SI base unit second -- QUDT

ZirconiumAtom
type: Class
subclass of: Restriction
subclass of: Restriction
  has value: 91.224
subclass of: Restriction
  has value: 40
comment: Atom subclass for zirconium.
EMMO 967080e5 2f42 4eb2 a3a9 c58143e835f9: Atom subclass for zirconium.

NewtonMetreSecond
type: Class
subclass of: Restriction
  has value: 1.0
subclass of: Restriction
  has value: 0.0
comment: The SI derived unit of angular momentum. -- QUDT
alternative label: Newton Metre Second
EMMO 1f1b164d ec6a 4faa 8d5e 88bda62316cc: http://qudt.org/vocab/unit/N-M-SEC
EMMO 33ae2d07 5526 4555 a0b4 8f4c031b5652: N.m.s
EMMO 7f1dec83 d85e 4e1b b7bd c9442d4f5a64: N⋅m⋅s
EMMO 967080e5 2f42 4eb2 a3a9 c58143e835f9: The SI derived unit of angular momentum. -- QUDT
EMMO c84c6752 6d64 48cc 9500 e54a3c34898d: http://en.wikipedia.org/wiki/SI_derived_unit

ShearForming
type: Class
comment: Forming of a solid body, whereby the plastic state is essentially brought about by shear stress.
alternative label: Schubumformen

ElectronVolt
type: Class
subclass of: Restriction
  has value: 1.602177e-19
subclass of: Restriction
  has value: eV
comment: An electron volt (eV) is the energy that an electron gains when it travels through a potential of one volt. You can imagine that the electron starts at the negative plate of a parallel plate capacitor and accelerates to the positive plate, which is at one volt higher potential. Numerically 1 eV approximates 1.6x10⁻¹⁹ joules, where 1 joule is 6.2x10¹⁸ eV. For example, it would take 6.2x10²⁰ eV/sec to light a 100 watt light bulb. -- QUDT
comment: The amount of energy gained (or lost) by the charge of a single electron moving across an electric potential difference of one volt.
EMMO 0b1cbe60 d380 4787 b92e be26bdacf2c2: A53
EMMO 1f1b164d ec6a 4faa 8d5e 88bda62316cc: http://qudt.org/vocab/unit/EV
EMMO 33ae2d07 5526 4555 a0b4 8f4c031b5652: eV
EMMO 6dd685dd 1895 46e4 b227 be9f7d643c25: http://dbpedia.org/page/Electronvolt
EMMO 70fe84ff 99b6 4206 a9fc 9a8931836d84: The amount of energy gained (or lost) by the charge of a single electron moving across an electric potential difference of one volt.
EMMO 967080e5 2f42 4eb2 a3a9 c58143e835f9: An electron volt (eV) is the energy that an electron gains when it travels through a potential of one volt. You can imagine that the electron starts at the negative plate of a parallel plate capacitor and accelerates to the positive plate, which is at one volt higher potential. Numerically 1 eV approximates 1.6x10⁻¹⁹ joules, where 1 joule is 6.2x10¹⁸ eV. For example, it would take 6.2x10²⁰ eV/sec to light a 100 watt light bulb. -- QUDT
EMMO c84c6752 6d64 48cc 9500 e54a3c34898d: http://en.wikipedia.org/wiki/Electron_volt
EMMO fe015383 afb3 44a6 ae86 043628697aa2: https://doi.org/10.1351/goldbook.E02014

CompositePhysicalObject
type: Class
comment: A composite physical object is made of bonded objects (i.e. characterised by their quantum states using a Schrodinger equation approach) that are connected together by elementary particles travelling between them. These elemenentary particles are real particles, describing the existance of a classical field (e.g. Coulomb potential between charged particles).
comment: The class of physical objects possessing a structure that is larger than a single composite particle, for which its bosonic or fermionic nature is undetermined.
EMMO 31252f35 c767 4b97 a877 1235076c3e13: A composite physical object is made of bonded objects (i.e. characterised by their quantum states using a Schrodinger equation approach) that are connected together by elementary particles travelling between them. These elemenentary particles are real particles, describing the existance of a classical field (e.g. Coulomb potential between charged particles).
EMMO 967080e5 2f42 4eb2 a3a9 c58143e835f9: The class of physical objects possessing a structure that is larger than a single composite particle, for which its bosonic or fermionic nature is undetermined.

PhysicalObjectByBond
type: Class

BondedObject
type: Class
comment: "... in the 'classical' picture ordinary matter is made of atoms, in which electrons are held in orbit around a nucleus of protons and neutrons by the electrical attraction of opposite charges. We can now give this model a more sophisticated formulation by attributing the binding force to the exchange of photons between the electrons and the protons in the nucleus. However, for the purposes of atomic physics this is overkill, for in this context quantization of the electromagnetic field produces only minute effects (notably the Lamb shift and the anomalous magnetic moment of the electron). To excellent approximation we can pretend that the forces are given by Coulomb's law (together with various magnetic dipole couplings). The point is that in a bound state enormous numbers of photons are continually streaming back and forth, so that the "lumpiness" of the field is effectively smoothed out, and classical electrodynamics is a suitable approximation to the truth. But in most elementary particle processes, such as the photoelectric effect or Compton scattering, individual photons are involved, and quantization can no longer be ignored." D. Griffiths, "Introduction to elementary Particles", Wiley-VCH, 2004, pp.16-17
comment: A bonded object is a sequence of fundamental interactions that can be described approximatively by Schrodinger formulation. A bonded object is typically characterised by having quantum states (e.g. electron states in an atom, energy levels of a molecule). Furthermore, a bonded object is made of elementary particles that travels from the beginning to the end of the entity (i.e. a bonded object doesn't change its components).
EMMO 31252f35 c767 4b97 a877 1235076c3e13: A bonded object is a sequence of fundamental interactions that can be described approximatively by Schrodinger formulation. A bonded object is typically characterised by having quantum states (e.g. electron states in an atom, energy levels of a molecule). Furthermore, a bonded object is made of elementary particles that travels from the beginning to the end of the entity (i.e. a bonded object doesn't change its components).
EMMO c7b62dd7 063a 4c2a 8504 42f7264ba83f: "... in the 'classical' picture ordinary matter is made of atoms, in which electrons are held in orbit around a nucleus of protons and neutrons by the electrical attraction of opposite charges. We can now give this model a more sophisticated formulation by attributing the binding force to the exchange of photons between the electrons and the protons in the nucleus. However, for the purposes of atomic physics this is overkill, for in this context quantization of the electromagnetic field produces only minute effects (notably the Lamb shift and the anomalous magnetic moment of the electron). To excellent approximation we can pretend that the forces are given by Coulomb's law (together with various magnetic dipole couplings). The point is that in a bound state enormous numbers of photons are continually streaming back and forth, so that the "lumpiness" of the field is effectively smoothed out, and classical electrodynamics is a suitable approximation to the truth. But in most elementary particle processes, such as the photoelectric effect or Compton scattering, individual photons are involved, and quantization can no longer be ignored." D. Griffiths, "Introduction to elementary Particles", Wiley-VCH, 2004, pp.16-17

IUPACNomencalture
type: Class

BohrMagneton
type: Class
subclass of: Restriction
comment: Magnitude of the magnetic moment of an electron in a state with orbital angular momentum quantum number l=1 due to its orbital motion.
EMMO 26bf1bef d192 4da6 b0eb d2209698fb54: https://www.wikidata.org/wiki/Q737120
EMMO 8de5d5bf db1c 40ac b698 095ba3b18578: 10-9.2
EMMO 967080e5 2f42 4eb2 a3a9 c58143e835f9: Magnitude of the magnetic moment of an electron in a state with orbital angular momentum quantum number l=1 due to its orbital motion.

ThermalConductanceUnit
type: Class
subclass of: Restriction
  has value: T-3 L+2 M+1 I0 Θ-1 N0 J0
comment: The class of units with dimensionality 'ThermalConductance'.
EMMO 967080e5 2f42 4eb2 a3a9 c58143e835f9: The class of units with dimensionality 'ThermalConductance'.

Olfactory
type: Class

KiloOhm
type: Class
subclass of: Restriction
  some values from: Ohm
subclass of: Restriction
  has value: 1000.0
subclass of: Restriction
  has value: 0.0
comment: 1 000-fold of the SI derived unit ohm -- QUDT
EMMO 1f1b164d ec6a 4faa 8d5e 88bda62316cc: http://qudt.org/vocab/unit/KiloOHM
EMMO 33ae2d07 5526 4555 a0b4 8f4c031b5652: kOhm
EMMO 7f1dec83 d85e 4e1b b7bd c9442d4f5a64: kΩ
EMMO 967080e5 2f42 4eb2 a3a9 c58143e835f9: 1 000-fold of the SI derived unit ohm -- QUDT

ElectricResistanceUnit
type: Class
subclass of: Restriction
  has value: T-3 L+2 M+1 I-2 Θ0 N0 J0
comment: The class of units with dimensionality 'ElectricResistance'.
EMMO 967080e5 2f42 4eb2 a3a9 c58143e835f9: The class of units with dimensionality 'ElectricResistance'.

MegaHertzPerTesla
type: Class
subclass of: Restriction
  some values from: HertzPerTesla
subclass of: Restriction
  has value: 1000000.0
subclass of: Restriction
  has value: 0.0
comment: "Mega Hertz per Tesla" is a unit for 'Electric Charge Per Mass' expressed as MHz T⁻¹. -- QUDT
alternative label: Mega Hertz per Tesla
EMMO 1f1b164d ec6a 4faa 8d5e 88bda62316cc: http://qudt.org/vocab/unit/MegaHZ-PER-T
EMMO 33ae2d07 5526 4555 a0b4 8f4c031b5652: MHz.T-1
EMMO 7f1dec83 d85e 4e1b b7bd c9442d4f5a64: MHz/T
EMMO 967080e5 2f42 4eb2 a3a9 c58143e835f9: "Mega Hertz per Tesla" is a unit for 'Electric Charge Per Mass' expressed as MHz T⁻¹. -- QUDT

AngularMomentum
type: Class
subclass of: Restriction
comment: Measure of the extent and direction an object rotates about a reference point.
EMMO 1f1b164d ec6a 4faa 8d5e 88bda62316cc: http://qudt.org/vocab/quantitykind/AngularMomentum
EMMO 8de5d5bf db1c 40ac b698 095ba3b18578: 4-11
EMMO 967080e5 2f42 4eb2 a3a9 c58143e835f9: Measure of the extent and direction an object rotates about a reference point.
EMMO fe015383 afb3 44a6 ae86 043628697aa2: https://doi.org/10.1351/goldbook.A00353

Component
type: Class
comment: A constituent of a system.
EMMO 8a137e9f 579c 4e28 baca e8980eb0c3db: SubClassOf: inverse (hasConstituent) some HolisticSystem
EMMO 967080e5 2f42 4eb2 a3a9 c58143e835f9: A constituent of a system.

Constituent
type: Class
subclass of: Restriction
comment: An object which is an holistic spatial part of a object.
alternative label: ObjectPart
example: A tire is a constituent of a car.
EMMO 967080e5 2f42 4eb2 a3a9 c58143e835f9: An object which is an holistic spatial part of a object.

NewtonSecondPerCubicMetre
type: Class
subclass of: Restriction
  has value: 1.0
subclass of: Restriction
  has value: 0.0
comment: The SI unit of specific acoustic impedance. When sound waves pass through any physical substance the pressure of the waves causes the particles of the substance to move. The sound specific impedance is the ratio between the sound pressure and the particle velocity it produces. The specific impedance is 1 N · s · m⁻³ if unit pressure produces unit velocity. -- QUDT
alternative label: Newton second per Cubic Metre
EMMO 1f1b164d ec6a 4faa 8d5e 88bda62316cc: http://qudt.org/vocab/unit/N-SEC-PER-M3
EMMO 33ae2d07 5526 4555 a0b4 8f4c031b5652: N.s.m-3
EMMO 7f1dec83 d85e 4e1b b7bd c9442d4f5a64: N⋅s/m³
EMMO 967080e5 2f42 4eb2 a3a9 c58143e835f9: The SI unit of specific acoustic impedance. When sound waves pass through any physical substance the pressure of the waves causes the particles of the substance to move. The sound specific impedance is the ratio between the sound pressure and the particle velocity it produces. The specific impedance is 1 N · s · m⁻³ if unit pressure produces unit velocity. -- QUDT

MassFluxUnit
type: Class
subclass of: Restriction
  has value: T-1 L-2 M+1 I0 Θ0 N0 J0
comment: The class of units with dimensionality 'MassFlux'.
EMMO 967080e5 2f42 4eb2 a3a9 c58143e835f9: The class of units with dimensionality 'MassFlux'.

NumberOfEntities
type: Class
comment: Discrete quantity; number of entities of a given kind in a system.
EMMO 26bf1bef d192 4da6 b0eb d2209698fb54: https://www.wikidata.org/wiki/Q614112
EMMO 50c298c2 55a2 4068 b3ac 4e948c33181f: https://www.electropedia.org/iev/iev.nsf/display
EMMO 8de5d5bf db1c 40ac b698 095ba3b18578: 9-1
EMMO 967080e5 2f42 4eb2 a3a9 c58143e835f9: Discrete quantity; number of entities of a given kind in a system.
EMMO fe015383 afb3 44a6 ae86 043628697aa2: https://doi.org/10.1351/goldbook.N04266

UraniumSymbol
type: Class
subclass of: Restriction
  has value: U
comment: The symbol that stands for the uranium atom.
EMMO 967080e5 2f42 4eb2 a3a9 c58143e835f9: The symbol that stands for the uranium atom.

StrontiumAtom
type: Class
subclass of: Restriction
subclass of: Restriction
  has value: 87.62
subclass of: Restriction
  has value: 38
comment: Atom subclass for strontium.
EMMO 967080e5 2f42 4eb2 a3a9 c58143e835f9: Atom subclass for strontium.

PowerFactor
type: Class
comment: Under periodic conditions, ratio of the absolute value of the active power P to the apparent power S.
EMMO 1f1b164d ec6a 4faa 8d5e 88bda62316cc: https://qudt.org/vocab/quantitykind/PowerFactor
EMMO 26bf1bef d192 4da6 b0eb d2209698fb54: https://www.wikidata.org/wiki/Q750454
EMMO 50c298c2 55a2 4068 b3ac 4e948c33181f: https://www.electropedia.org/iev/iev.nsf/display
EMMO 8de5d5bf db1c 40ac b698 095ba3b18578: 6-58
EMMO 967080e5 2f42 4eb2 a3a9 c58143e835f9: Under periodic conditions, ratio of the absolute value of the active power P to the apparent power S.

ParticleFluence
type: Class
subclass of: Restriction
comment: Differential quotient of N with respect to a, where N is the number of particles incident on a sphere of cross-sectional area a.
EMMO 1f1b164d ec6a 4faa 8d5e 88bda62316cc: https://qudt.org/vocab/quantitykind/ParticleFluence
EMMO 26bf1bef d192 4da6 b0eb d2209698fb54: https://www.wikidata.org/wiki/Q82965908
EMMO 50c298c2 55a2 4068 b3ac 4e948c33181f: https://www.electropedia.org/iev/iev.nsf/display
EMMO 8de5d5bf db1c 40ac b698 095ba3b18578: 10-43
EMMO 967080e5 2f42 4eb2 a3a9 c58143e835f9: Differential quotient of N with respect to a, where N is the number of particles incident on a sphere of cross-sectional area a.

Painting
type: Class

CoatingManufacturing
type: Class
comment: A manufacturing in which an adherent layer of amorphous material is applied to a workpiece.
see also: DIN 8580:2020
alternative label: Beschichten @de
EMMO 967080e5 2f42 4eb2 a3a9 c58143e835f9: A manufacturing in which an adherent layer of amorphous material is applied to a workpiece.

PerSecondSteradian
type: Class
subclass of: Restriction
  has value: 1.0
subclass of: Restriction
  has value: 0.0
comment: Per Second Steradian Unit is a denominator unit with dimensions /sec-sr. -- QUDT
alternative label: ReciprocalSecondSteradian
EMMO 1f1b164d ec6a 4faa 8d5e 88bda62316cc: http://qudt.org/vocab/unit/PER-SEC-SR
EMMO 33ae2d07 5526 4555 a0b4 8f4c031b5652: /(s.sr)
EMMO 33ae2d07 5526 4555 a0b4 8f4c031b5652: s-1.sr-1
EMMO 7f1dec83 d85e 4e1b b7bd c9442d4f5a64: /s⋅sr
EMMO 967080e5 2f42 4eb2 a3a9 c58143e835f9: Per Second Steradian Unit is a denominator unit with dimensions /sec-sr. -- QUDT

AqueousSolution
type: Class
comment: A liquid solution in which the solvent is water.
EMMO 967080e5 2f42 4eb2 a3a9 c58143e835f9: A liquid solution in which the solvent is water.

LiquidSolution
type: Class
comment: A liquid solution made of two or more component substances.
EMMO 967080e5 2f42 4eb2 a3a9 c58143e835f9: A liquid solution made of two or more component substances.

SquareMetrePerSteradianJoule
type: Class
subclass of: Restriction
  has value: 1.0
subclass of: Restriction
  has value: 0.0
comment: Square metre per steradian and Joule.
EMMO 1f1b164d ec6a 4faa 8d5e 88bda62316cc: http://qudt.org/vocab/unit/M2-PER-SR-J
EMMO 33ae2d07 5526 4555 a0b4 8f4c031b5652: m2.sr-1.J-1
EMMO 7f1dec83 d85e 4e1b b7bd c9442d4f5a64: m²/(sr⋅J)
EMMO 967080e5 2f42 4eb2 a3a9 c58143e835f9: Square metre per steradian and Joule.

FaradPerMetre
type: Class
subclass of: Restriction
  has value: 1.0
subclass of: Restriction
  has value: 0.0
comment: Farad Per Meter (F/m) is a unit in the category of Electric permittivity. It is also known as farad/meter. This unit is commonly used in the SI unit system. Farad Per Meter has a dimension of M-1L-3T4I2 where M is mass, L is length, T is time, and I is electric current. This unit is the standard SI unit in this category. -- QUDT
alternative label: Farad per Metre
EMMO 1f1b164d ec6a 4faa 8d5e 88bda62316cc: http://qudt.org/vocab/unit/FARAD-PER-M
EMMO 33ae2d07 5526 4555 a0b4 8f4c031b5652: F.m-1
EMMO 33ae2d07 5526 4555 a0b4 8f4c031b5652: F/m
EMMO 7f1dec83 d85e 4e1b b7bd c9442d4f5a64: F/m
EMMO 967080e5 2f42 4eb2 a3a9 c58143e835f9: Farad Per Meter (F/m) is a unit in the category of Electric permittivity. It is also known as farad/meter. This unit is commonly used in the SI unit system. Farad Per Meter has a dimension of M-1L-3T4I2 where M is mass, L is length, T is time, and I is electric current. This unit is the standard SI unit in this category. -- QUDT

CubicMetrePerKelvin
type: Class
subclass of: Restriction
  has value: 1.0
subclass of: Restriction
  has value: 0.0
comment: Cubic metre per Kelvin.
EMMO 1f1b164d ec6a 4faa 8d5e 88bda62316cc: http://qudt.org/vocab/unit/M3-PER-K
EMMO 33ae2d07 5526 4555 a0b4 8f4c031b5652: m3.K-1
EMMO 7f1dec83 d85e 4e1b b7bd c9442d4f5a64: m³/K
EMMO 967080e5 2f42 4eb2 a3a9 c58143e835f9: Cubic metre per Kelvin.

VolumePerTemperatureUnit
type: Class
subclass of: Restriction
  has value: T0 L+3 M0 I0 Θ-1 N0 J0
comment: The class of units with dimensionality 'VolumePerTemperature'.
EMMO 967080e5 2f42 4eb2 a3a9 c58143e835f9: The class of units with dimensionality 'VolumePerTemperature'.

AreaDensity
type: Class
subclass of: Restriction
comment: Mass per unit area.
EMMO 1f1b164d ec6a 4faa 8d5e 88bda62316cc: http://qudt.org/vocab/quantitykind/SurfaceDensity
EMMO 967080e5 2f42 4eb2 a3a9 c58143e835f9: Mass per unit area.
EMMO fe015383 afb3 44a6 ae86 043628697aa2: https://doi.org/10.1351/goldbook.S06167

OrdinaryMatter
type: Class
comment: Matter composed of only matter particles, excluding anti-matter particles.
EMMO 967080e5 2f42 4eb2 a3a9 c58143e835f9: Matter composed of only matter particles, excluding anti-matter particles.

Substance
type: Class
comment: A composite physical object made of fermions (i.e. having mass and occupying space).
EMMO 8a137e9f 579c 4e28 baca e8980eb0c3db: Disjoint Union Of: MesoscopicSubstance, ContinuumSubstance
EMMO 967080e5 2f42 4eb2 a3a9 c58143e835f9: A composite physical object made of fermions (i.e. having mass and occupying space).

Variable
type: Class
comment: A variable is a symbolic object that stands for any other mathematical object, such as number, a vector, a matrix, a function, the argument of a function, a set, an element of a set.
example: x k
EMMO 967080e5 2f42 4eb2 a3a9 c58143e835f9: A variable is a symbolic object that stands for any other mathematical object, such as number, a vector, a matrix, a function, the argument of a function, a set, an element of a set.

ChemicalName
type: Class

MicroGramPerKilogram
type: Class
subclass of: Restriction
  has value: 1e-09
subclass of: Restriction
  has value: 0.0
comment: mass ratio as 0.000000001-fold of the SI base unit kilogram divided by the SI base unit kilogram -- QUDT
alternative label: Microgram Per Kilogram
EMMO 1f1b164d ec6a 4faa 8d5e 88bda62316cc: http://qudt.org/vocab/unit/MicroGM-PER-KiloGM
EMMO 33ae2d07 5526 4555 a0b4 8f4c031b5652: ug.kg-1
EMMO 33ae2d07 5526 4555 a0b4 8f4c031b5652: ug/kg
EMMO 7f1dec83 d85e 4e1b b7bd c9442d4f5a64: μg/kg
EMMO 967080e5 2f42 4eb2 a3a9 c58143e835f9: mass ratio as 0.000000001-fold of the SI base unit kilogram divided by the SI base unit kilogram -- QUDT

PhysicalQuantity
type: Class
subclass of: Restriction
comment: A 'Mathematical' entity that is made of a 'Numeral' and a 'MeasurementUnit' defined by a physical law, connected to a physical entity through a model perspective. Measurement is done according to the same model.
comment: In the same system of quantities, dim ρB = ML−3 is the quantity dimension of mass concentration of component B, and ML−3 is also the quantity dimension of mass density, ρ. ISO 80000-1
comment: Measured or simulated 'physical propertiy'-s are always defined by a physical law, connected to a physical entity through a model perspective and measurement is done according to the same model. Systems of units suggests that this is the correct approach, since except for the fundamental units (length, time, charge) every other unit is derived by mathematical relations between these fundamental units, implying a physical laws or definitions.
comment: Measurement units of quantities of the same quantity dimension may be designated by the same name and symbol even when the quantities are not of the same kind. For example, joule per kelvin and J/K are respectively the name and symbol of both a measurement unit of heat capacity and a measurement unit of entropy, which are generally not considered to be quantities of the same kind. However, in some cases special measurement unit names are restricted to be used with quantities of specific kind only. For example, the measurement unit ‘second to the power minus one’ (1/s) is called hertz (Hz) when used for frequencies and becquerel (Bq) when used for activities of radionuclides. As another example, the joule (J) is used as a unit of energy, but never as a unit of moment of force, i.e. the newton metre (N · m).
comment: — quantities of the same kind have the same quantity dimension, — quantities of different quantity dimensions are always of different kinds, and — quantities having the same quantity dimension are not necessarily of the same kind. ISO 80000-1
EMMO 8a137e9f 579c 4e28 baca e8980eb0c3db: DisjointUnionOf: DerivedQuantity, BaseQuantity
EMMO 967080e5 2f42 4eb2 a3a9 c58143e835f9: A 'Mathematical' entity that is made of a 'Numeral' and a 'MeasurementUnit' defined by a physical law, connected to a physical entity through a model perspective. Measurement is done according to the same model.

QuantityByPhysical
type: Class

Role
type: Class
subclass of: Restriction
comment: A role entity is categorized according to its relation with the whole, i.e. how it contribute to make a specific whole, and not as standalone entity. This class is expected to host the definition of world objects as they appear in its relation with the surrounding whole (being a part implies being surrounded by something bigger to which it contributes). For example. a human being is a stand alone type, but an instance of a human being can also be an instance of the type student (intended as a role) if it plays a part into a school environment (i.e., a student entity can exist only if it is part of a surrounding whole: the school). The role type requires that also the whole type depends on the existence of parts of a specific type (e.g., there is no school without students).
comment: An entity that is categorized according to its relation with a whole through a parthood relation and that contributes to it according to an holistic criterion, where the type of the whole is not the type of the part.
alternative label: HolisticPart
alternative label: Part
EMMO 31252f35 c767 4b97 a877 1235076c3e13: A role entity is categorized according to its relation with the whole, i.e. how it contribute to make a specific whole, and not as standalone entity. This class is expected to host the definition of world objects as they appear in its relation with the surrounding whole (being a part implies being surrounded by something bigger to which it contributes). For example. a human being is a stand alone type, but an instance of a human being can also be an instance of the type student (intended as a role) if it plays a part into a school environment (i.e., a student entity can exist only if it is part of a surrounding whole: the school). The role type requires that also the whole type depends on the existence of parts of a specific type (e.g., there is no school without students).
EMMO 967080e5 2f42 4eb2 a3a9 c58143e835f9: An entity that is categorized according to its relation with a whole through a parthood relation and that contributes to it according to an holistic criterion, where the type of the whole is not the type of the part.

Observed
type: Class
comment: A coded that has been observed by an interpreter.
example: The biography of a person met by the author.
EMMO 967080e5 2f42 4eb2 a3a9 c58143e835f9: A coded that has been observed by an interpreter.

CubicCentiMetrePerMoleSecond
type: Class
subclass of: Restriction
  has value: 1e-06
subclass of: Restriction
  has value: 0.0
comment: A unit that is the 0.000001-fold of the power of the SI base unit metre with the exponent 3 divided by the SI base unit mol multiplied by the SI base unit second. -- QUDT
alternative label: Cubic centimeter per mole second
EMMO 1f1b164d ec6a 4faa 8d5e 88bda62316cc: http://qudt.org/vocab/unit/CentiM3-PER-MOL-SEC
EMMO 7f1dec83 d85e 4e1b b7bd c9442d4f5a64: cm³/(mol⋅s)
EMMO 967080e5 2f42 4eb2 a3a9 c58143e835f9: A unit that is the 0.000001-fold of the power of the SI base unit metre with the exponent 3 divided by the SI base unit mol multiplied by the SI base unit second. -- QUDT

VolumePerAmountTimeUnit
type: Class
subclass of: Restriction
  has value: T-1 L+3 M0 I0 Θ0 N-1 J0
comment: The class of units with dimensionality 'VolumePerAmountTime'.
EMMO 967080e5 2f42 4eb2 a3a9 c58143e835f9: The class of units with dimensionality 'VolumePerAmountTime'.

Workflow
type: Class
subclass of: Restriction
comment: A procedure that has at least two procedures (tasks) as proper parts.
EMMO 967080e5 2f42 4eb2 a3a9 c58143e835f9: A procedure that has at least two procedures (tasks) as proper parts.

PhysicsEquation
type: Class
comment: An 'equation' that stands for a 'physical_law' by mathematically defining the relations between physics_quantities.
example: The Newton's equation of motion. The Schrödinger equation. The Navier-Stokes equation.
EMMO 967080e5 2f42 4eb2 a3a9 c58143e835f9: An 'equation' that stands for a 'physical_law' by mathematically defining the relations between physics_quantities.

RhodiumSymbol
type: Class
subclass of: Restriction
  has value: Rh
comment: The symbol that stands for the rhodium atom.
EMMO 967080e5 2f42 4eb2 a3a9 c58143e835f9: The symbol that stands for the rhodium atom.

Acceleration
type: Class
subclass of: Restriction
comment: Derivative of velocity with respect to time.
EMMO 1f1b164d ec6a 4faa 8d5e 88bda62316cc: http://qudt.org/vocab/quantitykind/Acceleration
EMMO 8de5d5bf db1c 40ac b698 095ba3b18578: 3-9.1
EMMO 967080e5 2f42 4eb2 a3a9 c58143e835f9: Derivative of velocity with respect to time.
EMMO fe015383 afb3 44a6 ae86 043628697aa2: https://doi.org/10.1351/goldbook.A00051

Activity
type: Class
comment: Number dN of spontaneous nuclear transitions or nuclear disintegrations for a radionuclide of amount N produced during a short time interval dt, divided by this time interval.
EMMO 1f1b164d ec6a 4faa 8d5e 88bda62316cc: https://qudt.org/vocab/quantitykind/Activity
EMMO 26bf1bef d192 4da6 b0eb d2209698fb54: https://www.wikidata.org/wiki/Q317949
EMMO 50c298c2 55a2 4068 b3ac 4e948c33181f: https://www.electropedia.org/iev/iev.nsf/display
EMMO 8de5d5bf db1c 40ac b698 095ba3b18578: 10-27
EMMO 967080e5 2f42 4eb2 a3a9 c58143e835f9: Number dN of spontaneous nuclear transitions or nuclear disintegrations for a radionuclide of amount N produced during a short time interval dt, divided by this time interval.
EMMO fe015383 afb3 44a6 ae86 043628697aa2: https://goldbook.iupac.org/terms/view/A00114

Rate
type: Class
subclass of: Restriction
comment: Quotient of a quantity by a duration.
example: Activity Specific absorption rate (SAR) Rate of rise Sampling rate Modulation rate Fading rate Rain rate
EMMO 50c298c2 55a2 4068 b3ac 4e948c33181f: 112-03-18
EMMO 967080e5 2f42 4eb2 a3a9 c58143e835f9: Quotient of a quantity by a duration.

Arcsecond
type: Class
subclass of: Restriction
  has value: 4.848137e-06
subclass of: Restriction
  has value: 0.0
subclass of: Restriction
  has value: ″
comment: "Arc Second" is a unit of angular measure, also called the `second of arc`, equal to 1/60 arcminute. One arcsecond is a very small angle: there are 1,296,000 in a circle. The SI recommends `double prime` ('') as the symbol for the arcsecond. The symbol has become common in astronomy, where very small angles are stated in milliarcseconds (mas). -- QUDT
alternative label: ArcSecond
alternative label: SecondOfArc
EMMO 0b1cbe60 d380 4787 b92e be26bdacf2c2: D62
EMMO 1f1b164d ec6a 4faa 8d5e 88bda62316cc: http://qudt.org/vocab/unit/ARCSEC
EMMO 33ae2d07 5526 4555 a0b4 8f4c031b5652: ''
EMMO 7f1dec83 d85e 4e1b b7bd c9442d4f5a64: \"
EMMO 967080e5 2f42 4eb2 a3a9 c58143e835f9: "Arc Second" is a unit of angular measure, also called the `second of arc`, equal to 1/60 arcminute. One arcsecond is a very small angle: there are 1,296,000 in a circle. The SI recommends `double prime` ('') as the symbol for the arcsecond. The symbol has become common in astronomy, where very small angles are stated in milliarcseconds (mas). -- QUDT
EMMO c84c6752 6d64 48cc 9500 e54a3c34898d: http://en.wikipedia.org/wiki/Minute_of_arc#Symbols.2C_abbreviations_and_subdivisions

VectorMeson
type: Class
comment: A meson with total spin 1 and odd parity.
EMMO 967080e5 2f42 4eb2 a3a9 c58143e835f9: A meson with total spin 1 and odd parity.
EMMO c84c6752 6d64 48cc 9500 e54a3c34898d: https://en.wikipedia.org/wiki/Vector_meson

GigaBecquerel
type: Class
subclass of: Restriction
  some values from: Becquerel
subclass of: Restriction
  has value: 1000000000.0
subclass of: Restriction
  has value: 0.0
comment: 1 000 000 000-fold of the derived SI unit becquerel -- QUDT
EMMO 1f1b164d ec6a 4faa 8d5e 88bda62316cc: http://qudt.org/vocab/unit/GigaBQ
EMMO 33ae2d07 5526 4555 a0b4 8f4c031b5652: GBq
EMMO 7f1dec83 d85e 4e1b b7bd c9442d4f5a64: GBq
EMMO 967080e5 2f42 4eb2 a3a9 c58143e835f9: 1 000 000 000-fold of the derived SI unit becquerel -- QUDT

EnergyFluenceRate
type: Class
subclass of: Restriction
comment: In nuclear physics, time derivative of the energy fluence.
EMMO 1f1b164d ec6a 4faa 8d5e 88bda62316cc: https://qudt.org/vocab/quantitykind/EnergyFluenceRate
EMMO 26bf1bef d192 4da6 b0eb d2209698fb54: https://www.wikidata.org/wiki/Q98538655
EMMO 8de5d5bf db1c 40ac b698 095ba3b18578: 10-47
EMMO 967080e5 2f42 4eb2 a3a9 c58143e835f9: In nuclear physics, time derivative of the energy fluence.

MagneticTension
type: Class
subclass of: Restriction
comment: Scalar quantity equal to the line integral of the magnetic field strength H along a specified path linking two points a and b.
EMMO 1f1b164d ec6a 4faa 8d5e 88bda62316cc: https://qudt.org/vocab/quantitykind/MagneticTension
EMMO 26bf1bef d192 4da6 b0eb d2209698fb54: https://www.wikidata.org/wiki/Q77993836
EMMO 50c298c2 55a2 4068 b3ac 4e948c33181f: https://www.electropedia.org/iev/iev.nsf/display
EMMO 8de5d5bf db1c 40ac b698 095ba3b18578: 6-37.2
EMMO 967080e5 2f42 4eb2 a3a9 c58143e835f9: Scalar quantity equal to the line integral of the magnetic field strength H along a specified path linking two points a and b.

SubjectiveProperty
type: Class
comment: A quantity whos value that cannot be univocally determined and depends on an agent (e.g. a human individual, a community).
example: The measure of beauty on a scale from 1 to 10.
EMMO 967080e5 2f42 4eb2 a3a9 c58143e835f9: A quantity whos value that cannot be univocally determined and depends on an agent (e.g. a human individual, a community).

Subjective
type: Class
comment: A coded conventional that cannot be univocally determined and depends on an agent (e.g. a human individual, a community) acting as black-box.
comment: The word subjective applies to property intrisically subjective or non-well defined. In general, when an black-box-like procedure is used for the definition of the property. This happens due to e.g. the complexity of the object, the lack of a underlying model for the representation of the object, the non-well specified meaning of the property symbols. A 'SubjectiveProperty' cannot be used to univocally compare 'Object'-s. e.g. you cannot evaluate the beauty of a person on objective basis.
example: The beauty of that girl. The style of your clothing.
EMMO 967080e5 2f42 4eb2 a3a9 c58143e835f9: A coded conventional that cannot be univocally determined and depends on an agent (e.g. a human individual, a community) acting as black-box.

EnergyDensityOfStates
type: Class
subclass of: Restriction
comment: Quantity in condensed matter physics.
EMMO 1f1b164d ec6a 4faa 8d5e 88bda62316cc: https://qudt.org/vocab/quantitykind/EnergyDensityOfStates
EMMO 26bf1bef d192 4da6 b0eb d2209698fb54: https://www.wikidata.org/wiki/Q105687031
EMMO 8de5d5bf db1c 40ac b698 095ba3b18578: 12-16
EMMO 967080e5 2f42 4eb2 a3a9 c58143e835f9: Quantity in condensed matter physics.

DensityOfVibrationalStates
type: Class
subclass of: Restriction
comment: quotient of the number of vibrational modes in an infinitesimal interval of angular frequency, and the product of the width of that interval and volume
EMMO 1f1b164d ec6a 4faa 8d5e 88bda62316cc: https://qudt.org/vocab/quantitykind/DensityOfStates
EMMO 26bf1bef d192 4da6 b0eb d2209698fb54: https://www.wikidata.org/wiki/Q105637294
EMMO 8de5d5bf db1c 40ac b698 095ba3b18578: 12-12
EMMO 967080e5 2f42 4eb2 a3a9 c58143e835f9: quotient of the number of vibrational modes in an infinitesimal interval of angular frequency, and the product of the width of that interval and volume

Attenuation
type: Class
comment: Decrease in magnitude of any kind of flux through a medium.
alternative label: Extinction
EMMO 8de5d5bf db1c 40ac b698 095ba3b18578: 3-26.1
EMMO 967080e5 2f42 4eb2 a3a9 c58143e835f9: Decrease in magnitude of any kind of flux through a medium.
EMMO c84c6752 6d64 48cc 9500 e54a3c34898d: https://en.wikipedia.org/wiki/Attenuation
EMMO fe015383 afb3 44a6 ae86 043628697aa2: https://doi.org/10.1351/goldbook.A00515

DegreeCelsiusCentiMetre
type: Class
comment: `Degree Celsius Centimeter` is a C.G.S System unit for 'Length Temperature' expressed as cm-degC. -- QUDT
alternative label: Degree Celsius Centimetre
EMMO 1f1b164d ec6a 4faa 8d5e 88bda62316cc: http://qudt.org/vocab/unit/DEG_C-CentiM
EMMO 33ae2d07 5526 4555 a0b4 8f4c031b5652: Cel.cm
EMMO 7f1dec83 d85e 4e1b b7bd c9442d4f5a64: °C⋅cm
EMMO 967080e5 2f42 4eb2 a3a9 c58143e835f9: `Degree Celsius Centimeter` is a C.G.S System unit for 'Length Temperature' expressed as cm-degC. -- QUDT

HeatFlowRate
type: Class
comment: Amount of heat through a surface during a time interval divided by the duration of this interval.
EMMO 1f1b164d ec6a 4faa 8d5e 88bda62316cc: https://qudt.org/vocab/quantitykind/HeatFlowRate
EMMO 26bf1bef d192 4da6 b0eb d2209698fb54: https://www.wikidata.org/wiki/Q12160631
EMMO 50c298c2 55a2 4068 b3ac 4e948c33181f: https://www.electropedia.org/iev/iev.nsf/display
EMMO 8de5d5bf db1c 40ac b698 095ba3b18578: 5-7
EMMO 967080e5 2f42 4eb2 a3a9 c58143e835f9: Amount of heat through a surface during a time interval divided by the duration of this interval.

Power
type: Class
subclass of: Restriction
comment: Rate of transfer of energy per unit time.
EMMO 1f1b164d ec6a 4faa 8d5e 88bda62316cc: http://qudt.org/vocab/quantitykind/Power
EMMO 8de5d5bf db1c 40ac b698 095ba3b18578: 4-27
EMMO 8de5d5bf db1c 40ac b698 095ba3b18578: 6-45
EMMO 967080e5 2f42 4eb2 a3a9 c58143e835f9: Rate of transfer of energy per unit time.
EMMO fe015383 afb3 44a6 ae86 043628697aa2: https://doi.org/10.1351/goldbook.P04792

DensityOfHeatFlowRate
type: Class
comment: At a fixed point in a medium, the direction of propagation of heat is opposite to the temperature gradient. At a point on the surface separating two media with different temperatures, the direction of propagation of heat is normal to the surface, from higher to lower temperatures.
comment: Vector quantity with magnitude equal to the heat flow rate dΦ through a surface element divided by the area dA of the element, and direction eφ in the direction of propagation of heat.
alternative label: AreicHeatFlowRate
EMMO 26bf1bef d192 4da6 b0eb d2209698fb54: https://www.wikidata.org/wiki/Q1478382
EMMO 50c298c2 55a2 4068 b3ac 4e948c33181f: https://www.electropedia.org/iev/iev.nsf/display
EMMO 8de5d5bf db1c 40ac b698 095ba3b18578: 5-8
EMMO 967080e5 2f42 4eb2 a3a9 c58143e835f9: Vector quantity with magnitude equal to the heat flow rate dΦ through a surface element divided by the area dA of the element, and direction eφ in the direction of propagation of heat.
EMMO fe015383 afb3 44a6 ae86 043628697aa2: https://doi.org/10.1351/goldbook.H02755

ArithmeticEquation
type: Class
example: 1 + 1 = 2

Equation
type: Class
subclass of: Restriction
comment: An equation with variables can always be represented as: f(v0, v1, ..., vn) = g(v0, v1, ..., vn) where f is the left hand and g the right hand side expressions and v0, v1, ..., vn are the variables.
comment: The class of 'mathematical'-s that stand for a statement of equality between two mathematical expressions.
example: 2+3 = 5 x^2 +3x = 5x dv/dt = a sin(x) = y
EMMO 967080e5 2f42 4eb2 a3a9 c58143e835f9: The class of 'mathematical'-s that stand for a statement of equality between two mathematical expressions.

StandaloneModelSimulation
type: Class
comment: A standalone simulation, where a single physics equation is solved.
EMMO 967080e5 2f42 4eb2 a3a9 c58143e835f9: A standalone simulation, where a single physics equation is solved.

PhysicsBasedSimulation
type: Class
comment: A simulation that relies on physics based models, according to the Review of Materials Modelling and CWA 17284:2018.
is defined by: CEN Workshop Agreement – CWA 17284 “Materials modelling – terminology, classification and metadata”
EMMO 967080e5 2f42 4eb2 a3a9 c58143e835f9: A simulation that relies on physics based models, according to the Review of Materials Modelling and CWA 17284:2018.

GroupVelocity
type: Class
comment: Speed with which the envelope of a wave propagates in space.
alternative label: GroupSpeed
EMMO 26bf1bef d192 4da6 b0eb d2209698fb54: https://www.wikidata.org/wiki/Q217361
EMMO 50c298c2 55a2 4068 b3ac 4e948c33181f: https://www.electropedia.org/iev/iev.nsf/display
EMMO 6dd685dd 1895 46e4 b227 be9f7d643c25: https://dbpedia.org/page/Group_velocity
EMMO 8de5d5bf db1c 40ac b698 095ba3b18578: 3-23.2
EMMO 967080e5 2f42 4eb2 a3a9 c58143e835f9: Speed with which the envelope of a wave propagates in space.
EMMO c84c6752 6d64 48cc 9500 e54a3c34898d: https://en.wikipedia.org/wiki/Group_velocity

DecaGram
type: Class
subclass of: Restriction
  some values from: Gram
subclass of: Restriction
  has value: 0.01
subclass of: Restriction
  has value: 0.0
comment: 0,01-fold of the SI base unit kilogram -- QUDT
EMMO 1f1b164d ec6a 4faa 8d5e 88bda62316cc: http://qudt.org/vocab/unit/DecaGM
EMMO 33ae2d07 5526 4555 a0b4 8f4c031b5652: dag
EMMO 7f1dec83 d85e 4e1b b7bd c9442d4f5a64: dag
EMMO 967080e5 2f42 4eb2 a3a9 c58143e835f9: 0,01-fold of the SI base unit kilogram -- QUDT

ElectricConductivity
type: Class
subclass of: Restriction
comment: Conductivity is equeal to the resiprocal of resistivity.
comment: Measure of a material's ability to conduct an electric current.
alternative label: Conductivity
EMMO 1f1b164d ec6a 4faa 8d5e 88bda62316cc: http://qudt.org/vocab/quantitykind/ElectricConductivity
EMMO 26bf1bef d192 4da6 b0eb d2209698fb54: https://www.wikidata.org/wiki/Q4593291
EMMO 8de5d5bf db1c 40ac b698 095ba3b18578: 6-43
EMMO 967080e5 2f42 4eb2 a3a9 c58143e835f9: Measure of a material's ability to conduct an electric current.
EMMO fe015383 afb3 44a6 ae86 043628697aa2: https://doi.org/10.1351/goldbook.C01245

PicoMetre
type: Class
subclass of: Restriction
  some values from: Metre
subclass of: Restriction
  has value: 1e-12
subclass of: Restriction
  has value: 0.0
comment: 0.000000000001-fold of the SI base unit metre -- QUDT
EMMO 1f1b164d ec6a 4faa 8d5e 88bda62316cc: http://qudt.org/vocab/unit/PicoM
EMMO 33ae2d07 5526 4555 a0b4 8f4c031b5652: pm
EMMO 7f1dec83 d85e 4e1b b7bd c9442d4f5a64: pm
EMMO 967080e5 2f42 4eb2 a3a9 c58143e835f9: 0.000000000001-fold of the SI base unit metre -- QUDT

RutheniumSymbol
type: Class
subclass of: Restriction
  has value: Ru
comment: The symbol that stands for the ruthenium atom.
EMMO 967080e5 2f42 4eb2 a3a9 c58143e835f9: The symbol that stands for the ruthenium atom.

PascalMetrePerSecond
type: Class
subclass of: Restriction
  has value: 1.0
subclass of: Restriction
  has value: 0.0
comment: Pascal metre per second.
EMMO 1f1b164d ec6a 4faa 8d5e 88bda62316cc: http://qudt.org/vocab/unit/PA-M-PER-SEC
EMMO 33ae2d07 5526 4555 a0b4 8f4c031b5652: Pa.m.s-1
EMMO 7f1dec83 d85e 4e1b b7bd c9442d4f5a64: Pa⋅m/s
EMMO 967080e5 2f42 4eb2 a3a9 c58143e835f9: Pascal metre per second.

ElectricCurrentPerEnergyUnit
type: Class
subclass of: Restriction
  has value: T+2 L-2 M-1 I+1 Θ0 N0 J0
comment: The class of units with dimensionality 'ElectricCurrentPerEnergy'.
EMMO 967080e5 2f42 4eb2 a3a9 c58143e835f9: The class of units with dimensionality 'ElectricCurrentPerEnergy'.

CalciumAtom
type: Class
subclass of: Restriction
subclass of: Restriction
  has value: 40.078
subclass of: Restriction
  has value: 20
comment: Atom subclass for calcium.
EMMO 967080e5 2f42 4eb2 a3a9 c58143e835f9: Atom subclass for calcium.

MigrationArea
type: Class
comment: Sum of the slowing-down area from fission energy to thermal energy and the diffusion area for thermal neutrons.
EMMO 1f1b164d ec6a 4faa 8d5e 88bda62316cc: https://qudt.org/vocab/quantitykind/MigrationArea
EMMO 26bf1bef d192 4da6 b0eb d2209698fb54: https://www.wikidata.org/wiki/Q98966325
EMMO 8de5d5bf db1c 40ac b698 095ba3b18578: 10-72.3
EMMO 967080e5 2f42 4eb2 a3a9 c58143e835f9: Sum of the slowing-down area from fission energy to thermal energy and the diffusion area for thermal neutrons.

SquareMetrePerVoltSecond
type: Class
subclass of: Restriction
  has value: 1.0
subclass of: Restriction
  has value: 0.0
comment: Square metre per volt second.
EMMO 1f1b164d ec6a 4faa 8d5e 88bda62316cc: http://qudt.org/vocab/unit/M2-PER-V-SEC
EMMO 33ae2d07 5526 4555 a0b4 8f4c031b5652: m2.V-1.s-1
EMMO 7f1dec83 d85e 4e1b b7bd c9442d4f5a64: m²/(V⋅s)
EMMO 967080e5 2f42 4eb2 a3a9 c58143e835f9: Square metre per volt second.

SquareLengthPerVoltageTimeUnit
type: Class
subclass of: Restriction
  has value: T+2 L0 M-1 I-1 Θ0 N0 J0
comment: The class of units with dimensionality 'SquareLengthPerVoltageTime'.
EMMO 967080e5 2f42 4eb2 a3a9 c58143e835f9: The class of units with dimensionality 'SquareLengthPerVoltageTime'.

MercurySymbol
type: Class
subclass of: Restriction
  has value: Hg
comment: The symbol that stands for the mercury atom.
EMMO 967080e5 2f42 4eb2 a3a9 c58143e835f9: The symbol that stands for the mercury atom.

EndTile
type: Class
comment: A direct part that only is the target, but not the source of temporal relations.
EMMO 967080e5 2f42 4eb2 a3a9 c58143e835f9: A direct part that only is the target, but not the source of temporal relations.

MolePerCubicMetrePerSecond
type: Class
subclass of: Restriction
  has value: 1.0
subclass of: Restriction
  has value: 0.0
comment: SI unit of quantity of matter per SI unit volume per SI unit of time. -- QUDT
alternative label: Moles per cubic metre per second
EMMO 1f1b164d ec6a 4faa 8d5e 88bda62316cc: http://qudt.org/vocab/unit/MOL-PER-M3-SEC
EMMO 33ae2d07 5526 4555 a0b4 8f4c031b5652: mol.m-3.s-1
EMMO 7f1dec83 d85e 4e1b b7bd c9442d4f5a64: mol/(m³⋅s)
EMMO 967080e5 2f42 4eb2 a3a9 c58143e835f9: SI unit of quantity of matter per SI unit volume per SI unit of time. -- QUDT

AmountPerVolumeTimeUnit
type: Class
subclass of: Restriction
  has value: T-1 L-3 M0 I0 Θ0 N+1 J0
comment: The class of units with dimensionality 'AmountPerVolumeTime'.
EMMO 967080e5 2f42 4eb2 a3a9 c58143e835f9: The class of units with dimensionality 'AmountPerVolumeTime'.

MicroMetrePerNewton
type: Class
subclass of: Restriction
  has value: 1e-06
subclass of: Restriction
  has value: 0.0
comment: Micro metres measured per Newton -- QUDT
alternative label: Micro metre per Newton
EMMO 1f1b164d ec6a 4faa 8d5e 88bda62316cc: http://qudt.org/vocab/unit/MicroM-PER-N
EMMO 7f1dec83 d85e 4e1b b7bd c9442d4f5a64: µJ/N
EMMO 967080e5 2f42 4eb2 a3a9 c58143e835f9: Micro metres measured per Newton -- QUDT

NewtonPerKilogram
type: Class
subclass of: Restriction
  has value: 1.0
subclass of: Restriction
  has value: 0.0
comment: Gravitational field strength at a point is the gravitational force per unit mass at that point. It is a vector and its S.I. unit is N kg-1. -- QUDT
alternative label: Newton per Kilogram
EMMO 1f1b164d ec6a 4faa 8d5e 88bda62316cc: http://qudt.org/vocab/unit/N-PER-KiloGM
EMMO 33ae2d07 5526 4555 a0b4 8f4c031b5652: N.kg-1
EMMO 7f1dec83 d85e 4e1b b7bd c9442d4f5a64: N/kg
EMMO 967080e5 2f42 4eb2 a3a9 c58143e835f9: Gravitational field strength at a point is the gravitational force per unit mass at that point. It is a vector and its S.I. unit is N kg-1. -- QUDT

ModulusOfElasticity
type: Class
subclass of: Restriction
comment: Mechanical property of linear elastic solid materials.
alternative label: YoungsModulus
EMMO 26bf1bef d192 4da6 b0eb d2209698fb54: https://www.wikidata.org/wiki/Q2091584
EMMO 50c298c2 55a2 4068 b3ac 4e948c33181f: https://www.electropedia.org/iev/iev.nsf/display
EMMO 8de5d5bf db1c 40ac b698 095ba3b18578: 4-19.1
EMMO 967080e5 2f42 4eb2 a3a9 c58143e835f9: Mechanical property of linear elastic solid materials.
EMMO fe015383 afb3 44a6 ae86 043628697aa2: https://doi.org/10.1351/goldbook.M03966

AttoFarad
type: Class
subclass of: Restriction
  some values from: Farad
subclass of: Restriction
  has value: 1e-18
subclass of: Restriction
  has value: 0.0
comment: 0,000 000 000 000 000 001-fold of the SI derived unit farad -- QUDT
EMMO 1f1b164d ec6a 4faa 8d5e 88bda62316cc: http://qudt.org/vocab/unit/AttoFARAD
EMMO 33ae2d07 5526 4555 a0b4 8f4c031b5652: aF
EMMO 7f1dec83 d85e 4e1b b7bd c9442d4f5a64: aF
EMMO 967080e5 2f42 4eb2 a3a9 c58143e835f9: 0,000 000 000 000 000 001-fold of the SI derived unit farad -- QUDT

AttoPrefixedUnit
type: Class
subclass of: Restriction
subclass of: Restriction
  has value: 1e-18
comment: Superclass for all units prefixed with "atto" (1e-18).
EMMO 967080e5 2f42 4eb2 a3a9 c58143e835f9: Superclass for all units prefixed with "atto" (1e-18).

FundamentalLatticeVector
type: Class
subclass of: Restriction
comment: Fundamental translation vector for the crystal lattice.
EMMO 1f1b164d ec6a 4faa 8d5e 88bda62316cc: https://qudt.org/vocab/quantitykind/FundamentalLatticeVector
EMMO 26bf1bef d192 4da6 b0eb d2209698fb54: https://www.wikidata.org/wiki/Q105451063
EMMO 8de5d5bf db1c 40ac b698 095ba3b18578: 12-1.2
EMMO 967080e5 2f42 4eb2 a3a9 c58143e835f9: Fundamental translation vector for the crystal lattice.

WattMetrePerSquareMetreSteradian
type: Class
subclass of: Restriction
  has value: 1.0
subclass of: Restriction
  has value: 0.0
comment: The power per unit area of radiation of a given wavenumber illuminating a target at a given incident angle. -- QUDT
alternative label: Watts metre per square metre steradian
EMMO 1f1b164d ec6a 4faa 8d5e 88bda62316cc: http://qudt.org/vocab/unit/W-M-PER-M2-SR
EMMO 33ae2d07 5526 4555 a0b4 8f4c031b5652: W.m-2.m.sr-1
EMMO 7f1dec83 d85e 4e1b b7bd c9442d4f5a64: W⋅m/m²⋅sr
EMMO 967080e5 2f42 4eb2 a3a9 c58143e835f9: The power per unit area of radiation of a given wavenumber illuminating a target at a given incident angle. -- QUDT

PerTeslaMetre
type: Class
subclass of: Restriction
  has value: 1.0
subclass of: Restriction
  has value: 0.0
comment: Per Tesla Meter Unit is a denominator unit with dimensions /m .· T. -- QUDT
alternative label: ReciprocalTeslaMetre.
EMMO 1f1b164d ec6a 4faa 8d5e 88bda62316cc: http://qudt.org/vocab/unit/PER-T-M
EMMO 33ae2d07 5526 4555 a0b4 8f4c031b5652: T-1.m-1
EMMO 7f1dec83 d85e 4e1b b7bd c9442d4f5a64: /t⋅m
EMMO 967080e5 2f42 4eb2 a3a9 c58143e835f9: Per Tesla Meter Unit is a denominator unit with dimensions /m .· T. -- QUDT

MagneticReluctivityUnit
type: Class
subclass of: Restriction
  has value: T+2 L-1 M-1 I+1 Θ0 N0 J0
comment: The class of units with dimensionality 'MagneticReluctivity'.
EMMO 967080e5 2f42 4eb2 a3a9 c58143e835f9: The class of units with dimensionality 'MagneticReluctivity'.

VolumeFlowRate
type: Class
subclass of: Restriction
comment: Quantity equal to the volume dV of substance crossing a given surface during a time interval with infinitesimal duration dt, divided by this duration, thus qV = dV / dt-
alternative label: VolumetricFlowRate
EMMO 1f1b164d ec6a 4faa 8d5e 88bda62316cc: https://qudt.org/vocab/quantitykind/VolumeFlowRate
EMMO 26bf1bef d192 4da6 b0eb d2209698fb54: https://www.wikidata.org/wiki/Q1134348
EMMO 50c298c2 55a2 4068 b3ac 4e948c33181f: https://www.electropedia.org/iev/iev.nsf/display
EMMO 8de5d5bf db1c 40ac b698 095ba3b18578: 4-31
EMMO 967080e5 2f42 4eb2 a3a9 c58143e835f9: Quantity equal to the volume dV of substance crossing a given surface during a time interval with infinitesimal duration dt, divided by this duration, thus qV = dV / dt-
EMMO c84c6752 6d64 48cc 9500 e54a3c34898d: https://en.wikipedia.org/wiki/Volumetric_flow_rate

IsentropicExponent
type: Class
comment: For an ideal gas, isentropic exponent is equal to ratio of the specific heat capacities.
EMMO 1f1b164d ec6a 4faa 8d5e 88bda62316cc: https://qudt.org/vocab/quantitykind/IsentropicExponent
EMMO 26bf1bef d192 4da6 b0eb d2209698fb54: https://www.wikidata.org/wiki/Q75775739
EMMO 50c298c2 55a2 4068 b3ac 4e948c33181f: https://www.electropedia.org/iev/iev.nsf/display
EMMO 8de5d5bf db1c 40ac b698 095ba3b18578: 5-17.2
EMMO 967080e5 2f42 4eb2 a3a9 c58143e835f9: For an ideal gas, isentropic exponent is equal to ratio of the specific heat capacities.

ResonanceEscapeProbability
type: Class
comment: In an infinite medium, the probability that a neutron slowing down will traverse all or some specified portion of the range of resonance energies without being absorbed.
EMMO 1f1b164d ec6a 4faa 8d5e 88bda62316cc: https://qudt.org/vocab/quantitykind/ResonanceEscapeProbability
EMMO 26bf1bef d192 4da6 b0eb d2209698fb54: https://www.wikidata.org/wiki/Q4108072
EMMO 8de5d5bf db1c 40ac b698 095ba3b18578: 10-68
EMMO 967080e5 2f42 4eb2 a3a9 c58143e835f9: In an infinite medium, the probability that a neutron slowing down will traverse all or some specified portion of the range of resonance energies without being absorbed.

Probability
type: Class
comment: Probability is a dimensionless quantity that can attain values between 0 and 1; zero denotes the impossible event and 1 denotes a certain event.
comment: The propability for a certain outcome, is the ratio between the number of events leading to the given outcome and the total number of events.
EMMO 967080e5 2f42 4eb2 a3a9 c58143e835f9: Probability is a dimensionless quantity that can attain values between 0 and 1; zero denotes the impossible event and 1 denotes a certain event.
EMMO fe015383 afb3 44a6 ae86 043628697aa2: https://doi.org/10.1351/goldbook.P04855

Minus
type: Class
subclass of: Restriction
  has value: -

ArithmeticOperator
type: Class

PerMilliSecond
type: Class
subclass of: Restriction
  has value: 1000.0
subclass of: Restriction
  has value: 0.0
comment: Per millisecond.
alternative label: ReciprocalMilliSecond
EMMO 1f1b164d ec6a 4faa 8d5e 88bda62316cc: http://qudt.org/vocab/unit/PER-MilliSEC
EMMO 33ae2d07 5526 4555 a0b4 8f4c031b5652: ms-1
EMMO 7f1dec83 d85e 4e1b b7bd c9442d4f5a64: /ms
EMMO 967080e5 2f42 4eb2 a3a9 c58143e835f9: Per millisecond.

HectoCoulomb
type: Class
subclass of: Restriction
  some values from: Coulomb
subclass of: Restriction
  has value: 100.0
subclass of: Restriction
  has value: 0.0
comment: "HectoCoulomb" is a unit for 'Electric Charge' expressed as hC. -- QUDT
EMMO 1f1b164d ec6a 4faa 8d5e 88bda62316cc: http://qudt.org/vocab/unit/HectoC
EMMO 33ae2d07 5526 4555 a0b4 8f4c031b5652: hC
EMMO 7f1dec83 d85e 4e1b b7bd c9442d4f5a64: hC
EMMO 967080e5 2f42 4eb2 a3a9 c58143e835f9: "HectoCoulomb" is a unit for 'Electric Charge' expressed as hC. -- QUDT

HectoPrefixedUnit
type: Class
subclass of: Restriction
subclass of: Restriction
  has value: 100.0
comment: Superclass for all units prefixed with "hecto" (100).
EMMO 967080e5 2f42 4eb2 a3a9 c58143e835f9: Superclass for all units prefixed with "hecto" (100).

Semiosis
type: Class
subclass of: Restriction
comment: A 'Process', that has participant an 'Interpreter', that is aimed to produce a 'Sign' representing another participant, the 'Object'.
example: Me looking a cat and saying loud: "Cat!" -> the semiosis process me -> interpreter cat -> object (in Peirce semiotics) the cat perceived by my mind -> interpretant "Cat!" -> sign, the produced sign
EMMO 8a137e9f 579c 4e28 baca e8980eb0c3db: EquivalentTo: Deduction or Declaration or Cognition
EMMO 8a137e9f 579c 4e28 baca e8980eb0c3db: EquivalentTo: FullSemiosis or PartialSemiosis
EMMO 967080e5 2f42 4eb2 a3a9 c58143e835f9: A 'Process', that has participant an 'Interpreter', that is aimed to produce a 'Sign' representing another participant, the 'Object'.

Agent
type: Class
subclass of: Restriction
comment: A participant that is the driver of a process.
comment: An agent is not necessarily human. In fact, the concept of agent has been generalised to encompass both intentional and unintentional acts primarily to take into account usage of the term in chemistry (e.g., chemical agent that intiitate a reaction), inline also with the most recent development in the philosophical debate.
prior version: The agent concept identifies the parts of a process that are also its drivers. An agent part has an active role with respect to any other generic part, meaning that is involved in the causal chain that characterize the process. An agent is a participant, meaning that is qualifiable as an object. As for all holistic relations, there is a level of subjectivity in drawing whole-role relations, so that the identification of an agent within a process is not fully axiomatizable. What is axiomatically expressible is that an agent requires to be part of a process (i.e., an agent exists only within a process) but a process may not require an agent to exist (qualified role). Agentless processes may have a distributed causality chain so that the agency is exerted collectively and there is no motivation to draw an holistic connection between the whole and some parts. For example, the breaking of a nail can be caused by an agent such as an hammer, or by the rusting process which is not a participant as required by the agent definition. This concept covers both intentional and non intentional agency.
example: A catalyst. A bus driver. A substance that is initiating a reaction that would not occur without its presence.
EMMO 967080e5 2f42 4eb2 a3a9 c58143e835f9: A participant that is the driver of a process.
EMMO c7b62dd7 063a 4c2a 8504 42f7264ba83f: An agent is not necessarily human. In fact, the concept of agent has been generalised to encompass both intentional and unintentional acts primarily to take into account usage of the term in chemistry (e.g., chemical agent that intiitate a reaction), inline also with the most recent development in the philosophical debate.

ExaJoule
type: Class
subclass of: Restriction
  some values from: Joule
subclass of: Restriction
  has value: 1e+18
subclass of: Restriction
  has value: 0.0
comment: 1 000 000 000 000 000 000-fold of the derived SI unit joule -- QUDT
EMMO 1f1b164d ec6a 4faa 8d5e 88bda62316cc: http://qudt.org/vocab/unit/ExaJ
EMMO 33ae2d07 5526 4555 a0b4 8f4c031b5652: EJ
EMMO 7f1dec83 d85e 4e1b b7bd c9442d4f5a64: EJ
EMMO 967080e5 2f42 4eb2 a3a9 c58143e835f9: 1 000 000 000 000 000 000-fold of the derived SI unit joule -- QUDT

ExaPrefixedUnit
type: Class
subclass of: Restriction
subclass of: Restriction
  has value: 1e+18
comment: Superclass for all units prefixed with "exa" (1e18).
EMMO 967080e5 2f42 4eb2 a3a9 c58143e835f9: Superclass for all units prefixed with "exa" (1e18).

Day
type: Class
subclass of: Restriction
  has value: 86400.0
subclass of: Restriction
  has value: 0.0
subclass of: Restriction
  has value: d
comment: A measure of time defined as 86 400 seconds.
comment: Mean solar day -- QUDT
EMMO 0b1cbe60 d380 4787 b92e be26bdacf2c2: DAY
EMMO 1f1b164d ec6a 4faa 8d5e 88bda62316cc: http://qudt.org/vocab/unit/DAY
EMMO 33ae2d07 5526 4555 a0b4 8f4c031b5652: d
EMMO 6dd685dd 1895 46e4 b227 be9f7d643c25: http://dbpedia.org/page/Day
EMMO 70fe84ff 99b6 4206 a9fc 9a8931836d84: A measure of time defined as 86 400 seconds.
EMMO 967080e5 2f42 4eb2 a3a9 c58143e835f9: Mean solar day -- QUDT
EMMO c84c6752 6d64 48cc 9500 e54a3c34898d: http://en.wikipedia.org/wiki/Day
EMMO fe015383 afb3 44a6 ae86 043628697aa2: https://doi.org/10.1351/goldbook.D01527

ElectronicModel
type: Class
comment: A physics-based model based on a physics equation describing the behaviour of electrons.
example: Density functional theory. Hartree-Fock.
EMMO 967080e5 2f42 4eb2 a3a9 c58143e835f9: A physics-based model based on a physics equation describing the behaviour of electrons.

Auditory
type: Class
comment: 'acoustical' refers to the perception mechanism of the observer that can occur through a microphone, an ear.
comment: A 'Perceptual' which stands for a real world object whose spatiotemporal pattern makes it identifiable by an observer as a sound.
alternative label: Sound
example: When we use the term 'sound' what are we referring to? The EMMO identifies a sound as the physical object that can be heard by the observer (more exactly, by the sensor of the observer). In this sense, a sound (which is an acoustical object) is to be identified as the air region that manifests the sound wave and is able to be perceived by an observer. In case the wave is travelling through water or steel, then these other media regions are the sounds. If the waveform is travelling through a cable as electronic signal (analog or digital) it is no more a sound, since it cannot be perceived by an observer as an acoustical object. This electrical waveform (or digital packet) is another physical that may stand for a sound if interpreted by a device (e.g. an amplifier, a DA converter).
EMMO 967080e5 2f42 4eb2 a3a9 c58143e835f9: A 'Perceptual' which stands for a real world object whose spatiotemporal pattern makes it identifiable by an observer as a sound.
EMMO c7b62dd7 063a 4c2a 8504 42f7264ba83f: 'acoustical' refers to the perception mechanism of the observer that can occur through a microphone, an ear.

Perceptual
type: Class
equivalent class: Class
comment: The class contrast individuals standing for entities that can stimulate a perception (e.g. a retina impression) to a human being and that are categorized accordingly to human perception mechanisms.
comment: This class is the most general superclass for the categorization of contrasts that are perceivable through a specific human-related perception mechanism. This perspective is based on human characterization of perceptions. A 'Perceptual' can stand for another object in an EMMO described semiotic process (acting as sign or as object), just like a word on a paper (the perceptual object) may refer semiotically to another object. However, a perceptual is not necessarily a 'Sign' (e.g. a line sketched on a blackboard is a recognizable 'Perceptual' but it may stand for nothing). A 'Perceptual' becomes a semiotic object, when it is part of a 'Semiotic' process described by the ontologist within the EMMO, and it's done always specifying for which interpreter this relation occurs.
example: A line scratched on a surface. A sound. A smell. The word 'cat' and the sound of the word 'cat' (the first one is graphical and the second acoustical).
example: The meta-semiotic process: I see a cloud in the sky. Since I'm an EMMO ontologist, I create an individual named Cloud under the 'Perceptual' class, meaning that I recognize the cloud as an object thanks to a specific perceptual channel (e.g. through my eyes). This semiotic process occurs at meta-level: it's how I use the EMMO as tool for a direct representation of the world, understandable by others ontologists. The semiotic process within EMMO: My friend looks at the same cloud and says: "It is an elephant". I use the EMMO to record this experience by declaring: - my friend as MyFriend individual, belonging to 'Interpreter' classes - the sound of the word "elephant" as an acoustical perception individual named ElephantWord, belonging to 'Perceptual' - a relation hasSign between Cloud and ElephantWord, that makes ElephantWord also belonging to 'Sign' class and Cloud belonging also to 'Object' class - a 'Semiosis' individual called MyFriendElephantCloud that hasParticipant: Cloud, ElephantWord and MyFriend, respectively as object, sign and interpreter. So, the Perceptual class is here to categorized real-world objects at meta-level using common perceptual channels, for practical ontology usage. We could have represented the word "elephant" within a physicalistic approach, by identifying it as a pressure wave in the air.
EMMO 967080e5 2f42 4eb2 a3a9 c58143e835f9: The class contrast individuals standing for entities that can stimulate a perception (e.g. a retina impression) to a human being and that are categorized accordingly to human perception mechanisms.
EMMO c7b62dd7 063a 4c2a 8504 42f7264ba83f: This class is the most general superclass for the categorization of contrasts that are perceivable through a specific human-related perception mechanism. This perspective is based on human characterization of perceptions. A 'Perceptual' can stand for another object in an EMMO described semiotic process (acting as sign or as object), just like a word on a paper (the perceptual object) may refer semiotically to another object. However, a perceptual is not necessarily a 'Sign' (e.g. a line sketched on a blackboard is a recognizable 'Perceptual' but it may stand for nothing). A 'Perceptual' becomes a semiotic object, when it is part of a 'Semiotic' process described by the ontologist within the EMMO, and it's done always specifying for which interpreter this relation occurs.

Annealing
type: Class
comment: heat treatment consisting of heating and soaking at a suitable temperature, followed by cooling under conditions such that, after return to ambient temperature, the metal will be in a structural state closer to that of equilibrium
EMMO c7b62dd7 063a 4c2a 8504 42f7264ba83f: heat treatment consisting of heating and soaking at a suitable temperature, followed by cooling under conditions such that, after return to ambient temperature, the metal will be in a structural state closer to that of equilibrium

HeatTreatment
type: Class
comment: Heat to a temperature appropriate for the particular material, maintain at that temperature and then cool at an appropriate rate to reduce hardness, improve machinability or achieve desired properties.
alternative label: wärmebehandeln
EMMO c7b62dd7 063a 4c2a 8504 42f7264ba83f: Heat to a temperature appropriate for the particular material, maintain at that temperature and then cool at an appropriate rate to reduce hardness, improve machinability or achieve desired properties.

HenryPerMetre
type: Class
subclass of: Restriction
  has value: 1.0
subclass of: Restriction
  has value: 0.0
comment: The henry per meter (symbolized H/m) is the unit of magnetic permeability in the International System of Units ( SI ). Reduced to base units in SI, 1 H/m is the equivalent of one kilogram meter per square second per square ampere. -- QUDT
alternative label: Henry per Metre
EMMO 1f1b164d ec6a 4faa 8d5e 88bda62316cc: http://qudt.org/vocab/unit/H-PER-M
EMMO 33ae2d07 5526 4555 a0b4 8f4c031b5652: H.m-1
EMMO 7f1dec83 d85e 4e1b b7bd c9442d4f5a64: H/m
EMMO 967080e5 2f42 4eb2 a3a9 c58143e835f9: The henry per meter (symbolized H/m) is the unit of magnetic permeability in the International System of Units ( SI ). Reduced to base units in SI, 1 H/m is the equivalent of one kilogram meter per square second per square ampere. -- QUDT
EMMO c84c6752 6d64 48cc 9500 e54a3c34898d: http://en.wikipedia.org/wiki/Henry

Ablation
type: Class
comment: Manufacturing by separating particles of material from a solid body by non-mechanical means. Ablation refers both to the removal of layers of material and to the separation of workpiece parts. The production process of ablation is considered in its stationary instantaneous state, independently of the application of auxiliary processes necessary to initiate the process. Ablation is divided into three subgroups according to the order point of view (OGP) "process in the effective zone on the surface of the workpiece": - thermal ablation; - chemical ablation; - electrochemical ablation.
alternative label: Abtragen

CandelaPerLumen
type: Class
subclass of: Restriction
  has value: 1.0
subclass of: Restriction
  has value: 0.0
comment: Candela per Lumen.
EMMO 1f1b164d ec6a 4faa 8d5e 88bda62316cc: http://qudt.org/vocab/unit/CD-PER-LM
EMMO 7f1dec83 d85e 4e1b b7bd c9442d4f5a64: cd/lm
EMMO 967080e5 2f42 4eb2 a3a9 c58143e835f9: Candela per Lumen.

MaterialTreatment
type: Class
comment: Has shaped bodies as input and output.
comment: The processing of a material aimed to transform its structure by means of any type of treatment, without involving relevant synthesis phenomena.
comment: esce workpiece
see also: DIN 8580:2020
alternative label: Stoffeigenschaft ändern
alternative label: WorkPieceTreatment
EMMO 967080e5 2f42 4eb2 a3a9 c58143e835f9: The processing of a material aimed to transform its structure by means of any type of treatment, without involving relevant synthesis phenomena.
EMMO c7b62dd7 063a 4c2a 8504 42f7264ba83f: Has shaped bodies as input and output.
EMMO c7b62dd7 063a 4c2a 8504 42f7264ba83f: Manufacturing by changing the properties of the material of which a workpiece is made, which is done, among other things, by changes in the submicroscopic or atomic range, e.g. by diffusion of atoms, generation and movement of dislocations in the atomic lattice or chemical reactions, and where unavoidable changes in shape are not part of the essence of these processes.

MaterialsProcessing
type: Class
comment: A manufacturing process aimed to modify the precursor objects through a physical process (involving other materials, energy, manipulation) to change its material properties.
comment: A material process requires the output to be classified as an individual of a material subclass.
alternative label: ContinuumManufacturing
example: Synthesis of materials, quenching, the preparation of a cake, tempering of a steel beam.
EMMO 967080e5 2f42 4eb2 a3a9 c58143e835f9: A manufacturing process aimed to modify the precursor objects through a physical process (involving other materials, energy, manipulation) to change its material properties.
EMMO c7b62dd7 063a 4c2a 8504 42f7264ba83f: A material process requires the output to be classified as an individual of a material subclass.

Manufacturing
type: Class
subclass of: Restriction
comment: Deals with entities that have a defined shape.
comment: The process of transforming precursor objects (e.g. raw materials) into a product by the use of manual labor, machinery or chemical/biological processes.
see also: DIN 8580:2020
see also: ISO 15531-1:2004 manufacturing: function or act of converting or transforming material from raw material or semi-finished state to a state of further completion
see also: ISO 18435-1:2009 manufacturing process: set of processes in manufacturing involving a flow and/or transformation of material, information, energy, control, or any other element in a manufacturing area
EMMO 967080e5 2f42 4eb2 a3a9 c58143e835f9: The process of transforming precursor objects (e.g. raw materials) into a product by the use of manual labor, machinery or chemical/biological processes.
EMMO c7b62dd7 063a 4c2a 8504 42f7264ba83f: Deals with entities that have a defined shape.
EMMO c84c6752 6d64 48cc 9500 e54a3c34898d: https://de.wikipedia.org/wiki/Fertigungsverfahren

IntentionalAgent
type: Class
subclass of: Restriction
comment: An agent that is driven by the intention to reach a defined objective in driving a process.
comment: Intentionality is not limited to human agents, but in general to all agents that have the capacity to decide to act in driving a process according to a motivation.
EMMO 967080e5 2f42 4eb2 a3a9 c58143e835f9: An agent that is driven by the intention to reach a defined objective in driving a process.
EMMO c7b62dd7 063a 4c2a 8504 42f7264ba83f: Intentionality is not limited to human agents, but in general to all agents that have the capacity to decide to act in driving a process according to a motivation.

GramPerMetre
type: Class
subclass of: Restriction
  has value: 0.001
subclass of: Restriction
  has value: 0.0
comment: 0,001-fold of the SI base unit kilogram divided by the SI base unit metre -- QUDT
alternative label: Gram Per Metre
EMMO 1f1b164d ec6a 4faa 8d5e 88bda62316cc: http://qudt.org/vocab/unit/GM-PER-M
EMMO 33ae2d07 5526 4555 a0b4 8f4c031b5652: g.m-1
EMMO 7f1dec83 d85e 4e1b b7bd c9442d4f5a64: g/m
EMMO 967080e5 2f42 4eb2 a3a9 c58143e835f9: 0,001-fold of the SI base unit kilogram divided by the SI base unit metre -- QUDT

IndiumAtom
type: Class
subclass of: Restriction
subclass of: Restriction
  has value: 114.818
subclass of: Restriction
  has value: 49
comment: Atom subclass for indium.
EMMO 967080e5 2f42 4eb2 a3a9 c58143e835f9: Atom subclass for indium.

NuclearRadius
type: Class
comment: Conventional radius of sphere in which the nuclear matter is included,
EMMO 1f1b164d ec6a 4faa 8d5e 88bda62316cc: https://qudt.org/vocab/quantitykind/NuclearRadius
EMMO 26bf1bef d192 4da6 b0eb d2209698fb54: https://www.wikidata.org/wiki/Q3535676
EMMO 8de5d5bf db1c 40ac b698 095ba3b18578: 10-19.1
EMMO 967080e5 2f42 4eb2 a3a9 c58143e835f9: Conventional radius of sphere in which the nuclear matter is included,

ElementaryQuark
type: Class
comment: An elementary fermionic particle that is the fundamental constituent of matter.
EMMO 967080e5 2f42 4eb2 a3a9 c58143e835f9: An elementary fermionic particle that is the fundamental constituent of matter.

ElementaryFermion
type: Class
comment: An elementary particle of a fundamental fermionic type.
EMMO 967080e5 2f42 4eb2 a3a9 c58143e835f9: An elementary particle of a fundamental fermionic type.

SectionAreaIntegralUnit
type: Class
subclass of: Restriction
  has value: T0 L+5 M0 I0 Θ0 N0 J0
comment: The class of units with dimensionality 'SectionAreaIntegral'.
EMMO 967080e5 2f42 4eb2 a3a9 c58143e835f9: The class of units with dimensionality 'SectionAreaIntegral'.

CubicMetrePerCubicMetre
type: Class
subclass of: Restriction
  has value: 1.0
subclass of: Restriction
  has value: 0.0
comment: Power of the SI base unit metre with the exponent 3 divided by the power of the SI base unit metre with the exponent 3. -- QUDT
alternative label: Cubic Metre Per Cubic Metre
EMMO 1f1b164d ec6a 4faa 8d5e 88bda62316cc: http://qudt.org/vocab/unit/M3-PER-M3
EMMO 33ae2d07 5526 4555 a0b4 8f4c031b5652: m3.m-3
EMMO 7f1dec83 d85e 4e1b b7bd c9442d4f5a64: m³/m³
EMMO 967080e5 2f42 4eb2 a3a9 c58143e835f9: Power of the SI base unit metre with the exponent 3 divided by the power of the SI base unit metre with the exponent 3. -- QUDT

Maximal
type: Class
comment: A maximal class M (subclass of Maximal) is defined by choosing a reference type φ so that M is subclass of φ, all parts of x are needed to keep φ(x) and if you add something to x, then x is no more a φ.
comment: The superclass for all classes of entities that have no proper parts of the same type of the whole are not proper part of an entity of that type.
EMMO 967080e5 2f42 4eb2 a3a9 c58143e835f9: The superclass for all classes of entities that have no proper parts of the same type of the whole are not proper part of an entity of that type.
EMMO c7b62dd7 063a 4c2a 8504 42f7264ba83f: A maximal class M (subclass of Maximal) is defined by choosing a reference type φ so that M is subclass of φ, all parts of x are needed to keep φ(x) and if you add something to x, then x is no more a φ.

QuarticMilliMetre
type: Class
subclass of: Restriction
  has value: 1e-12
subclass of: Restriction
  has value: 0.0
comment: 0.001-fold of the power of the SI base unit metre with the exponent 4 -- QUDT
alternative label: Quartic Millimetre
EMMO 1f1b164d ec6a 4faa 8d5e 88bda62316cc: http://qudt.org/vocab/unit/MilliM4
EMMO 33ae2d07 5526 4555 a0b4 8f4c031b5652: mm4
EMMO 7f1dec83 d85e 4e1b b7bd c9442d4f5a64: mm⁴
EMMO 967080e5 2f42 4eb2 a3a9 c58143e835f9: 0.001-fold of the power of the SI base unit metre with the exponent 4 -- QUDT

JoulePerKilogram
type: Class
subclass of: Restriction
  has value: 1.0
subclass of: Restriction
  has value: 0.0
comment: Joule Per Kilogram} (J/kg) is a unit in the category of Thermal heat capacity. It is also known as `joule/kilogram`, `joules per kilogram`. This unit is commonly used in the SI unit system. The unit has a dimension of L2T⁻² where L is length, and T is time. This unit is the standard SI unit in this category. -- QUDT
alternative label: Joule per Kilogram
EMMO 1f1b164d ec6a 4faa 8d5e 88bda62316cc: http://qudt.org/vocab/unit/J-PER-KiloGM
EMMO 33ae2d07 5526 4555 a0b4 8f4c031b5652: J.kg-1
EMMO 33ae2d07 5526 4555 a0b4 8f4c031b5652: J/kg
EMMO 7f1dec83 d85e 4e1b b7bd c9442d4f5a64: J/kg
EMMO 967080e5 2f42 4eb2 a3a9 c58143e835f9: Joule Per Kilogram} (J/kg) is a unit in the category of Thermal heat capacity. It is also known as `joule/kilogram`, `joules per kilogram`. This unit is commonly used in the SI unit system. The unit has a dimension of L2T⁻² where L is length, and T is time. This unit is the standard SI unit in this category. -- QUDT

MicroCoulombPerSquareMetre
type: Class
subclass of: Restriction
  has value: 1e-06
subclass of: Restriction
  has value: 0.0
comment: 0.000001-fold of the SI derived unit coulomb divided by the power of the SI base unit metre with the exponent 2 -- QUDT
alternative label: Microcoulomb Per Square Metre
EMMO 1f1b164d ec6a 4faa 8d5e 88bda62316cc: http://qudt.org/vocab/unit/MicroC-PER-M2
EMMO 33ae2d07 5526 4555 a0b4 8f4c031b5652: uC.m-2
EMMO 7f1dec83 d85e 4e1b b7bd c9442d4f5a64: μC/m²
EMMO 967080e5 2f42 4eb2 a3a9 c58143e835f9: 0.000001-fold of the SI derived unit coulomb divided by the power of the SI base unit metre with the exponent 2 -- QUDT

AmperePerMilliMetre
type: Class
subclass of: Restriction
  has value: 1000.0
subclass of: Restriction
  has value: 0.0
comment: SI base unit ampere divided by the 0.001-fold of the SI base unit metre -- QUDT
alternative label: Ampere Per Millimetre
EMMO 1f1b164d ec6a 4faa 8d5e 88bda62316cc: http://qudt.org/vocab/unit/A-PER-MilliM
EMMO 33ae2d07 5526 4555 a0b4 8f4c031b5652: A.mm-1
EMMO 33ae2d07 5526 4555 a0b4 8f4c031b5652: A/mm
EMMO 7f1dec83 d85e 4e1b b7bd c9442d4f5a64: A/mm
EMMO 967080e5 2f42 4eb2 a3a9 c58143e835f9: SI base unit ampere divided by the 0.001-fold of the SI base unit metre -- QUDT

MagneticFieldStrengthUnit
type: Class
subclass of: Restriction
  has value: T0 L-1 M0 I+1 Θ0 N0 J0
comment: The class of units with dimensionality 'MagneticFieldStrength'.
EMMO 967080e5 2f42 4eb2 a3a9 c58143e835f9: The class of units with dimensionality 'MagneticFieldStrength'.

RadiumSymbol
type: Class
subclass of: Restriction
  has value: Ra
comment: The symbol that stands for the radium atom.
EMMO 967080e5 2f42 4eb2 a3a9 c58143e835f9: The symbol that stands for the radium atom.

Ohm
type: Class
subclass of: Restriction
  has value: Ω
comment: The SI derived unit of electrical resistance, named after German physicist Georg Simon Ohm.
comment: Ω = V/A = H/s
EMMO 0b1cbe60 d380 4787 b92e be26bdacf2c2: OHM
EMMO 1f1b164d ec6a 4faa 8d5e 88bda62316cc: http://qudt.org/vocab/unit/OHM
EMMO 33ae2d07 5526 4555 a0b4 8f4c031b5652: Ohm
EMMO 6dd685dd 1895 46e4 b227 be9f7d643c25: http://dbpedia.org/resource/Ohm
EMMO 967080e5 2f42 4eb2 a3a9 c58143e835f9: The SI derived unit of electrical resistance, named after German physicist Georg Simon Ohm.
EMMO c7b62dd7 063a 4c2a 8504 42f7264ba83f: Ω = V/A = H/s
EMMO c84c6752 6d64 48cc 9500 e54a3c34898d: http://en.wikipedia.org/wiki/Ohm
EMMO fe015383 afb3 44a6 ae86 043628697aa2: https://doi.org/10.1351/goldbook.O04280

MilliAmperePerSquareCentiMetre
type: Class
subclass of: Restriction
  has value: 10.0
subclass of: Restriction
  has value: 0.0
comment: 0.001-fold of the SI base unit ampere divided by the 0.0001-fold of the power of the SI base unit metre by exponent 2
EMMO 967080e5 2f42 4eb2 a3a9 c58143e835f9: 0.001-fold of the SI base unit ampere divided by the 0.0001-fold of the power of the SI base unit metre by exponent 2

ProtactiniumAtom
type: Class
subclass of: Restriction
subclass of: Restriction
  has value: 231.03588
subclass of: Restriction
  has value: 91
comment: Atom subclass for protactinium.
EMMO 967080e5 2f42 4eb2 a3a9 c58143e835f9: Atom subclass for protactinium.

AreaPerTimeUnit
type: Class
subclass of: Restriction
  has value: T-1 L+2 M0 I0 Θ0 N0 J0
comment: The class of units with dimensionality 'AreaPerTime'.
EMMO 967080e5 2f42 4eb2 a3a9 c58143e835f9: The class of units with dimensionality 'AreaPerTime'.

MagnetomotiveForce
type: Class
subclass of: Restriction
comment: Scalar line integral of the magnetic field strength along a closed path.
EMMO 1f1b164d ec6a 4faa 8d5e 88bda62316cc: https://qudt.org/vocab/quantitykind/MagnetomotiveForce
EMMO 26bf1bef d192 4da6 b0eb d2209698fb54: https://www.wikidata.org/wiki/Q1266982
EMMO 50c298c2 55a2 4068 b3ac 4e948c33181f: https://www.electropedia.org/iev/iev.nsf/display
EMMO 8de5d5bf db1c 40ac b698 095ba3b18578: 6-37.3
EMMO 967080e5 2f42 4eb2 a3a9 c58143e835f9: Scalar line integral of the magnetic field strength along a closed path.

KilogramPerKilogram
type: Class
subclass of: Restriction
  has value: 1.0
subclass of: Restriction
  has value: 0.0
comment: SI base unit kilogram divided by the SI base unit kilogram -- QUDT
alternative label: Kilogram Per Kilogram
EMMO 1f1b164d ec6a 4faa 8d5e 88bda62316cc: http://qudt.org/vocab/unit/KiloGM-PER-KiloGM
EMMO 33ae2d07 5526 4555 a0b4 8f4c031b5652: kg.kg-1
EMMO 7f1dec83 d85e 4e1b b7bd c9442d4f5a64: kg/kg
EMMO 967080e5 2f42 4eb2 a3a9 c58143e835f9: SI base unit kilogram divided by the SI base unit kilogram -- QUDT

NanoMolePerGramPerSecond
type: Class
subclass of: Restriction
  has value: 1e-06
subclass of: Restriction
  has value: 0.0
alternative label: Nanomoles per gram per second
EMMO 1f1b164d ec6a 4faa 8d5e 88bda62316cc: http://qudt.org/vocab/unit/NanoMOL-PER-GM-SEC
EMMO 33ae2d07 5526 4555 a0b4 8f4c031b5652: nmol.g-1.s-1
EMMO 7f1dec83 d85e 4e1b b7bd c9442d4f5a64: nmol/(g⋅s)

AmountPerMassTimeUnit
type: Class
subclass of: Restriction
  has value: T-1 L0 M-1 I0 Θ0 N+1 J0
comment: The class of units with dimensionality 'AmountPerMassTime'.
EMMO 967080e5 2f42 4eb2 a3a9 c58143e835f9: The class of units with dimensionality 'AmountPerMassTime'.

PetaCoulomb
type: Class
subclass of: Restriction
  some values from: Coulomb
subclass of: Restriction
  has value: 1000000000000000.0
subclass of: Restriction
  has value: 0.0
comment: A PetaCoulomb is 10¹⁵ C. -- QUDT
EMMO 1f1b164d ec6a 4faa 8d5e 88bda62316cc: http://qudt.org/vocab/unit/PetaC
EMMO 33ae2d07 5526 4555 a0b4 8f4c031b5652: PC
EMMO 7f1dec83 d85e 4e1b b7bd c9442d4f5a64: PC
EMMO 967080e5 2f42 4eb2 a3a9 c58143e835f9: A PetaCoulomb is 10¹⁵ C. -- QUDT

PetaPrefixedUnit
type: Class
subclass of: Restriction
subclass of: Restriction
  has value: 1000000000000000.0
comment: Superclass for all units prefixed with "peta" (1e15).
EMMO 967080e5 2f42 4eb2 a3a9 c58143e835f9: Superclass for all units prefixed with "peta" (1e15).

Plane
type: Class
comment: A 2-manifold with two unconnected boundaries.
EMMO 967080e5 2f42 4eb2 a3a9 c58143e835f9: A 2-manifold with two unconnected boundaries.

TwoManifold
type: Class
comment: A topological space with the property that each point has a neighborhood that is homeomorphic to an open subset of 2-dimensional Euclidean space.
alternative label: 2-manifold
EMMO 967080e5 2f42 4eb2 a3a9 c58143e835f9: A topological space with the property that each point has a neighborhood that is homeomorphic to an open subset of 2-dimensional Euclidean space.

Tool
type: Class
comment: An object that enables or facilitate an agent in the execution of a process that modifies the surrounding environment.
EMMO 967080e5 2f42 4eb2 a3a9 c58143e835f9: An object that enables or facilitate an agent in the execution of a process that modifies the surrounding environment.

HotDipGalvanizing
type: Class
alternative label: Hot-dipGalvanizing

PerSquareMetreSecond
type: Class
subclass of: Restriction
  has value: 1.0
subclass of: Restriction
  has value: 0.0
comment: Per square metre and second.
alternative label: ReciprocalSquareMetreSecond
EMMO 1f1b164d ec6a 4faa 8d5e 88bda62316cc: http://qudt.org/vocab/unit/PER-M2-SEC
EMMO 33ae2d07 5526 4555 a0b4 8f4c031b5652: m-2.s-1
EMMO 7f1dec83 d85e 4e1b b7bd c9442d4f5a64: /(m²⋅s)
EMMO 967080e5 2f42 4eb2 a3a9 c58143e835f9: Per square metre and second.

PerAreaTimeUnit
type: Class
subclass of: Restriction
  has value: T-1 L-2 M0 I0 Θ0 N0 J0
comment: The class of units with dimensionality 'PerAreaTime'.
EMMO 967080e5 2f42 4eb2 a3a9 c58143e835f9: The class of units with dimensionality 'PerAreaTime'.

SquareMetreSteradian
type: Class
subclass of: Restriction
  has value: 1.0
subclass of: Restriction
  has value: 0.0
comment: "Square Meter Steradian" is a unit for 'Area Angle' expressed as m²-sr. -- QUDT
alternative label: Square Metre Steradian
EMMO 1f1b164d ec6a 4faa 8d5e 88bda62316cc: http://qudt.org/vocab/unit/M2-SR
EMMO 33ae2d07 5526 4555 a0b4 8f4c031b5652: m2.sr
EMMO 7f1dec83 d85e 4e1b b7bd c9442d4f5a64: m²⋅sr
EMMO 967080e5 2f42 4eb2 a3a9 c58143e835f9: "Square Meter Steradian" is a unit for 'Area Angle' expressed as m²-sr. -- QUDT

Steradian
type: Class
subclass of: Restriction
  has value: sr
comment: Dimensionless measurement unit for solid angle.
EMMO 0b1cbe60 d380 4787 b92e be26bdacf2c2: D27
EMMO 1f1b164d ec6a 4faa 8d5e 88bda62316cc: http://qudt.org/vocab/unit/SR
EMMO 33ae2d07 5526 4555 a0b4 8f4c031b5652: sr
EMMO 6dd685dd 1895 46e4 b227 be9f7d643c25: http://dbpedia.org/resource/Steradian
EMMO 967080e5 2f42 4eb2 a3a9 c58143e835f9: Dimensionless measurement unit for solid angle.
EMMO c84c6752 6d64 48cc 9500 e54a3c34898d: http://en.wikipedia.org/wiki/Steradian
EMMO fe015383 afb3 44a6 ae86 043628697aa2: https://doi.org/10.1351/goldbook.S05971

AreaFractionUnit
type: Class
comment: Unit for quantities of dimension one that are the fraction of two areas.
example: Unit for solid angle.
EMMO 967080e5 2f42 4eb2 a3a9 c58143e835f9: Unit for quantities of dimension one that are the fraction of two areas.

PhaseDifference
type: Class
comment: Under sinusoidal conditions, phase difference between the voltage applied to a linear two-terminal element or two-terminal circuit and the electric current in the element or circuit.
alternative label: DisplacementAngle
EMMO 26bf1bef d192 4da6 b0eb d2209698fb54: https://www.wikidata.org/wiki/Q97222919
EMMO 50c298c2 55a2 4068 b3ac 4e948c33181f: https://www.electropedia.org/iev/iev.nsf/display
EMMO 8de5d5bf db1c 40ac b698 095ba3b18578: 6-48
EMMO 967080e5 2f42 4eb2 a3a9 c58143e835f9: Under sinusoidal conditions, phase difference between the voltage applied to a linear two-terminal element or two-terminal circuit and the electric current in the element or circuit.

InternalEnergy
type: Class
comment: A state quantity equal to the difference between the total energy of a system and the sum of the macroscopic kinetic and potential energies of the system.
alternative label: ThermodynamicEnergy
EMMO 1f1b164d ec6a 4faa 8d5e 88bda62316cc: http://qudt.org/vocab/quantitykind/InternalEnergy
EMMO 8de5d5bf db1c 40ac b698 095ba3b18578: 5.20-2
EMMO 967080e5 2f42 4eb2 a3a9 c58143e835f9: A state quantity equal to the difference between the total energy of a system and the sum of the macroscopic kinetic and potential energies of the system.
EMMO fe015383 afb3 44a6 ae86 043628697aa2: https://doi.org/10.1351/goldbook.I03103

TungstenAtom
type: Class
subclass of: Restriction
subclass of: Restriction
  has value: 183.84
subclass of: Restriction
  has value: 74
comment: Atom subclass for tungsten.
EMMO 967080e5 2f42 4eb2 a3a9 c58143e835f9: Atom subclass for tungsten.

LinearIonization
type: Class
comment: Differential quotient of q with respect to l, where q is the average total charge of all positive ions produced by an ionizing charged particle over a path l, divided by the elementary charge.
EMMO 1f1b164d ec6a 4faa 8d5e 88bda62316cc: https://qudt.org/vocab/quantitykind/LinearIonization
EMMO 26bf1bef d192 4da6 b0eb d2209698fb54: https://www.wikidata.org/wiki/Q98690755
EMMO 50c298c2 55a2 4068 b3ac 4e948c33181f: https://www.electropedia.org/iev/iev.nsf/display
EMMO 8de5d5bf db1c 40ac b698 095ba3b18578: 10-58
EMMO 967080e5 2f42 4eb2 a3a9 c58143e835f9: Differential quotient of q with respect to l, where q is the average total charge of all positive ions produced by an ionizing charged particle over a path l, divided by the elementary charge.

MicroGramPerGram
type: Class
subclass of: Restriction
  some values from: GramPerGram
subclass of: Restriction
  has value: 1e-06
subclass of: Restriction
  has value: 0.0
comment: One part per 10**6 (million) by mass of the measurand in the matrix. -- QUDT
alternative label: Micrograms per gram
EMMO 1f1b164d ec6a 4faa 8d5e 88bda62316cc: http://qudt.org/vocab/unit/MicroGM-PER-GM
EMMO 33ae2d07 5526 4555 a0b4 8f4c031b5652: ug.g-1
EMMO 7f1dec83 d85e 4e1b b7bd c9442d4f5a64: µg/g
EMMO 967080e5 2f42 4eb2 a3a9 c58143e835f9: One part per 10**6 (million) by mass of the measurand in the matrix. -- QUDT

ResistanceToAlternativeCurrent
type: Class
comment: Real part of the impedance.
EMMO 26bf1bef d192 4da6 b0eb d2209698fb54: https://www.wikidata.org/wiki/Q1048490
EMMO 50c298c2 55a2 4068 b3ac 4e948c33181f: https://www.electropedia.org/iev/iev.nsf/display
EMMO 8de5d5bf db1c 40ac b698 095ba3b18578: 6-51.2
EMMO 967080e5 2f42 4eb2 a3a9 c58143e835f9: Real part of the impedance.

ElectricResistance
type: Class
subclass of: Restriction
comment: Inverse of 'ElectricalConductance'.
comment: Measure of the difficulty to pass an electric current through a material.
alternative label: Resistance
EMMO 1f1b164d ec6a 4faa 8d5e 88bda62316cc: http://qudt.org/vocab/quantitykind/Resistance
EMMO 26bf1bef d192 4da6 b0eb d2209698fb54: https://www.wikidata.org/wiki/Q25358
EMMO 8de5d5bf db1c 40ac b698 095ba3b18578: 6-46
EMMO 967080e5 2f42 4eb2 a3a9 c58143e835f9: Measure of the difficulty to pass an electric current through a material.
EMMO fe015383 afb3 44a6 ae86 043628697aa2: https://doi.org/10.1351/goldbook.E01936

SIAccepted
type: Class
disjoint union of:
  rest:
    rest:
      rest: nil
comment: Non-SI unit that has been accepted by SI to be used together with the SI system.
EMMO 967080e5 2f42 4eb2 a3a9 c58143e835f9: Non-SI unit that has been accepted by SI to be used together with the SI system.

NeodymiumAtom
type: Class
subclass of: Restriction
subclass of: Restriction
  has value: 144.242
subclass of: Restriction
  has value: 60
comment: Atom subclass for neodymium.
EMMO 967080e5 2f42 4eb2 a3a9 c58143e835f9: Atom subclass for neodymium.

Fluid
type: Class
disjoint union of:
  rest:
    rest:
      rest: nil
comment: A continuum that has no fixed shape and yields easily to external pressure.
example: Gas, liquid, plasma,
EMMO 967080e5 2f42 4eb2 a3a9 c58143e835f9: A continuum that has no fixed shape and yields easily to external pressure.

Arcminute
type: Class
subclass of: Restriction
  has value: 0.0002908882
subclass of: Restriction
  has value: 0.0
subclass of: Restriction
  has value: ′
comment: A minute of arc, arcminute, or minute arc (MOA), is a unit of angular measurement equal to one sixtieth (1/60) of one degree (circle/21,600), or π /10,800 radians. In turn, a second of arc or arcsecond is one sixtieth (1/60) of one minute of arc. Since one degree is defined as one three hundred and sixtieth (1/360) of a rotation, one minute of arc is 1/21,600 of a rotation. -- QUDT
alternative label: ArcMinute
alternative label: MinuteOfArc
EMMO 0b1cbe60 d380 4787 b92e be26bdacf2c2: D61
EMMO 1f1b164d ec6a 4faa 8d5e 88bda62316cc: http://qudt.org/vocab/unit/ARCMIN
EMMO 33ae2d07 5526 4555 a0b4 8f4c031b5652: '
EMMO 7f1dec83 d85e 4e1b b7bd c9442d4f5a64: '
EMMO 967080e5 2f42 4eb2 a3a9 c58143e835f9: A minute of arc, arcminute, or minute arc (MOA), is a unit of angular measurement equal to one sixtieth (1/60) of one degree (circle/21,600), or π /10,800 radians. In turn, a second of arc or arcsecond is one sixtieth (1/60) of one minute of arc. Since one degree is defined as one three hundred and sixtieth (1/360) of a rotation, one minute of arc is 1/21,600 of a rotation. -- QUDT
EMMO c84c6752 6d64 48cc 9500 e54a3c34898d: http://en.wikipedia.org/wiki/Minute_of_arc

ComputerLanguage
type: Class
comment: A formal language used to communicate with a computer.
comment: The categorisation of computer languages is based on Guide to the Software Engineering Body of Knowledge (SWEBOK(R)): Version 3.0, January 2014. Editors Pierre Bourque, Richard E. Fairley. Publisher: IEEE Computer Society PressWashingtonDCUnited States. ISBN:978-0-7695-5166-1. https://www.computer.org/education/bodies-of-knowledge/software-engineering
EMMO 967080e5 2f42 4eb2 a3a9 c58143e835f9: A formal language used to communicate with a computer.
EMMO c7b62dd7 063a 4c2a 8504 42f7264ba83f: The categorisation of computer languages is based on Guide to the Software Engineering Body of Knowledge (SWEBOK(R)): Version 3.0, January 2014. Editors Pierre Bourque, Richard E. Fairley. Publisher: IEEE Computer Society PressWashingtonDCUnited States. ISBN:978-0-7695-5166-1. https://www.computer.org/education/bodies-of-knowledge/software-engineering
EMMO c84c6752 6d64 48cc 9500 e54a3c34898d: https://en.wikipedia.org/wiki/Computer_language

MilliWattPerSquareCentiMetrePerMicroMetrePerSteradian
type: Class
subclass of: Restriction
  has value: 10000000.0
subclass of: Restriction
  has value: 0.0
alternative label: Milliwatts per square centimetre per micrometre per steradian
EMMO 1f1b164d ec6a 4faa 8d5e 88bda62316cc: http://qudt.org/vocab/unit/MilliW-PER-CentiM2-MicroM-SR
EMMO 33ae2d07 5526 4555 a0b4 8f4c031b5652: mW.cm-2.um-1.sr-1
EMMO 7f1dec83 d85e 4e1b b7bd c9442d4f5a64: mW/(cm⋅µm⋅sr)

SlowingDownArea
type: Class
comment: In an infinite homogenous medium, one-sixth of the mean square of the distance between the neutron source and the point where a neutron reaches a given energy.
EMMO 1f1b164d ec6a 4faa 8d5e 88bda62316cc: https://qudt.org/vocab/quantitykind/Slowing-DownArea
EMMO 26bf1bef d192 4da6 b0eb d2209698fb54: https://www.wikidata.org/wiki/Q98950918
EMMO 8de5d5bf db1c 40ac b698 095ba3b18578: 10-72.1
EMMO 967080e5 2f42 4eb2 a3a9 c58143e835f9: In an infinite homogenous medium, one-sixth of the mean square of the distance between the neutron source and the point where a neutron reaches a given energy.

KiloNewtonMetre
type: Class
subclass of: Restriction
  some values from: NewtonMetre
subclass of: Restriction
  has value: 1000.0
subclass of: Restriction
  has value: 0.0
comment: 1 000-fold of the product of the SI derived unit newton and the SI base unit metre -- QUDT
alternative label: Kilonewton Metre
EMMO 1f1b164d ec6a 4faa 8d5e 88bda62316cc: http://qudt.org/vocab/unit/KiloN-M
EMMO 33ae2d07 5526 4555 a0b4 8f4c031b5652: kN.m
EMMO 7f1dec83 d85e 4e1b b7bd c9442d4f5a64: kN⋅m
EMMO 967080e5 2f42 4eb2 a3a9 c58143e835f9: 1 000-fold of the product of the SI derived unit newton and the SI base unit metre -- QUDT

NewtonMetrePerSquareMetre
type: Class
subclass of: Restriction
  has value: 1.0
subclass of: Restriction
  has value: 0.0
comment: product of the SI derived unit newton and the SI base unit metre divided by the power of the SI base unit metre with the exponent 2 -- QUDT
alternative label: Newton Metre Per Square Metre
EMMO 1f1b164d ec6a 4faa 8d5e 88bda62316cc: http://qudt.org/vocab/unit/N-M-PER-M2
EMMO 33ae2d07 5526 4555 a0b4 8f4c031b5652: N.m.m-2
EMMO 7f1dec83 d85e 4e1b b7bd c9442d4f5a64: N⋅m/m²
EMMO 967080e5 2f42 4eb2 a3a9 c58143e835f9: product of the SI derived unit newton and the SI base unit metre divided by the power of the SI base unit metre with the exponent 2 -- QUDT

ShearStrain
type: Class
comment: Displacement of one surface with respect to another divided by the distance between them.
EMMO 1f1b164d ec6a 4faa 8d5e 88bda62316cc: https://qudt.org/vocab/quantitykind/ShearStrain
EMMO 26bf1bef d192 4da6 b0eb d2209698fb54: https://www.wikidata.org/wiki/Q7561704
EMMO 50c298c2 55a2 4068 b3ac 4e948c33181f: https://www.electropedia.org/iev/iev.nsf/display
EMMO 8de5d5bf db1c 40ac b698 095ba3b18578: 4-17.3
EMMO 967080e5 2f42 4eb2 a3a9 c58143e835f9: Displacement of one surface with respect to another divided by the distance between them.
EMMO fe015383 afb3 44a6 ae86 043628697aa2: https://doi.org/10.1351/goldbook.S05637

FloatData
type: Class
comment: A symbolic data representing a 32-bit floating point numbers incl. ±Inf, ±0, NaN.
EMMO 8a137e9f 579c 4e28 baca e8980eb0c3db: EquivalentTo: hasDataValue some xsd:float
EMMO 967080e5 2f42 4eb2 a3a9 c58143e835f9: A symbolic data representing a 32-bit floating point numbers incl. ±Inf, ±0, NaN.

FloatingPointData
type: Class
comment: A symbolic data representing a numerical floating point value.
EMMO 967080e5 2f42 4eb2 a3a9 c58143e835f9: A symbolic data representing a numerical floating point value.

NiobiumAtom
type: Class
subclass of: Restriction
subclass of: Restriction
  has value: 92.90637
subclass of: Restriction
  has value: 41
comment: Atom subclass for niobium.
EMMO 967080e5 2f42 4eb2 a3a9 c58143e835f9: Atom subclass for niobium.

JoulePerSecond
type: Class
subclass of: Restriction
  has value: 1.0
subclass of: Restriction
  has value: 0.0
comment: SI derived unit joule divided by the SI base unit second -- QUDT
alternative label: Joule Per Second
EMMO 1f1b164d ec6a 4faa 8d5e 88bda62316cc: http://qudt.org/vocab/unit/J-PER-SEC
EMMO 33ae2d07 5526 4555 a0b4 8f4c031b5652: J.s-1
EMMO 7f1dec83 d85e 4e1b b7bd c9442d4f5a64: J/s
EMMO 967080e5 2f42 4eb2 a3a9 c58143e835f9: SI derived unit joule divided by the SI base unit second -- QUDT

HelmholtzEnergy
type: Class
comment: Internal energy minus the product of thermodynamic temperature and entropy.
alternative label: HelmholtzFreeEnergy
EMMO 26bf1bef d192 4da6 b0eb d2209698fb54: https://www.wikidata.org/wiki/Q865821
EMMO 50c298c2 55a2 4068 b3ac 4e948c33181f: https://www.electropedia.org/iev/iev.nsf/display
EMMO 8de5d5bf db1c 40ac b698 095ba3b18578: 5-20.4
EMMO 967080e5 2f42 4eb2 a3a9 c58143e835f9: Internal energy minus the product of thermodynamic temperature and entropy.
EMMO fe015383 afb3 44a6 ae86 043628697aa2: https://doi.org/10.1351/goldbook.H02772

AverageLogarithmicEnergyDecrement
type: Class
comment: Average value of the increment of the lethargy per collision.
EMMO 1f1b164d ec6a 4faa 8d5e 88bda62316cc: https://qudt.org/vocab/quantitykind/AverageLogarithmicEnergyDecrement.html
EMMO 26bf1bef d192 4da6 b0eb d2209698fb54: https://www.wikidata.org/wiki/Q1940739
EMMO 50c298c2 55a2 4068 b3ac 4e948c33181f: https://www.electropedia.org/iev/iev.nsf/display
EMMO 8de5d5bf db1c 40ac b698 095ba3b18578: 10-70
EMMO 967080e5 2f42 4eb2 a3a9 c58143e835f9: Average value of the increment of the lethargy per collision.

Nucleon
type: Class
comment: Either a proton or a neutron.
EMMO 8a137e9f 579c 4e28 baca e8980eb0c3db: DisjointUnionOf: Proton, Neutron
EMMO 967080e5 2f42 4eb2 a3a9 c58143e835f9: Either a proton or a neutron.
EMMO c84c6752 6d64 48cc 9500 e54a3c34898d: https://en.wikipedia.org/wiki/Nucleon

SquareCoulombSquareMetrePerJoule
type: Class
subclass of: Restriction
  has value: 1.0
subclass of: Restriction
  has value: 0.0
comment: "Square Coulomb Square Meter per Joule" is a unit for 'Polarizability' expressed as C² m² J⁻¹. -- QUDT
alternative label: Square Coulomb Square Metre per Joule
EMMO 1f1b164d ec6a 4faa 8d5e 88bda62316cc: http://qudt.org/vocab/unit/C2-M2-PER-J
EMMO 33ae2d07 5526 4555 a0b4 8f4c031b5652: C2.m2.J-1
EMMO 33ae2d07 5526 4555 a0b4 8f4c031b5652: C2.m2/J
EMMO 7f1dec83 d85e 4e1b b7bd c9442d4f5a64: C²⋅m²/J
EMMO 967080e5 2f42 4eb2 a3a9 c58143e835f9: "Square Coulomb Square Meter per Joule" is a unit for 'Polarizability' expressed as C² m² J⁻¹. -- QUDT

Status
type: Class
subclass of: Restriction
comment: An object which is an holistic temporal part of a process.
alternative label: State
example: A semi-naked man is a status in the process of a man's dressing.
EMMO 967080e5 2f42 4eb2 a3a9 c58143e835f9: An object which is an holistic temporal part of a process.

ScalarData
type: Class
comment: A symbolic data that is not array data.
comment: Scalar data are primitive symbolic data that are not built up of other types of symbolic data.
EMMO 967080e5 2f42 4eb2 a3a9 c58143e835f9: A symbolic data that is not array data.
EMMO c7b62dd7 063a 4c2a 8504 42f7264ba83f: Scalar data are primitive symbolic data that are not built up of other types of symbolic data.

KiloCoulombPerCubicMetre
type: Class
subclass of: Restriction
  some values from: CoulombPerCubicMetre
subclass of: Restriction
  has value: 1000.0
subclass of: Restriction
  has value: 0.0
comment: 1 000-fold of the SI derived unit coulomb divided by the power of the SI base unit metre with the exponent 3 -- QUDT
alternative label: Kilocoulomb Per Cubic Metre
EMMO 1f1b164d ec6a 4faa 8d5e 88bda62316cc: http://qudt.org/vocab/unit/KiloC-PER-M3
EMMO 33ae2d07 5526 4555 a0b4 8f4c031b5652: kC.m-3
EMMO 7f1dec83 d85e 4e1b b7bd c9442d4f5a64: kC/m³
EMMO 967080e5 2f42 4eb2 a3a9 c58143e835f9: 1 000-fold of the SI derived unit coulomb divided by the power of the SI base unit metre with the exponent 3 -- QUDT

CategorizedPhysicalQuantity
type: Class
comment: The superclass for all physical quantities classes that are categorized according to some domain of interests (e.g. metallurgy, chemistry), property (intensive/extensive) or application.
EMMO 967080e5 2f42 4eb2 a3a9 c58143e835f9: The superclass for all physical quantities classes that are categorized according to some domain of interests (e.g. metallurgy, chemistry), property (intensive/extensive) or application.

Minimal
type: Class
comment: A minimal class M (subclass of Minimal) is defined by choosing a reference type φ so that M is subclass of φ, all parts of x are needed to keep φ(x) and x is proper part of a larger φ entity.
comment: The superclass for all classes of entities that have no proper parts of the same type of the whole is proper part of an entity of that type.
EMMO 967080e5 2f42 4eb2 a3a9 c58143e835f9: The superclass for all classes of entities that have no proper parts of the same type of the whole is proper part of an entity of that type.
EMMO c7b62dd7 063a 4c2a 8504 42f7264ba83f: A minimal class M (subclass of Minimal) is defined by choosing a reference type φ so that M is subclass of φ, all parts of x are needed to keep φ(x) and x is proper part of a larger φ entity.

ComputerSystem
type: Class
comment: Electronic device capable of processing data, typically in binary form, according to instructions given to it in a variable program.
alternative label: Computer
EMMO 967080e5 2f42 4eb2 a3a9 c58143e835f9: Electronic device capable of processing data, typically in binary form, according to instructions given to it in a variable program.
EMMO c84c6752 6d64 48cc 9500 e54a3c34898d: https://en.wikipedia.org/wiki/Computer

PerSquareJoule
type: Class
subclass of: Restriction
  has value: 1.0
subclass of: Restriction
  has value: 0.0
comment: Per Square Joule is a denominator unit with dimensions /eV². -- QUDT
alternative label: ReciprocalSquareJoule
EMMO 1f1b164d ec6a 4faa 8d5e 88bda62316cc: http://qudt.org/vocab/unit/PER-J2
EMMO 33ae2d07 5526 4555 a0b4 8f4c031b5652: J-2
EMMO 7f1dec83 d85e 4e1b b7bd c9442d4f5a64: /J²
EMMO 967080e5 2f42 4eb2 a3a9 c58143e835f9: Per Square Joule is a denominator unit with dimensions /eV². -- QUDT

ReciprocalSquareEnergyUnit
type: Class
subclass of: Restriction
  has value: T+4 L-4 M-2 I0 Θ0 N0 J0
comment: The class of units with dimensionality 'ReciprocalSquareEnergy'.
EMMO 967080e5 2f42 4eb2 a3a9 c58143e835f9: The class of units with dimensionality 'ReciprocalSquareEnergy'.

QRole
type: Class
alternative label: QualifiedRole

CommercialProduct
type: Class
comment: An product that is ready for commercialisation.
alternative label: Product
EMMO 967080e5 2f42 4eb2 a3a9 c58143e835f9: An product that is ready for commercialisation.

PhaseOfMatter
type: Class
comment: A matter object throughout which all physical properties of a material are essentially uniform.
comment: In the physical sciences, a phase is a region of space (a thermodynamic system), throughout which all physical properties of a material are essentially uniform. Examples of physical properties include density, index of refraction, magnetization and chemical composition. A simple description is that a phase is a region of material that is chemically uniform, physically distinct, and (often) mechanically separable. In a system consisting of ice and water in a glass jar, the ice cubes are one phase, the water is a second phase, and the humid air is a third phase over the ice and water. The glass of the jar is another separate phase. The term phase is sometimes used as a synonym for state of matter, but there can be several immiscible phases of the same state of matter. Also, the term phase is sometimes used to refer to a set of equilibrium states demarcated in terms of state variables such as pressure and temperature by a phase boundary on a phase diagram. Because phase boundaries relate to changes in the organization of matter, such as a change from liquid to solid or a more subtle change from one crystal structure to another, this latter usage is similar to the use of "phase" as a synonym for state of matter. However, the state of matter and phase diagram usages are not commensurate with the formal definition given above and the intended meaning must be determined in part from the context in which the term is used.
alternative label: Phase
EMMO 967080e5 2f42 4eb2 a3a9 c58143e835f9: A matter object throughout which all physical properties of a material are essentially uniform.
EMMO c7b62dd7 063a 4c2a 8504 42f7264ba83f: In the physical sciences, a phase is a region of space (a thermodynamic system), throughout which all physical properties of a material are essentially uniform. Examples of physical properties include density, index of refraction, magnetization and chemical composition. A simple description is that a phase is a region of material that is chemically uniform, physically distinct, and (often) mechanically separable. In a system consisting of ice and water in a glass jar, the ice cubes are one phase, the water is a second phase, and the humid air is a third phase over the ice and water. The glass of the jar is another separate phase. The term phase is sometimes used as a synonym for state of matter, but there can be several immiscible phases of the same state of matter. Also, the term phase is sometimes used to refer to a set of equilibrium states demarcated in terms of state variables such as pressure and temperature by a phase boundary on a phase diagram. Because phase boundaries relate to changes in the organization of matter, such as a change from liquid to solid or a more subtle change from one crystal structure to another, this latter usage is similar to the use of "phase" as a synonym for state of matter. However, the state of matter and phase diagram usages are not commensurate with the formal definition given above and the intended meaning must be determined in part from the context in which the term is used.

MilliVolt
type: Class
subclass of: Restriction
  some values from: Volt
subclass of: Restriction
  has value: 0.001
subclass of: Restriction
  has value: 0.0
comment: 0,001-fold of the SI derived unit volt -- QUDT
EMMO 1f1b164d ec6a 4faa 8d5e 88bda62316cc: http://qudt.org/vocab/unit/MilliV
EMMO 33ae2d07 5526 4555 a0b4 8f4c031b5652: mV
EMMO 7f1dec83 d85e 4e1b b7bd c9442d4f5a64: mV
EMMO 967080e5 2f42 4eb2 a3a9 c58143e835f9: 0,001-fold of the SI derived unit volt -- QUDT

TelluriumAtom
type: Class
subclass of: Restriction
subclass of: Restriction
  has value: 127.6
subclass of: Restriction
  has value: 52
comment: Atom subclass for tellurium.
EMMO 967080e5 2f42 4eb2 a3a9 c58143e835f9: Atom subclass for tellurium.

Geometrical
type: Class
comment: A 'graphical' aimed to represent a geometrical concept.
example: A geometrical object can be expressed in many different forms. For example, a line can be expressed by: a) an equation like y=mx+q, which is both an 'equation' and a 'geometrical' b) a line drawn with a pencil on a paper, which is simply a 'graphical' object c) a set of axioms, when the properties of a line are inferred by the interpreter reading them, that are both 'graphical' and also 'formula' The case a) is a geometrical and mathematical, b) is geometrical and pictorial, while c) is geometrical and a composition of idiomatic strings.
EMMO 967080e5 2f42 4eb2 a3a9 c58143e835f9: A 'graphical' aimed to represent a geometrical concept.

LiquidSolidSuspension
type: Class
comment: A coarse dispersion of solids in a liquid continuum phase.
example: Mud
EMMO 967080e5 2f42 4eb2 a3a9 c58143e835f9: A coarse dispersion of solids in a liquid continuum phase.

MathematicalFunction
type: Class
comment: A function defined using functional notation.
comment: A mathematical relation that relates each element in the domain (X) to exactly one element in the range (Y).
alternative label: FunctionDefinition
example: y = f(x)
EMMO 967080e5 2f42 4eb2 a3a9 c58143e835f9: A function defined using functional notation.

DefiningEquation
type: Class
comment: An equation that define a new variable in terms of other mathematical entities.
example: The definition of velocity as v = dx/dt. The definition of density as mass/volume. y = f(x)
EMMO 967080e5 2f42 4eb2 a3a9 c58143e835f9: An equation that define a new variable in terms of other mathematical entities.

StandardChemicalPotential
type: Class
comment: The value of the chemical potential under specified standard conditions (in the standard state).
EMMO 1f1b164d ec6a 4faa 8d5e 88bda62316cc: https://qudt.org/vocab/quantitykind/StandardChemicalPotential
EMMO 26bf1bef d192 4da6 b0eb d2209698fb54: https://www.wikidata.org/wiki/Q89333468
EMMO 8de5d5bf db1c 40ac b698 095ba3b18578: 9-21
EMMO 967080e5 2f42 4eb2 a3a9 c58143e835f9: The value of the chemical potential under specified standard conditions (in the standard state).
EMMO fe015383 afb3 44a6 ae86 043628697aa2: https://doi.org/10.1351/goldbook.S05908

Degenerency
type: Class
comment: For a quantum level, the statistical weight of that level.
alternative label: Multiplicity
EMMO 26bf1bef d192 4da6 b0eb d2209698fb54: https://www.wikidata.org/wiki/Q902301
EMMO 8de5d5bf db1c 40ac b698 095ba3b18578: 9-36.2
EMMO 967080e5 2f42 4eb2 a3a9 c58143e835f9: For a quantum level, the statistical weight of that level.
EMMO fe015383 afb3 44a6 ae86 043628697aa2: https://doi.org/10.1351/goldbook.D01556

RadonAtom
type: Class
subclass of: Restriction
subclass of: Restriction
  has value: 222.01758
subclass of: Restriction
  has value: 86
comment: Atom subclass for radon.
EMMO 967080e5 2f42 4eb2 a3a9 c58143e835f9: Atom subclass for radon.

NeutronYieldPerFission
type: Class
comment: Average number of fission neutrons, both prompt and delayed, emitted per fission event.
EMMO 1f1b164d ec6a 4faa 8d5e 88bda62316cc: https://qudt.org/vocab/quantitykind/NeutronYieldPerFission
EMMO 26bf1bef d192 4da6 b0eb d2209698fb54: https://www.wikidata.org/wiki/Q99157909
EMMO 8de5d5bf db1c 40ac b698 095ba3b18578: 10-74.1
EMMO 967080e5 2f42 4eb2 a3a9 c58143e835f9: Average number of fission neutrons, both prompt and delayed, emitted per fission event.

RelativeVolumeStrain
type: Class
comment: Quotient of change of volume and original volume.
alternative label: BulkStrain
alternative label: VolumeStrain
EMMO 1f1b164d ec6a 4faa 8d5e 88bda62316cc: https://qudt.org/vocab/quantitykind/VolumeStrain
EMMO 26bf1bef d192 4da6 b0eb d2209698fb54: https://www.wikidata.org/wiki/Q73432507
EMMO 50c298c2 55a2 4068 b3ac 4e948c33181f: https://www.electropedia.org/iev/iev.nsf/display
EMMO 8de5d5bf db1c 40ac b698 095ba3b18578: 4-17.4
EMMO 967080e5 2f42 4eb2 a3a9 c58143e835f9: Quotient of change of volume and original volume.
EMMO fe015383 afb3 44a6 ae86 043628697aa2: https://doi.org/10.1351/goldbook.V06648

SupplyChain
type: Class
comment: A supply chain is a system of organizations, people, activities, information, and resources involved in supplying a product or service to a consumer.
EMMO 967080e5 2f42 4eb2 a3a9 c58143e835f9: A supply chain is a system of organizations, people, activities, information, and resources involved in supplying a product or service to a consumer.

Network
type: Class
comment: A system whose is mainly characterised by the way in which elements are interconnected.
EMMO 967080e5 2f42 4eb2 a3a9 c58143e835f9: A system whose is mainly characterised by the way in which elements are interconnected.

TeraJoule
type: Class
subclass of: Restriction
  some values from: Joule
subclass of: Restriction
  has value: 1000000000000.0
subclass of: Restriction
  has value: 0.0
comment: 1 000 000 000 000-fold of the SI derived unit joule -- QUDT
EMMO 1f1b164d ec6a 4faa 8d5e 88bda62316cc: http://qudt.org/vocab/unit/TeraJ
EMMO 33ae2d07 5526 4555 a0b4 8f4c031b5652: TJ
EMMO 7f1dec83 d85e 4e1b b7bd c9442d4f5a64: TJ
EMMO 967080e5 2f42 4eb2 a3a9 c58143e835f9: 1 000 000 000 000-fold of the SI derived unit joule -- QUDT

MoleFraction
type: Class
subclass of: Restriction
  has value: 1.0
subclass of: Restriction
  has value: 0.0
comment: Number of one type of species divided by the number of all species.
alternative label: AtomFraction
alternative label: MolePerMole
alternative label: Moles per mole
EMMO 1f1b164d ec6a 4faa 8d5e 88bda62316cc: http://qudt.org/vocab/unit/MOL-PER-MOL
EMMO 33ae2d07 5526 4555 a0b4 8f4c031b5652: mol.mol-1
EMMO 7f1dec83 d85e 4e1b b7bd c9442d4f5a64: atom-fraction
EMMO 7f1dec83 d85e 4e1b b7bd c9442d4f5a64: atom_fraction
EMMO 7f1dec83 d85e 4e1b b7bd c9442d4f5a64: mol/mol
EMMO 7f1dec83 d85e 4e1b b7bd c9442d4f5a64: mole-fraction
EMMO 7f1dec83 d85e 4e1b b7bd c9442d4f5a64: mole_fraction
EMMO 967080e5 2f42 4eb2 a3a9 c58143e835f9: Number of one type of species divided by the number of all species.

ElectricCurrentPerAmountVolumeUnit
type: Class
subclass of: Restriction
  has value: T0 L-3 M0 I+1 Θ0 N-1 J0
comment: The class of units with dimensionality 'ElectricCurrentPerAmountVolume'.
EMMO 967080e5 2f42 4eb2 a3a9 c58143e835f9: The class of units with dimensionality 'ElectricCurrentPerAmountVolume'.

SamariumSymbol
type: Class
subclass of: Restriction
  has value: Sm
comment: The symbol that stands for the samarium atom.
EMMO 967080e5 2f42 4eb2 a3a9 c58143e835f9: The symbol that stands for the samarium atom.

RapidPrototyping
type: Class
comment: Application of additive manufacturing intended for reducing the time needed for producing prototypes.
EMMO 967080e5 2f42 4eb2 a3a9 c58143e835f9: Application of additive manufacturing intended for reducing the time needed for producing prototypes.

ReactivePower
type: Class
comment: Imaginary part of the complex power.
EMMO 1f1b164d ec6a 4faa 8d5e 88bda62316cc: https://qudt.org/vocab/quantitykind/ReactivePower
EMMO 26bf1bef d192 4da6 b0eb d2209698fb54: https://www.wikidata.org/wiki/Q2144613
EMMO 50c298c2 55a2 4068 b3ac 4e948c33181f: https://www.electropedia.org/iev/iev.nsf/display
EMMO 8de5d5bf db1c 40ac b698 095ba3b18578: 6-60
EMMO 967080e5 2f42 4eb2 a3a9 c58143e835f9: Imaginary part of the complex power.

Gray
type: Class
subclass of: Restriction
  has value: Gy
comment: SI unit for absorbed dose.
comment: The SI unit of radiation dose. Radiation carries energy, and when it is absorbed by matter the matter receives this energy. The dose is the amount of energy deposited per unit of mass. One gray is defined to be the dose of one joule of energy absorbed per kilogram of matter, or 100 rad. The unit is named for the British physician L. Harold Gray (1905-1965), an authority on the use of radiation in the treatment of cancer. -- QUDT
EMMO 0b1cbe60 d380 4787 b92e be26bdacf2c2: A95
EMMO 1f1b164d ec6a 4faa 8d5e 88bda62316cc: http://qudt.org/vocab/unit/GRAY
EMMO 33ae2d07 5526 4555 a0b4 8f4c031b5652: Gy
EMMO 6dd685dd 1895 46e4 b227 be9f7d643c25: http://dbpedia.org/resource/Grey
EMMO 967080e5 2f42 4eb2 a3a9 c58143e835f9: SI unit for absorbed dose.
EMMO c7b62dd7 063a 4c2a 8504 42f7264ba83f: The SI unit of radiation dose. Radiation carries energy, and when it is absorbed by matter the matter receives this energy. The dose is the amount of energy deposited per unit of mass. One gray is defined to be the dose of one joule of energy absorbed per kilogram of matter, or 100 rad. The unit is named for the British physician L. Harold Gray (1905-1965), an authority on the use of radiation in the treatment of cancer. -- QUDT
EMMO c84c6752 6d64 48cc 9500 e54a3c34898d: //en.wikipedia.org/wiki/Grey?oldid=494774160
EMMO fe015383 afb3 44a6 ae86 043628697aa2: https://doi.org/10.1351/goldbook.G02696

AbsorbedDoseUnit
type: Class
subclass of: Restriction
  has value: T-2 L+2 M0 I0 Θ0 N0 J0
comment: The class of units with dimensionality 'AbsorbedDose'.
EMMO 967080e5 2f42 4eb2 a3a9 c58143e835f9: The class of units with dimensionality 'AbsorbedDose'.

LiquidSol
type: Class
comment: A type of sol in the form of one solid dispersed in liquid.
EMMO 967080e5 2f42 4eb2 a3a9 c58143e835f9: A type of sol in the form of one solid dispersed in liquid.

Sol
type: Class
comment: A colloid in which small particles (1 nm to 100 nm) are suspended in a continuum phase.
EMMO 967080e5 2f42 4eb2 a3a9 c58143e835f9: A colloid in which small particles (1 nm to 100 nm) are suspended in a continuum phase.

FormingFromLiquid
type: Class

BerylliumAtom
type: Class
subclass of: Restriction
subclass of: Restriction
  has value: 9.0121831
subclass of: Restriction
  has value: 4
comment: Atom subclass for beryllium.
EMMO 967080e5 2f42 4eb2 a3a9 c58143e835f9: Atom subclass for beryllium.

KiloMolePerSecond
type: Class
subclass of: Restriction
  some values from: MolePerSecond
subclass of: Restriction
  has value: 1000.0
subclass of: Restriction
  has value: 0.0
comment: 1 000-fold of the SI base unit mol divided by the SI base unit second -- QUDT
alternative label: Kilomole Per Second
EMMO 1f1b164d ec6a 4faa 8d5e 88bda62316cc: http://qudt.org/vocab/unit/KiloMOL-PER-SEC
EMMO 33ae2d07 5526 4555 a0b4 8f4c031b5652: kmol.s-1
EMMO 7f1dec83 d85e 4e1b b7bd c9442d4f5a64: kmol/s
EMMO 967080e5 2f42 4eb2 a3a9 c58143e835f9: 1 000-fold of the SI base unit mol divided by the SI base unit second -- QUDT

FormingBlasting
type: Class
comment: Shot peening is shot peening for shaping or straightening workpieces by introducing residual compressive stresses (from: DIN 8200/10.82).
alternative label: Umformstrahlen

Hecto
type: Class
subclass of: Restriction
  has value: h
subclass of: Restriction
  has value: 100.0
comment: SI prefix who's value is 100.
EMMO 967080e5 2f42 4eb2 a3a9 c58143e835f9: SI prefix who's value is 100.

JoulePerTesla
type: Class
subclass of: Restriction
  has value: 1.0
subclass of: Restriction
  has value: 0.0
comment: The magnetic moment of a magnet is a quantity that determines the force that the magnet can exert on electric currents and the torque that a magnetic field will exert on it. A loop of electric current, a bar magnet, an electron, a molecule, and a planet all have magnetic moments. The unit for magnetic moment is not a base unit in the International System of Units (SI) and it can be represented in more than one way. For example, in the current loop definition, the area is measured in square meters and I is measured in amperes, so the magnetic moment is measured in ampere-square meters (A m2). In the equation for torque on a moment, the torque is measured in joules and the magnetic field in tesla, so the moment is measured in Joules per Tesla (J u00b7T-1). These two representations are equivalent: 1 A u00b7m2 = 1 J u00b7T-1. -- QUDT
alternative label: Joule per Tesla
EMMO 1f1b164d ec6a 4faa 8d5e 88bda62316cc: http://qudt.org/vocab/unit/J-PER-T
EMMO 33ae2d07 5526 4555 a0b4 8f4c031b5652: J.T-1
EMMO 7f1dec83 d85e 4e1b b7bd c9442d4f5a64: J/T
EMMO 967080e5 2f42 4eb2 a3a9 c58143e835f9: The magnetic moment of a magnet is a quantity that determines the force that the magnet can exert on electric currents and the torque that a magnetic field will exert on it. A loop of electric current, a bar magnet, an electron, a molecule, and a planet all have magnetic moments. The unit for magnetic moment is not a base unit in the International System of Units (SI) and it can be represented in more than one way. For example, in the current loop definition, the area is measured in square meters and I is measured in amperes, so the magnetic moment is measured in ampere-square meters (A m2). In the equation for torque on a moment, the torque is measured in joules and the magnetic field in tesla, so the moment is measured in Joules per Tesla (J u00b7T-1). These two representations are equivalent: 1 A u00b7m2 = 1 J u00b7T-1. -- QUDT

ModulusOfRigidity
type: Class
subclass of: Restriction
comment: Ratio of shear stress to the shear strain.
alternative label: ShearModulus
EMMO 1f1b164d ec6a 4faa 8d5e 88bda62316cc: https://qudt.org/vocab/quantitykind/ShearModulus
EMMO 26bf1bef d192 4da6 b0eb d2209698fb54: https://www.wikidata.org/wiki/Q461466
EMMO 50c298c2 55a2 4068 b3ac 4e948c33181f: https://www.electropedia.org/iev/iev.nsf/display
EMMO 8de5d5bf db1c 40ac b698 095ba3b18578: 4-19.2
EMMO 967080e5 2f42 4eb2 a3a9 c58143e835f9: Ratio of shear stress to the shear strain.
EMMO fe015383 afb3 44a6 ae86 043628697aa2: https://doi.org/10.1351/goldbook.S05635

ParticipantByAgency
type: Class

SquareMetreSquareHertz
type: Class
subclass of: Restriction
  has value: 1.0
subclass of: Restriction
  has value: 0.0
comment: Square metre and square Hertz.
EMMO 1f1b164d ec6a 4faa 8d5e 88bda62316cc: http://qudt.org/vocab/unit/M2-HZ2
EMMO 33ae2d07 5526 4555 a0b4 8f4c031b5652: m2.Hz2
EMMO 7f1dec83 d85e 4e1b b7bd c9442d4f5a64: m²⋅Hz²
EMMO 967080e5 2f42 4eb2 a3a9 c58143e835f9: Square metre and square Hertz.

KiloHertz
type: Class
subclass of: Restriction
  some values from: Hertz
subclass of: Restriction
  has value: 1000.0
subclass of: Restriction
  has value: 0.0
comment: "Kilohertz" is a C.G.S System unit for 'Frequency' expressed as KHz. -- QUDT
EMMO 1f1b164d ec6a 4faa 8d5e 88bda62316cc: http://qudt.org/vocab/unit/KiloHZ
EMMO 33ae2d07 5526 4555 a0b4 8f4c031b5652: kHz
EMMO 7f1dec83 d85e 4e1b b7bd c9442d4f5a64: kHz
EMMO 967080e5 2f42 4eb2 a3a9 c58143e835f9: "Kilohertz" is a C.G.S System unit for 'Frequency' expressed as KHz. -- QUDT

OrganicCompound
type: Class

SquareKelvin
type: Class
subclass of: Restriction
  has value: 1.0
subclass of: Restriction
  has value: 0.0
comment: Square Kelvin.
EMMO 1f1b164d ec6a 4faa 8d5e 88bda62316cc: http://qudt.org/vocab/unit/K2
EMMO 33ae2d07 5526 4555 a0b4 8f4c031b5652: K2
EMMO 7f1dec83 d85e 4e1b b7bd c9442d4f5a64: K²
EMMO 967080e5 2f42 4eb2 a3a9 c58143e835f9: Square Kelvin.

SquareTemperatureUnit
type: Class
subclass of: Restriction
  has value: T0 L0 M0 I0 Θ+2 N0 J0
comment: The class of units with dimensionality 'SquareTemperature'.
EMMO 967080e5 2f42 4eb2 a3a9 c58143e835f9: The class of units with dimensionality 'SquareTemperature'.

JunctionTile
type: Class
subclass of: Restriction
comment: A direct part that is obtained by partitioning a whole hybridly in spatial, temporal and spatiotemporal parts.
EMMO 967080e5 2f42 4eb2 a3a9 c58143e835f9: A direct part that is obtained by partitioning a whole hybridly in spatial, temporal and spatiotemporal parts.

MilliOhm
type: Class
subclass of: Restriction
  some values from: Ohm
subclass of: Restriction
  has value: 0.001
subclass of: Restriction
  has value: 0.0
comment: 0.001-fold of the SI derived unit ohm -- QUDT
EMMO 1f1b164d ec6a 4faa 8d5e 88bda62316cc: http://qudt.org/vocab/unit/MilliOHM
EMMO 33ae2d07 5526 4555 a0b4 8f4c031b5652: mOhm
EMMO 7f1dec83 d85e 4e1b b7bd c9442d4f5a64: mΩ
EMMO 967080e5 2f42 4eb2 a3a9 c58143e835f9: 0.001-fold of the SI derived unit ohm -- QUDT

PicoPascal
type: Class
subclass of: Restriction
  some values from: Pascal
subclass of: Restriction
  has value: 1e-12
subclass of: Restriction
  has value: 0.0
EMMO 1f1b164d ec6a 4faa 8d5e 88bda62316cc: http://qudt.org/vocab/unit/PicoPA
EMMO 7f1dec83 d85e 4e1b b7bd c9442d4f5a64: pPa

NewtonCentiMetre
type: Class
subclass of: Restriction
  has value: 0.01
subclass of: Restriction
  has value: 0.0
comment: product of the SI derived unit newton and the 0.01-fold of the SI base unit metre -- QUDT
alternative label: Newton Centimetre
EMMO 1f1b164d ec6a 4faa 8d5e 88bda62316cc: http://qudt.org/vocab/unit/N-CentiM
EMMO 33ae2d07 5526 4555 a0b4 8f4c031b5652: N.cm
EMMO 7f1dec83 d85e 4e1b b7bd c9442d4f5a64: N⋅cm
EMMO 967080e5 2f42 4eb2 a3a9 c58143e835f9: product of the SI derived unit newton and the 0.01-fold of the SI base unit metre -- QUDT

SuperconductionTransitionTemperature
type: Class
comment: Critical thermodynamic temperature of a superconductor.
EMMO 1f1b164d ec6a 4faa 8d5e 88bda62316cc: https://qudt.org/vocab/quantitykind/SuperconductionTransitionTemperature
EMMO 26bf1bef d192 4da6 b0eb d2209698fb54: https://www.wikidata.org/wiki/Q106103037
EMMO 50c298c2 55a2 4068 b3ac 4e948c33181f: https://www.electropedia.org/iev/iev.nsf/display
EMMO 8de5d5bf db1c 40ac b698 095ba3b18578: 12-35.3
EMMO 967080e5 2f42 4eb2 a3a9 c58143e835f9: Critical thermodynamic temperature of a superconductor.

CriticalTemperature
type: Class
comment: Temperature below which quantum effects dominate.
EMMO 26bf1bef d192 4da6 b0eb d2209698fb54: https://www.wikidata.org/wiki/Q1450516
EMMO 967080e5 2f42 4eb2 a3a9 c58143e835f9: Temperature below which quantum effects dominate.

NanoMolePerCubicCentiMetrePerHour
type: Class
subclass of: Restriction
  has value: 2.777778e-07
subclass of: Restriction
  has value: 0.0
alternative label: Nanomoles per cubic centimetre per hour
EMMO 1f1b164d ec6a 4faa 8d5e 88bda62316cc: http://qudt.org/vocab/unit/NanoMOL-PER-CentiM3-HR
EMMO 33ae2d07 5526 4555 a0b4 8f4c031b5652: nmol.cm-3.h-1
EMMO 7f1dec83 d85e 4e1b b7bd c9442d4f5a64: nmol/(cm³⋅hr)

CubicMetrePerSquareSecond
type: Class
subclass of: Restriction
  has value: 1.0
subclass of: Restriction
  has value: 0.0
comment: `Cubic Meter per Square Second` is a C.G.S System unit for `Standard Gravitational Parameter` expressed as m³/s² -- QUDT
alternative label: Cubic Metre per Square Second
EMMO 1f1b164d ec6a 4faa 8d5e 88bda62316cc: http://qudt.org/vocab/unit/M3-PER-SEC2
EMMO 33ae2d07 5526 4555 a0b4 8f4c031b5652: m3.s-2
EMMO 33ae2d07 5526 4555 a0b4 8f4c031b5652: m3/s2
EMMO 7f1dec83 d85e 4e1b b7bd c9442d4f5a64: m³/s²
EMMO 967080e5 2f42 4eb2 a3a9 c58143e835f9: `Cubic Meter per Square Second` is a C.G.S System unit for `Standard Gravitational Parameter` expressed as m³/s² -- QUDT

VolumePerSquareTimeUnit
type: Class
subclass of: Restriction
  has value: T-2 L+3 M0 I0 Θ0 N0 J0
comment: The class of units with dimensionality 'VolumePerSquareTime'.
EMMO 967080e5 2f42 4eb2 a3a9 c58143e835f9: The class of units with dimensionality 'VolumePerSquareTime'.

CubicKiloMetrePerSquareSecond
type: Class
subclass of: Restriction
  has value: 1000000000.0
subclass of: Restriction
  has value: 0.0
comment: `Cubic Kilometer per Square Second` is a unit for `Standard Gravitational Parameter` expressed as km³/s². -- QUDT
alternative label: Cubic Kilometre per Square Second
EMMO 1f1b164d ec6a 4faa 8d5e 88bda62316cc: http://qudt.org/vocab/unit/KiloM3-PER-SEC2
EMMO 33ae2d07 5526 4555 a0b4 8f4c031b5652: km3.s-2
EMMO 33ae2d07 5526 4555 a0b4 8f4c031b5652: km3/s2
EMMO 7f1dec83 d85e 4e1b b7bd c9442d4f5a64: km³/s²
EMMO 967080e5 2f42 4eb2 a3a9 c58143e835f9: `Cubic Kilometer per Square Second` is a unit for `Standard Gravitational Parameter` expressed as km³/s². -- QUDT

NanoCoulomb
type: Class
subclass of: Restriction
  some values from: Coulomb
subclass of: Restriction
  has value: 1e-09
subclass of: Restriction
  has value: 0.0
comment: A NanoCoulomb is 10⁻⁹ C. -- QUDT
EMMO 1f1b164d ec6a 4faa 8d5e 88bda62316cc: http://qudt.org/vocab/unit/NanoC
EMMO 33ae2d07 5526 4555 a0b4 8f4c031b5652: nC
EMMO 7f1dec83 d85e 4e1b b7bd c9442d4f5a64: nC
EMMO 967080e5 2f42 4eb2 a3a9 c58143e835f9: A NanoCoulomb is 10⁻⁹ C. -- QUDT

MaterialByType
type: Class

ClassicallyDefinedMaterial
type: Class
EMMO 8a137e9f 579c 4e28 baca e8980eb0c3db: Equivalent To: AmorphousMaterial or CrystallineMaterial
EMMO 8a137e9f 579c 4e28 baca e8980eb0c3db: Equivalent To: MetallicMaterial or CeramicMaterial or CompositeMaterial or PolymericMaterial

SpecificInternalEnergy
type: Class
comment: Internal energy per unit mass.
EMMO 1f1b164d ec6a 4faa 8d5e 88bda62316cc: https://qudt.org/vocab/quantitykind/SpecificInternalEnergy
EMMO 26bf1bef d192 4da6 b0eb d2209698fb54: https://www.wikidata.org/wiki/Q76357367
EMMO 8de5d5bf db1c 40ac b698 095ba3b18578: 5-21.2
EMMO 967080e5 2f42 4eb2 a3a9 c58143e835f9: Internal energy per unit mass.

MeanMassRange
type: Class
subclass of: Restriction
comment: Product of the mean linear range R and the mass density ρ of the material.
EMMO 1f1b164d ec6a 4faa 8d5e 88bda62316cc: https://qudt.org/vocab/quantitykind/MeanMassRange
EMMO 26bf1bef d192 4da6 b0eb d2209698fb54: https://www.wikidata.org/wiki/Q98681670
EMMO 8de5d5bf db1c 40ac b698 095ba3b18578: 10-57
EMMO 967080e5 2f42 4eb2 a3a9 c58143e835f9: Product of the mean linear range R and the mass density ρ of the material.
EMMO fe015383 afb3 44a6 ae86 043628697aa2: https://doi.org/10.1351/goldbook.M03783

SquareMetrePerSteradian
type: Class
subclass of: Restriction
  has value: 1.0
subclass of: Restriction
  has value: 0.0
comment: Square metre per steradian.
EMMO 1f1b164d ec6a 4faa 8d5e 88bda62316cc: http://qudt.org/vocab/unit/M2-PER-SR
EMMO 33ae2d07 5526 4555 a0b4 8f4c031b5652: m2.sr-1
EMMO 7f1dec83 d85e 4e1b b7bd c9442d4f5a64: m²/sr
EMMO 967080e5 2f42 4eb2 a3a9 c58143e835f9: Square metre per steradian.
EMMO c84c6752 6d64 48cc 9500 e54a3c34898d: http://en.wikipedia.org/wiki/Steradian

Intensity
type: Class
subclass of: Restriction
comment: Power transferred per unit area.
EMMO 967080e5 2f42 4eb2 a3a9 c58143e835f9: Power transferred per unit area.
EMMO c84c6752 6d64 48cc 9500 e54a3c34898d: https://en.wikipedia.org/wiki/Intensity_(physics)

TotalIonization
type: Class
comment: Quotient of the total mean charge of all positive ions produced by an ionizing charged particle along its entire path and along the paths of any secondary charged particles, and the elementary charge.
EMMO 1f1b164d ec6a 4faa 8d5e 88bda62316cc: https://qudt.org/vocab/quantitykind/TotalIonization
EMMO 26bf1bef d192 4da6 b0eb d2209698fb54: https://www.wikidata.org/wiki/Q98690787
EMMO 8de5d5bf db1c 40ac b698 095ba3b18578: 10-59
EMMO 967080e5 2f42 4eb2 a3a9 c58143e835f9: Quotient of the total mean charge of all positive ions produced by an ionizing charged particle along its entire path and along the paths of any secondary charged particles, and the elementary charge.

MicroPascal
type: Class
subclass of: Restriction
  has value: 1e-06
subclass of: Restriction
  has value: 0.0
comment: 0.000001-fold of the SI derived unit pascal -- QUDT
EMMO 1f1b164d ec6a 4faa 8d5e 88bda62316cc: http://qudt.org/vocab/unit/MicroPA
EMMO 33ae2d07 5526 4555 a0b4 8f4c031b5652: uPa
EMMO 7f1dec83 d85e 4e1b b7bd c9442d4f5a64: μPa
EMMO 967080e5 2f42 4eb2 a3a9 c58143e835f9: 0.000001-fold of the SI derived unit pascal -- QUDT

CondensedMatter
type: Class
equivalent class: Class
comment: The subject of condensed matter physics that deals with the macroscopic and microscopic physical properties of matter, especially the solid and liquid phases which arise from electromagnetic forces between atoms. More generally, the subject deals with "condensed" phases of matter: systems of many constituents with strong interactions between them.
EMMO 31252f35 c767 4b97 a877 1235076c3e13: The subject of condensed matter physics that deals with the macroscopic and microscopic physical properties of matter, especially the solid and liquid phases which arise from electromagnetic forces between atoms. More generally, the subject deals with "condensed" phases of matter: systems of many constituents with strong interactions between them.
EMMO 8a137e9f 579c 4e28 baca e8980eb0c3db: Equivalent To: Liquid or Solid

StateOfMatter
type: Class
comment: A superclass made as the disjoint union of all the form under which matter can exist.
comment: In physics, a state of matter is one of the distinct forms in which matter can exist. Four states of matter are observable in everyday life: solid, liquid, gas, and plasma.
EMMO 8a137e9f 579c 4e28 baca e8980eb0c3db: Disjoint Union Of: Gas, Plasma, Liquid, Solid
EMMO 967080e5 2f42 4eb2 a3a9 c58143e835f9: A superclass made as the disjoint union of all the form under which matter can exist.
EMMO c7b62dd7 063a 4c2a 8504 42f7264ba83f: In physics, a state of matter is one of the distinct forms in which matter can exist. Four states of matter are observable in everyday life: solid, liquid, gas, and plasma.
EMMO c84c6752 6d64 48cc 9500 e54a3c34898d: https://en.wikipedia.org/wiki/State_of_matter

PhysicalBasedSimulationSoftware
type: Class
comment: A computational application that uses a physical model to predict the behaviour of a system, providing a identifiable analogy with the original object.
EMMO 967080e5 2f42 4eb2 a3a9 c58143e835f9: A computational application that uses a physical model to predict the behaviour of a system, providing a identifiable analogy with the original object.

SimulationApplication
type: Class
comment: An application aimed to functionally reproduce an object.
example: An application that predicts the pressure drop of a fluid in a pipe segment is aimed to functionally reproduce the outcome of a measurement of pressure before and after the segment.
EMMO 967080e5 2f42 4eb2 a3a9 c58143e835f9: An application aimed to functionally reproduce an object.

Polynomial
type: Class
example: 2 * x^2 + x + 3

AlgebraicExpression
type: Class
comment: An expression that has parts only integer constants, variables, and the algebraic operations (addition, subtraction, multiplication, division and exponentiation by an exponent that is a rational number)
example: 2x+3

ElectricResistivity
type: Class
subclass of: Restriction
comment: Electric field strength divided by the current density.
alternative label: Resistivity
EMMO 1f1b164d ec6a 4faa 8d5e 88bda62316cc: http://qudt.org/vocab/quantitykind/Resistivity
EMMO 26bf1bef d192 4da6 b0eb d2209698fb54: https://www.wikidata.org/wiki/Q108193
EMMO 50c298c2 55a2 4068 b3ac 4e948c33181f: https://www.electropedia.org/iev/iev.nsf/display
EMMO 8de5d5bf db1c 40ac b698 095ba3b18578: 6-44
EMMO 967080e5 2f42 4eb2 a3a9 c58143e835f9: Electric field strength divided by the current density.
EMMO fe015383 afb3 44a6 ae86 043628697aa2: https://doi.org/10.1351/goldbook.R05316

MicroSecond
type: Class
subclass of: Restriction
  some values from: Second
subclass of: Restriction
  has value: 1e-06
subclass of: Restriction
  has value: 0.0
comment: "Microsecond" is a unit for 'Time' expressed as microsec. -- QUDT
alternative label: microsecond
EMMO 1f1b164d ec6a 4faa 8d5e 88bda62316cc: http://qudt.org/vocab/unit/MicroSEC
EMMO 33ae2d07 5526 4555 a0b4 8f4c031b5652: us
EMMO 7f1dec83 d85e 4e1b b7bd c9442d4f5a64: µs
EMMO 967080e5 2f42 4eb2 a3a9 c58143e835f9: "Microsecond" is a unit for 'Time' expressed as microsec. -- QUDT

PerCubicMetreSecond
type: Class
subclass of: Restriction
  has value: 1.0
subclass of: Restriction
  has value: 0.0
comment: Per cubic metre and second.
EMMO 1f1b164d ec6a 4faa 8d5e 88bda62316cc: http://qudt.org/vocab/unit/PER-M3-SEC
EMMO 33ae2d07 5526 4555 a0b4 8f4c031b5652: m-3.s-1
EMMO 7f1dec83 d85e 4e1b b7bd c9442d4f5a64: /(m³⋅s)
EMMO 967080e5 2f42 4eb2 a3a9 c58143e835f9: Per cubic metre and second.

FrequencyPerVolumeUnit
type: Class
subclass of: Restriction
  has value: T-1 L-3 M0 I0 Θ0 N0 J0
comment: The class of units with dimensionality 'FrequencyPerVolume'.
EMMO 967080e5 2f42 4eb2 a3a9 c58143e835f9: The class of units with dimensionality 'FrequencyPerVolume'.

GoldSymbol
type: Class
subclass of: Restriction
  has value: Au
comment: The symbol that stands for the gold atom.
EMMO 967080e5 2f42 4eb2 a3a9 c58143e835f9: The symbol that stands for the gold atom.

MassDefect
type: Class
comment: Sum of the product of the proton number and the hydrogen atomic mass, and the neutron rest mass, minus the rest mass of the atom.
EMMO 1f1b164d ec6a 4faa 8d5e 88bda62316cc: https://qudt.org/vocab/quantitykind/MassDefect
EMMO 26bf1bef d192 4da6 b0eb d2209698fb54: https://www.wikidata.org/wiki/Q26897126
EMMO 8de5d5bf db1c 40ac b698 095ba3b18578: 10-21.2
EMMO 967080e5 2f42 4eb2 a3a9 c58143e835f9: Sum of the product of the proton number and the hydrogen atomic mass, and the neutron rest mass, minus the rest mass of the atom.

ElectricFieldStrength
type: Class
subclass of: Restriction
comment: Vector field quantity E which exerts on any charged particle at rest a force F equal to the product of E and the electric charge Q of the particle.
EMMO 1f1b164d ec6a 4faa 8d5e 88bda62316cc: https://qudt.org/vocab/quantitykind/ElectricFieldStrength
EMMO 26bf1bef d192 4da6 b0eb d2209698fb54: https://www.wikidata.org/wiki/Q20989
EMMO 50c298c2 55a2 4068 b3ac 4e948c33181f: https://www.electropedia.org/iev/iev.nsf/display
EMMO 8de5d5bf db1c 40ac b698 095ba3b18578: 6-10
EMMO 967080e5 2f42 4eb2 a3a9 c58143e835f9: Vector field quantity E which exerts on any charged particle at rest a force F equal to the product of E and the electric charge Q of the particle.

MaterialRelation
type: Class
comment: A material_relation can e.g. return a predefined number, return a database query, be an equation that depends on other physics_quantities.
comment: An 'equation' that stands for a physical assumption specific to a material, and provides an expression for a 'physics_quantity' (the dependent variable) as function of other variables, physics_quantity or data (independent variables).
example: The Lennard-Jones potential. A force field. An Hamiltonian.
EMMO 967080e5 2f42 4eb2 a3a9 c58143e835f9: An 'equation' that stands for a physical assumption specific to a material, and provides an expression for a 'physics_quantity' (the dependent variable) as function of other variables, physics_quantity or data (independent variables).

CausalParticle
type: Class
comment: A causal particle represents the most elementary entity in physics, being it a simple state of an elementary particle, called quantum in the EMMO, or a chain of causally connected quanta.
comment: The class of individuals representing causal particles.
comment: The disjoint union of CausalPath and Quantum classes.
EMMO 31252f35 c767 4b97 a877 1235076c3e13: A causal particle represents the most elementary entity in physics, being it a simple state of an elementary particle, called quantum in the EMMO, or a chain of causally connected quanta.
EMMO 70fe84ff 99b6 4206 a9fc 9a8931836d84: The disjoint union of CausalPath and Quantum classes.
EMMO 8a137e9f 579c 4e28 baca e8980eb0c3db: EquivalentTo: CausalPath or Quantum
EMMO 967080e5 2f42 4eb2 a3a9 c58143e835f9: The class of individuals representing causal particles.

MegaCoulomb
type: Class
subclass of: Restriction
  some values from: Coulomb
subclass of: Restriction
  has value: 1000000.0
subclass of: Restriction
  has value: 0.0
comment: A MegaCoulomb is 10⁶ C. -- QUDT
EMMO 1f1b164d ec6a 4faa 8d5e 88bda62316cc: http://qudt.org/vocab/unit/MegaC
EMMO 33ae2d07 5526 4555 a0b4 8f4c031b5652: MC
EMMO 7f1dec83 d85e 4e1b b7bd c9442d4f5a64: MC
EMMO 967080e5 2f42 4eb2 a3a9 c58143e835f9: A MegaCoulomb is 10⁶ C. -- QUDT

Becquerel
type: Class
subclass of: Restriction
  has value: Bq
comment: Radioactive decays per second.
comment: SI unit for radioactive activity.
comment: The SI derived unit of activity, usually meaning radioactivity. "Radioactivity" is caused when atoms disintegrate, ejecting energetic particles. One becquerel is the radiation caused by one disintegration per second; this is equivalent to about 27.0270 picocuries (pCi). The unit is named for a French physicist, Antoine-Henri Becquerel (1852-1908), the discoverer of radioactivity. Note: both the becquerel and the hertz are basically defined as one event per second, yet they measure different things. The hertz is used to measure the rates of events that happen periodically in a fixed and definite cycle. The becquerel is used to measure the rates of events that happen sporadically and unpredictably, not in a definite cycle. -- QUDT
EMMO 0b1cbe60 d380 4787 b92e be26bdacf2c2: BQL
EMMO 1f1b164d ec6a 4faa 8d5e 88bda62316cc: http://qudt.org/vocab/unit/BQ
EMMO 33ae2d07 5526 4555 a0b4 8f4c031b5652: Bq
EMMO 6dd685dd 1895 46e4 b227 be9f7d643c25: http://dbpedia.org/resource/Becquerel
EMMO 70fe84ff 99b6 4206 a9fc 9a8931836d84: Radioactive decays per second.
EMMO 967080e5 2f42 4eb2 a3a9 c58143e835f9: SI unit for radioactive activity.
EMMO c7b62dd7 063a 4c2a 8504 42f7264ba83f: The SI derived unit of activity, usually meaning radioactivity. "Radioactivity" is caused when atoms disintegrate, ejecting energetic particles. One becquerel is the radiation caused by one disintegration per second; this is equivalent to about 27.0270 picocuries (pCi). The unit is named for a French physicist, Antoine-Henri Becquerel (1852-1908), the discoverer of radioactivity. Note: both the becquerel and the hertz are basically defined as one event per second, yet they measure different things. The hertz is used to measure the rates of events that happen periodically in a fixed and definite cycle. The becquerel is used to measure the rates of events that happen sporadically and unpredictably, not in a definite cycle. -- QUDT
EMMO c84c6752 6d64 48cc 9500 e54a3c34898d: http://en.wikipedia.org/wiki/Becquerel
EMMO fe015383 afb3 44a6 ae86 043628697aa2: https://doi.org/10.1351/goldbook.B00624

Foam
type: Class
comment: A colloid formed by trapping pockets of gas in a liquid or solid.
EMMO 967080e5 2f42 4eb2 a3a9 c58143e835f9: A colloid formed by trapping pockets of gas in a liquid or solid.

KiloNewton
type: Class
subclass of: Restriction
  some values from: Newton
subclass of: Restriction
  has value: 1000.0
subclass of: Restriction
  has value: 0.0
comment: 1 000-fold of the SI derived unit newton -- QUDT
EMMO 1f1b164d ec6a 4faa 8d5e 88bda62316cc: http://qudt.org/vocab/unit/KiloN
EMMO 33ae2d07 5526 4555 a0b4 8f4c031b5652: kN
EMMO 7f1dec83 d85e 4e1b b7bd c9442d4f5a64: kN
EMMO 967080e5 2f42 4eb2 a3a9 c58143e835f9: 1 000-fold of the SI derived unit newton -- QUDT

ModellingLanguage
type: Class
comment: An artificial computer language used to express information or knowledge, often for use in computer system design.
example: Architecture description language – used as a language (or a conceptual model) to describe and represent system architectures.
example: Hardware description language – used to model integrated circuits. Architecture description language – used as a language (or a conceptual model) to describe and represent system architectures. Algebraic Modeling Language which is a high-level programming languages for describing and solving high complexity problems like large-scale optimisation.
EMMO 967080e5 2f42 4eb2 a3a9 c58143e835f9: An artificial computer language used to express information or knowledge, often for use in computer system design.
EMMO c84c6752 6d64 48cc 9500 e54a3c34898d: https://en.wikipedia.org/wiki/Modeling_language

Kelvin
type: Class
subclass of: Restriction
  has value: K
comment: The kelvin, symbol K, is the SI unit of thermodynamic temperature. It is defined by taking the fixed numerical value of the Boltzmann constant k to be 1.380649×10−23 when expressed in the unit J K−1, which is equal to kg m2 s−2 K−1, where the kilogram, metre and second are defined in terms of h, c and ∆νCs.
EMMO 0b1cbe60 d380 4787 b92e be26bdacf2c2: KEL
EMMO 1f1b164d ec6a 4faa 8d5e 88bda62316cc: http://qudt.org/vocab/unit/K
EMMO 33ae2d07 5526 4555 a0b4 8f4c031b5652: K
EMMO 6dd685dd 1895 46e4 b227 be9f7d643c25: http://dbpedia.org/resource/Kelvin
EMMO 70fe84ff 99b6 4206 a9fc 9a8931836d84: The kelvin, symbol K, is the SI unit of thermodynamic temperature. It is defined by taking the fixed numerical value of the Boltzmann constant k to be 1.380649×10−23 when expressed in the unit J K−1, which is equal to kg m2 s−2 K−1, where the kilogram, metre and second are defined in terms of h, c and ∆νCs.
EMMO c84c6752 6d64 48cc 9500 e54a3c34898d: http://en.wikipedia.org/wiki/Kelvin
EMMO fe015383 afb3 44a6 ae86 043628697aa2: https://doi.org/10.1351/goldbook.K03374

LengthTimePerMassUnit
type: Class
subclass of: Restriction
  has value: T+1 L+1 M-1 I0 Θ0 N0 J0
comment: The class of units with dimensionality 'LengthTimePerMass'.
EMMO 967080e5 2f42 4eb2 a3a9 c58143e835f9: The class of units with dimensionality 'LengthTimePerMass'.

ThermalDiffusionFactor
type: Class
comment: Quotient of the thermal diffusion ratio and the product of the local amount-of-substance fractions.
EMMO 1f1b164d ec6a 4faa 8d5e 88bda62316cc: https://qudt.org/vocab/quantitykind/ThermalDiffusionFactor
EMMO 26bf1bef d192 4da6 b0eb d2209698fb54: https://www.wikidata.org/wiki/Q96249629
EMMO 8de5d5bf db1c 40ac b698 095ba3b18578: 9-40.2
EMMO 967080e5 2f42 4eb2 a3a9 c58143e835f9: Quotient of the thermal diffusion ratio and the product of the local amount-of-substance fractions.

ThermalDiffusionRatio
type: Class
comment: In a steady-state of a binary mixture in which thermal diffusion occurs; proportionality factor between gradient of the amount-of-subsstance fraction of the heavier substance B, and negative gradient of the local thermodynamic temperature divided by that temperature.
EMMO 1f1b164d ec6a 4faa 8d5e 88bda62316cc: https://qudt.org/vocab/quantitykind/ThermalDiffusionRatio
EMMO 26bf1bef d192 4da6 b0eb d2209698fb54: https://www.wikidata.org/wiki/Q96249433
EMMO 8de5d5bf db1c 40ac b698 095ba3b18578: 9-40.1
EMMO 967080e5 2f42 4eb2 a3a9 c58143e835f9: In a steady-state of a binary mixture in which thermal diffusion occurs; proportionality factor between gradient of the amount-of-subsstance fraction of the heavier substance B, and negative gradient of the local thermodynamic temperature divided by that temperature.

LatticeVector
type: Class
subclass of: Restriction
comment: translation vector that maps the crystal lattice on itself
EMMO 1f1b164d ec6a 4faa 8d5e 88bda62316cc: https://qudt.org/vocab/quantitykind/LatticeVector
EMMO 26bf1bef d192 4da6 b0eb d2209698fb54: https://www.wikidata.org/wiki/Q105435234
EMMO 8de5d5bf db1c 40ac b698 095ba3b18578: 12-1.1
EMMO 967080e5 2f42 4eb2 a3a9 c58143e835f9: translation vector that maps the crystal lattice on itself

Displacement
type: Class
comment: vector quantity between any two points in space
EMMO 1f1b164d ec6a 4faa 8d5e 88bda62316cc: https://qudt.org/vocab/quantitykind/Displacement
EMMO 26bf1bef d192 4da6 b0eb d2209698fb54: https://www.wikidata.org/wiki/Q190291
EMMO 50c298c2 55a2 4068 b3ac 4e948c33181f: https://www.electropedia.org/iev/iev.nsf/display
EMMO 6dd685dd 1895 46e4 b227 be9f7d643c25: https://dbpedia.org/page/Displacement_(geometry)
EMMO 8de5d5bf db1c 40ac b698 095ba3b18578: 3-1.11
EMMO 967080e5 2f42 4eb2 a3a9 c58143e835f9: vector quantity between any two points in space
EMMO c84c6752 6d64 48cc 9500 e54a3c34898d: https://en.wikipedia.org/wiki/Displacement_(geometry)

EmpiricalFormula
type: Class
comment: An expression that provide information about the element type of a compound and their relative ratio.
example: Hydrogen peroxide is HO
EMMO 967080e5 2f42 4eb2 a3a9 c58143e835f9: An expression that provide information about the element type of a compound and their relative ratio.

ChemicalFormula
type: Class
subclass of: Restriction
comment: A chemical formula may also include other symbols such as parentheses, plus and minus signs, brackets
comment: A symbolic construct that provides informations about the chemical proportions of the elements that constitute a chemical compound or a specific molecule.
EMMO 967080e5 2f42 4eb2 a3a9 c58143e835f9: A symbolic construct that provides informations about the chemical proportions of the elements that constitute a chemical compound or a specific molecule.

WeberPerMetre
type: Class
subclass of: Restriction
  has value: 1.0
subclass of: Restriction
  has value: 0.0
comment: SI derived unit weber divided by the SI base unit metre -- QUDT
alternative label: Weber Per Metre
EMMO 1f1b164d ec6a 4faa 8d5e 88bda62316cc: http://qudt.org/vocab/unit/WB-PER-M
EMMO 33ae2d07 5526 4555 a0b4 8f4c031b5652: Wb.m-1
EMMO 7f1dec83 d85e 4e1b b7bd c9442d4f5a64: Wb/m
EMMO 967080e5 2f42 4eb2 a3a9 c58143e835f9: SI derived unit weber divided by the SI base unit metre -- QUDT

DebyeAngularFrequency
type: Class
comment: Cut-off angular frequency in the Debye model of the vibrational spectrum of a solid.
EMMO 1f1b164d ec6a 4faa 8d5e 88bda62316cc: https://qudt.org/vocab/quantitykind/DebyeAngularFrequency
EMMO 26bf1bef d192 4da6 b0eb d2209698fb54: https://www.wikidata.org/wiki/Q105580986
EMMO 8de5d5bf db1c 40ac b698 095ba3b18578: 12-10
EMMO 967080e5 2f42 4eb2 a3a9 c58143e835f9: Cut-off angular frequency in the Debye model of the vibrational spectrum of a solid.

MeanDurationOfLife
type: Class
comment: Reciprocal of the decay constant λ.
alternative label: MeanLifeTime
EMMO 1f1b164d ec6a 4faa 8d5e 88bda62316cc: https://qudt.org/vocab/quantitykind/MeanLifetime
EMMO 1f1b164d ec6a 4faa 8d5e 88bda62316cc: https://www.wikidata.org/wiki/Q1758559
EMMO 50c298c2 55a2 4068 b3ac 4e948c33181f: https://www.electropedia.org/iev/iev.nsf/display
EMMO 8de5d5bf db1c 40ac b698 095ba3b18578: 10-25
EMMO 967080e5 2f42 4eb2 a3a9 c58143e835f9: Reciprocal of the decay constant λ.

KryptonSymbol
type: Class
subclass of: Restriction
  has value: Kr
comment: The symbol that stands for the krypton atom.
EMMO 967080e5 2f42 4eb2 a3a9 c58143e835f9: The symbol that stands for the krypton atom.

StrontiumSymbol
type: Class
subclass of: Restriction
  has value: Sr
comment: The symbol that stands for the strontium atom.
EMMO 967080e5 2f42 4eb2 a3a9 c58143e835f9: The symbol that stands for the strontium atom.

LiquidFoam
type: Class
comment: A foam of trapped gas in a liquid.
EMMO 967080e5 2f42 4eb2 a3a9 c58143e835f9: A foam of trapped gas in a liquid.

SquareMetrePerSquareMetre
type: Class
subclass of: Restriction
  has value: 1.0
subclass of: Restriction
  has value: 0.0
comment: A square metre unit of area per square metre -- QUDT
alternative label: square metre per square metre
EMMO 1f1b164d ec6a 4faa 8d5e 88bda62316cc: http://qudt.org/vocab/unit/M2-PER-M2
EMMO 7f1dec83 d85e 4e1b b7bd c9442d4f5a64: m²/m²
EMMO 967080e5 2f42 4eb2 a3a9 c58143e835f9: A square metre unit of area per square metre -- QUDT

WorkFunction
type: Class
comment: Least energy required for the emission of a conduction electron.
comment: Work function is the energy difference between an electron at rest at infinity and an electron at the Fermi level in the interior of a substance.
alternative label: ElectronWorkFunction
EMMO 26bf1bef d192 4da6 b0eb d2209698fb54: https://www.wikidata.org/wiki/Q783800
EMMO 50c298c2 55a2 4068 b3ac 4e948c33181f: https://www.electropedia.org/iev/iev.nsf/display
EMMO 8de5d5bf db1c 40ac b698 095ba3b18578: 12-24.1
EMMO 967080e5 2f42 4eb2 a3a9 c58143e835f9: Least energy required for the emission of a conduction electron.
EMMO fe015383 afb3 44a6 ae86 043628697aa2: https://doi.org/10.1351/goldbook.E02015

StandardizedPhysicalQuantity
type: Class
comment: The superclass for all physical quantities classes that are categorized according to a standard (e.g. ISQ).
EMMO 967080e5 2f42 4eb2 a3a9 c58143e835f9: The superclass for all physical quantities classes that are categorized according to a standard (e.g. ISQ).

BismuthAtom
type: Class
subclass of: Restriction
subclass of: Restriction
  has value: 208.9804
subclass of: Restriction
  has value: 83
comment: Atom subclass for bismuth.
EMMO 967080e5 2f42 4eb2 a3a9 c58143e835f9: Atom subclass for bismuth.

HertzMetre
type: Class
subclass of: Restriction
  has value: 1.0
subclass of: Restriction
  has value: 0.0
comment: product of the SI derived unit hertz and the SI base unit metre -- QUDT
alternative label: Hertz Metre
EMMO 1f1b164d ec6a 4faa 8d5e 88bda62316cc: http://qudt.org/vocab/unit/HZ-M
EMMO 33ae2d07 5526 4555 a0b4 8f4c031b5652: Hz.m
EMMO 7f1dec83 d85e 4e1b b7bd c9442d4f5a64: Hz⋅M
EMMO 967080e5 2f42 4eb2 a3a9 c58143e835f9: product of the SI derived unit hertz and the SI base unit metre -- QUDT

AluminiumSymbol
type: Class
subclass of: Restriction
  has value: Al
comment: The symbol that stands for the aluminium atom.
EMMO 967080e5 2f42 4eb2 a3a9 c58143e835f9: The symbol that stands for the aluminium atom.

Siemens
type: Class
subclass of: Restriction
  has value: S
comment: SI unit for electrical conductance.
comment: Siemens is the SI unit of electric conductance, susceptance, and admittance. The most important property of a conductor is the amount of current it will carry when a voltage is applied. Current flow is opposed by resistance in all circuits, and by also by reactance and impedance in alternating current circuits. Conductance, susceptance, and admittance are the inverses of resistance, reactance, and impedance, respectively. To measure these properties, the siemens is the reciprocal of the ohm. In other words, the conductance, susceptance, or admittance, in siemens, is simply 1 divided by the resistance, reactance or impedance, respectively, in ohms. The unit is named for the German electrical engineer Werner von Siemens (1816-1892). -- QUDT
EMMO 0b1cbe60 d380 4787 b92e be26bdacf2c2: SIE
EMMO 1f1b164d ec6a 4faa 8d5e 88bda62316cc: http://qudt.org/vocab/unit/S
EMMO 33ae2d07 5526 4555 a0b4 8f4c031b5652: S
EMMO 967080e5 2f42 4eb2 a3a9 c58143e835f9: SI unit for electrical conductance.
EMMO c7b62dd7 063a 4c2a 8504 42f7264ba83f: Siemens is the SI unit of electric conductance, susceptance, and admittance. The most important property of a conductor is the amount of current it will carry when a voltage is applied. Current flow is opposed by resistance in all circuits, and by also by reactance and impedance in alternating current circuits. Conductance, susceptance, and admittance are the inverses of resistance, reactance, and impedance, respectively. To measure these properties, the siemens is the reciprocal of the ohm. In other words, the conductance, susceptance, or admittance, in siemens, is simply 1 divided by the resistance, reactance or impedance, respectively, in ohms. The unit is named for the German electrical engineer Werner von Siemens (1816-1892). -- QUDT
EMMO c7b62dd7 063a 4c2a 8504 42f7264ba83f: S = A/V = F/s
EMMO c84c6752 6d64 48cc 9500 e54a3c34898d: https://en.wikipedia.org/wiki/Siemens_(unit)

Guess
type: Class
comment: A guess is a theory, estimated and subjective, since its premises are subjective.
EMMO 967080e5 2f42 4eb2 a3a9 c58143e835f9: A guess is a theory, estimated and subjective, since its premises are subjective.

Theory
type: Class
comment: A 'conventional' that stand for a 'physical'.
comment: The 'theory' is e.g. a proposition, a book or a paper whose sub-symbols suggest in the mind of the interpreter an interpretant structure that can represent a 'physical'. It is not an 'icon' (like a math equation), because it has no common resemblance or logical structure with the 'physical'. In Peirce semiotics: legisign-symbol-argument
EMMO 967080e5 2f42 4eb2 a3a9 c58143e835f9: A 'conventional' that stand for a 'physical'.

Estimated
type: Class
comment: A coded that is assigned from an estimation.
example: The biography of a person that the author have not met.
EMMO 967080e5 2f42 4eb2 a3a9 c58143e835f9: A coded that is assigned from an estimation.

RealData
type: Class
comment: A data representing a real number.
EMMO 8a137e9f 579c 4e28 baca e8980eb0c3db: EquivalentTo: hasDataValue some owl:real
EMMO 967080e5 2f42 4eb2 a3a9 c58143e835f9: A data representing a real number.

KiloAmperePerMetre
type: Class
subclass of: Restriction
  some values from: AmperePerMetre
subclass of: Restriction
  has value: 1000.0
subclass of: Restriction
  has value: 0.0
comment: 1 000-fold of the SI base unit ampere divided by the SI base unit metre -- QUDT
alternative label: Kiloampere Per Metre
EMMO 1f1b164d ec6a 4faa 8d5e 88bda62316cc: http://qudt.org/vocab/unit/KiloA-PER-M
EMMO 33ae2d07 5526 4555 a0b4 8f4c031b5652: kA.m-1
EMMO 7f1dec83 d85e 4e1b b7bd c9442d4f5a64: kA/m
EMMO 967080e5 2f42 4eb2 a3a9 c58143e835f9: 1 000-fold of the SI base unit ampere divided by the SI base unit metre -- QUDT

GoldAtom
type: Class
subclass of: Restriction
subclass of: Restriction
  has value: 196.966569
subclass of: Restriction
  has value: 79
comment: Atom subclass for gold.
EMMO 967080e5 2f42 4eb2 a3a9 c58143e835f9: Atom subclass for gold.

StandardUnit
type: Class
comment: A reference unit provided by a reference material. International vocabulary of metrology (VIM)
alternative label: ReferenceMaterial
example: Arbitrary amount-of-substance concentration of lutropin in a given sample of plasma (WHO international standard 80/552): 5.0 International Unit/l
EMMO 967080e5 2f42 4eb2 a3a9 c58143e835f9: A reference unit provided by a reference material. International vocabulary of metrology (VIM)

MetrologicalReference
type: Class
comment: A reference can be a measurement unit, a measurement procedure, a reference material, or a combination of such (VIM3 1.1 NOTE 2).
comment: A symbolic is recognized as reference unit also if it is not part of a quantity (e.g. as in the sentence "the Bq is the reference unit of Becquerel"). For this reason we can't declare the axiom: MetrologicalReference SubClassOf: inverse(hasMetrologicalReference) some Quantity because there exist reference units without being part of a quantity. This is peculiar to EMMO, where quantities as syntatic entities (explicit quantities) are distinct with quantities as semantic entities (properties).
EMMO 8a137e9f 579c 4e28 baca e8980eb0c3db: EquivalentTo: StandardUnit or MeasurementUnit or ProcedureUnit
EMMO 967080e5 2f42 4eb2 a3a9 c58143e835f9: A reference can be a measurement unit, a measurement procedure, a reference material, or a combination of such (VIM3 1.1 NOTE 2).
EMMO c7b62dd7 063a 4c2a 8504 42f7264ba83f: A symbolic is recognized as reference unit also if it is not part of a quantity (e.g. as in the sentence "the Bq is the reference unit of Becquerel"). For this reason we can't declare the axiom: MetrologicalReference SubClassOf: inverse(hasMetrologicalReference) some Quantity because there exist reference units without being part of a quantity. This is peculiar to EMMO, where quantities as syntatic entities (explicit quantities) are distinct with quantities as semantic entities (properties).

TemporalTile
type: Class
comment: A direct part that is obtained by partitioning a whole purely in temporal parts.
EMMO 967080e5 2f42 4eb2 a3a9 c58143e835f9: A direct part that is obtained by partitioning a whole purely in temporal parts.

ByteData
type: Class
comment: A data representing 8-bit integer number.
EMMO 8a137e9f 579c 4e28 baca e8980eb0c3db: EquivalentTo: hasDataValue some xsd:byte
EMMO 967080e5 2f42 4eb2 a3a9 c58143e835f9: A data representing 8-bit integer number.

CobaltAtom
type: Class
subclass of: Restriction
subclass of: Restriction
  has value: 58.933194
subclass of: Restriction
  has value: 27
comment: Atom subclass for cobalt.
EMMO 967080e5 2f42 4eb2 a3a9 c58143e835f9: Atom subclass for cobalt.

MilliWattPerSquareMetrePerNanoMetrePerSteradian
type: Class
subclass of: Restriction
  some values from: WattPerSquareMetrePerNanoMetrePerSteradian
subclass of: Restriction
  has value: 1000000.0
subclass of: Restriction
  has value: 0.0
alternative label: Milliwatts per square metre per nanometre per steradian
EMMO 1f1b164d ec6a 4faa 8d5e 88bda62316cc: http://qudt.org/vocab/unit/MilliW-PER-M2-NanoM-SR
EMMO 33ae2d07 5526 4555 a0b4 8f4c031b5652: mW.m-2.nm-1.sr-1
EMMO 7f1dec83 d85e 4e1b b7bd c9442d4f5a64: mW/(cm⋅nm⋅sr)

NewtonPerSquareMetre
type: Class
subclass of: Restriction
  has value: 1.0
subclass of: Restriction
  has value: 0.0
comment: The SI unit of pressure. The pascal is the standard pressure unit in the MKS metric system, equal to one newton per square meter or one "kilogram per meter per second per second." The unit is named for Blaise Pascal (1623-1662), French philosopher and mathematician, who was the first person to use a barometer to measure differences in altitude. -- QUDT
alternative label: Newtons Per Square Metre
EMMO 1f1b164d ec6a 4faa 8d5e 88bda62316cc: http://qudt.org/vocab/unit/N-PER-M2
EMMO 33ae2d07 5526 4555 a0b4 8f4c031b5652: N.m-2
EMMO 7f1dec83 d85e 4e1b b7bd c9442d4f5a64: N/m²
EMMO 967080e5 2f42 4eb2 a3a9 c58143e835f9: The SI unit of pressure. The pascal is the standard pressure unit in the MKS metric system, equal to one newton per square meter or one "kilogram per meter per second per second." The unit is named for Blaise Pascal (1623-1662), French philosopher and mathematician, who was the first person to use a barometer to measure differences in altitude. -- QUDT
EMMO c84c6752 6d64 48cc 9500 e54a3c34898d: http://en.wikipedia.org/wiki/Pascal

MilliMolePerGram
type: Class
subclass of: Restriction
  has value: 1.0
subclass of: Restriction
  has value: 0.0
comment: 0.001-fold of the SI base unit mol divided by the 0.001-fold of the SI base unit kilogram -- QUDT
alternative label: Millimole Per Gram
EMMO 1f1b164d ec6a 4faa 8d5e 88bda62316cc: http://qudt.org/vocab/unit/MilliMOL-PER-GM
EMMO 33ae2d07 5526 4555 a0b4 8f4c031b5652: mmol.g-1
EMMO 7f1dec83 d85e 4e1b b7bd c9442d4f5a64: mmol/g
EMMO 967080e5 2f42 4eb2 a3a9 c58143e835f9: 0.001-fold of the SI base unit mol divided by the 0.001-fold of the SI base unit kilogram -- QUDT

Tempering
type: Class
comment: Process consisting of two steps: - first, the steel is heated in a quenching treatment to a temperature above Ac3 and then rapidly cooled in a liquid to produce a process-specific grain structure; - subsequently, the steel is heated to a specific temperature during tempering to set the desired property and cooled in air.
alternative label: QuenchingAndTempering
alternative label: Vergüten
EMMO c7b62dd7 063a 4c2a 8504 42f7264ba83f: Process consisting of two steps: - first, the steel is heated in a quenching treatment to a temperature above Ac3 and then rapidly cooled in a liquid to produce a process-specific grain structure; - subsequently, the steel is heated to a specific temperature during tempering to set the desired property and cooled in air.

YttriumSymbol
type: Class
subclass of: Restriction
  has value: Y
comment: The symbol that stands for the yttrium atom.
EMMO 967080e5 2f42 4eb2 a3a9 c58143e835f9: The symbol that stands for the yttrium atom.

WattPerKelvin
type: Class
subclass of: Restriction
  has value: 1.0
subclass of: Restriction
  has value: 0.0
comment: Watt Per Kelvin (W/K) is a unit in the category of Thermal conductivity. -- QUDT
alternative label: Watt per Kelvin
EMMO 1f1b164d ec6a 4faa 8d5e 88bda62316cc: http://qudt.org/vocab/unit/W-PER-K
EMMO 33ae2d07 5526 4555 a0b4 8f4c031b5652: W.K-1
EMMO 7f1dec83 d85e 4e1b b7bd c9442d4f5a64: w/K
EMMO 967080e5 2f42 4eb2 a3a9 c58143e835f9: Watt Per Kelvin (W/K) is a unit in the category of Thermal conductivity. -- QUDT

Fermion
type: Class
comment: A physical particle with half odd integer spin (1/2, 3/2, etc...) that follows Fermi-Dirac statistics.
EMMO 967080e5 2f42 4eb2 a3a9 c58143e835f9: A physical particle with half odd integer spin (1/2, 3/2, etc...) that follows Fermi-Dirac statistics.
EMMO c84c6752 6d64 48cc 9500 e54a3c34898d: https://en.wikipedia.org/wiki/Fermion

PhysicalParticleBySpin
type: Class

MeanFreePathOfPhonons
type: Class
comment: average distance that phonons travel between two successive interactions
EMMO 1f1b164d ec6a 4faa 8d5e 88bda62316cc: https://qudt.org/vocab/quantitykind/PhononMeanFreePath
EMMO 26bf1bef d192 4da6 b0eb d2209698fb54: https://www.wikidata.org/wiki/Q105672255
EMMO 8de5d5bf db1c 40ac b698 095ba3b18578: 12-15.1
EMMO 967080e5 2f42 4eb2 a3a9 c58143e835f9: average distance that phonons travel between two successive interactions

MetricPrefixedUnit
type: Class
disjoint union of:
  rest:
    rest: nil
comment: A special unit with a metric prefix.
comment: The presence of the prefix makes this units non-coherent with SI system.
EMMO 967080e5 2f42 4eb2 a3a9 c58143e835f9: A special unit with a metric prefix.

PrefixedUnit
type: Class
subclass of: Restriction
  qualified cardinality: 1
subclass of: Restriction
  qualified cardinality: 1
comment: A measurement unit that is made of a metric prefix and a unit symbol.
EMMO 967080e5 2f42 4eb2 a3a9 c58143e835f9: A measurement unit that is made of a metric prefix and a unit symbol.

MilliDegreeCelsius
type: Class
subclass of: Restriction
  some values from: DegreeCelsius
subclass of: Restriction
  has value: 0.001
subclass of: Restriction
  has value: 273.15
comment: Millidegree Celsius is a scaled unit of measurement for temperature. -- QUDT
alternative label: Millidegree Celsius
EMMO 1f1b164d ec6a 4faa 8d5e 88bda62316cc: http://qudt.org/vocab/unit/MilliDEG_C
EMMO 33ae2d07 5526 4555 a0b4 8f4c031b5652: mCel
EMMO 7f1dec83 d85e 4e1b b7bd c9442d4f5a64: m°C
EMMO 967080e5 2f42 4eb2 a3a9 c58143e835f9: Millidegree Celsius is a scaled unit of measurement for temperature. -- QUDT
EMMO c84c6752 6d64 48cc 9500 e54a3c34898d: http://en.wikipedia.org/wiki/Celsius

Femto
type: Class
subclass of: Restriction
  has value: f
subclass of: Restriction
  has value: 1e-15
comment: SI prefix who's value is 1e-15.
EMMO 967080e5 2f42 4eb2 a3a9 c58143e835f9: SI prefix who's value is 1e-15.

Thickness
type: Class
comment: Shortest distance between two surfaces limiting a layer, when this distance can be considered to be constant over a region of a finite size.
EMMO 26bf1bef d192 4da6 b0eb d2209698fb54: https://www.wikidata.org/wiki/Q3589038
EMMO 50c298c2 55a2 4068 b3ac 4e948c33181f: https://www.electropedia.org/iev/iev.nsf/display
EMMO 8de5d5bf db1c 40ac b698 095ba3b18578: 3-1.4
EMMO 967080e5 2f42 4eb2 a3a9 c58143e835f9: Shortest distance between two surfaces limiting a layer, when this distance can be considered to be constant over a region of a finite size.

LossFactor
type: Class
comment: Inverse of the quality factor.
EMMO 1f1b164d ec6a 4faa 8d5e 88bda62316cc: https://qudt.org/vocab/quantitykind/LossFactor
EMMO 26bf1bef d192 4da6 b0eb d2209698fb54: https://www.wikidata.org/wiki/Q79468728
EMMO 8de5d5bf db1c 40ac b698 095ba3b18578: 6-54
EMMO 967080e5 2f42 4eb2 a3a9 c58143e835f9: Inverse of the quality factor.

Index
type: Class
subclass of: Restriction
comment: A 'Sign' that stands for an 'Object' due to causal continguity.
alternative label: Signal
example: Smoke stands for a combustion process (a fire). My facial expression stands for my emotional status.
EMMO 967080e5 2f42 4eb2 a3a9 c58143e835f9: A 'Sign' that stands for an 'Object' due to causal continguity.

LongRangeOrderParameter
type: Class
comment: Fraction of atoms in an Ising ferromagnet having magnetic moments in one direction, minus the fraction having magnetic moments in the opposite direction.
EMMO 1f1b164d ec6a 4faa 8d5e 88bda62316cc: https://qudt.org/vocab/quantitykind/Long-RangeOrderParameter
EMMO 26bf1bef d192 4da6 b0eb d2209698fb54: https://www.wikidata.org/wiki/Q105496124
EMMO 8de5d5bf db1c 40ac b698 095ba3b18578: 12-5.2
EMMO 967080e5 2f42 4eb2 a3a9 c58143e835f9: Fraction of atoms in an Ising ferromagnet having magnetic moments in one direction, minus the fraction having magnetic moments in the opposite direction.

ProtactiniumSymbol
type: Class
subclass of: Restriction
  has value: Pa
comment: The symbol that stands for the protactinium atom.
EMMO 967080e5 2f42 4eb2 a3a9 c58143e835f9: The symbol that stands for the protactinium atom.

SeaborgiumSymbol
type: Class
subclass of: Restriction
  has value: Sg
comment: The symbol that stands for the seaborgium atom.
EMMO 967080e5 2f42 4eb2 a3a9 c58143e835f9: The symbol that stands for the seaborgium atom.

IsentropicCompressibility
type: Class
comment: Quantity characterizing the relative variation of volume V with pressure p at constant entropy.
comment: The coherent SI unit of isentropic compressibility is pascal to the power minus one, 1/Pa.
EMMO 1f1b164d ec6a 4faa 8d5e 88bda62316cc: https://qudt.org/vocab/quantitykind/IsentropicCompressibility
EMMO 26bf1bef d192 4da6 b0eb d2209698fb54: https://www.wikidata.org/wiki/Q2990695
EMMO 50c298c2 55a2 4068 b3ac 4e948c33181f: https://www.electropedia.org/iev/iev.nsf/display
EMMO 8de5d5bf db1c 40ac b698 095ba3b18578: 5-5.2
EMMO 967080e5 2f42 4eb2 a3a9 c58143e835f9: Quantity characterizing the relative variation of volume V with pressure p at constant entropy.
EMMO c7b62dd7 063a 4c2a 8504 42f7264ba83f: The coherent SI unit of isentropic compressibility is pascal to the power minus one, 1/Pa.

Compressibility
type: Class
subclass of: Restriction
comment: Measure of the relative volume change of a fluid or solid as a response to a pressure change.
EMMO 1f1b164d ec6a 4faa 8d5e 88bda62316cc: https://qudt.org/vocab/quantitykind/Compressibility
EMMO 26bf1bef d192 4da6 b0eb d2209698fb54: https://www.wikidata.org/wiki/Q8067817
EMMO 50c298c2 55a2 4068 b3ac 4e948c33181f: https://www.electropedia.org/iev/iev.nsf/display
EMMO 8de5d5bf db1c 40ac b698 095ba3b18578: 4-20
EMMO 967080e5 2f42 4eb2 a3a9 c58143e835f9: Measure of the relative volume change of a fluid or solid as a response to a pressure change.

TechnologyProcess
type: Class
comment: Class that includes the application of scientific knowledge, tools and techniques in order to transform a precursor object (ex. conversion of material) following a practic purpose.
comment: Conversion of materials and assembly of components for the manufacture of products
comment: Technology is the application of knowledge for achieving practical goals in a reproducible way.
comment: Technology refers to methods, systems, and devices which are the result of scientific knowledge being used for practical purposes.
comment: application of scientific knowledge, tools, techniques, crafts or systems in order to solve a problem or to achieve an objective which can result in a product or process
comment: application of scientific knowledge, tools, techniques, crafts, systems or methods of organization in order to solve a problem or achieve an objective
alternative label: ProductionEngineeringProcess
EMMO 967080e5 2f42 4eb2 a3a9 c58143e835f9: Class that includes the application of scientific knowledge, tools and techniques in order to transform a precursor object (ex. conversion of material) following a practic purpose.

IntentionalAgency
type: Class
comment: A process occurring with the active participation of an intentional agent that drives the process according to a specific objective (intention).
comment: The concept is not restricted to agencies where the agent accomplish its intention. For example, breaking a vase while reaching for a book is an intentional agency, because the action causing the vase to fall and break follows a volition (i.e., an act of willing). Intentional agency may be further categorised acccording to the fact that the some of the resulting processes may or may not be coherent with the volition.
alternative label: IntentionalProcess
alternative label: Project
EMMO 8a137e9f 579c 4e28 baca e8980eb0c3db: SubClassOf: hasAgent some IntentionalAgent
EMMO 967080e5 2f42 4eb2 a3a9 c58143e835f9: A process occurring with the active participation of an intentional agent that drives the process according to a specific objective (intention).
EMMO c7b62dd7 063a 4c2a 8504 42f7264ba83f: The concept is not restricted to agencies where the agent accomplish its intention. For example, breaking a vase while reaching for a book is an intentional agency, because the action causing the vase to fall and break follows a volition (i.e., an act of willing). Intentional agency may be further categorised acccording to the fact that the some of the resulting processes may or may not be coherent with the volition.

Number
type: Class
comment: A number individual provides the link between the ontology and the actual data, through the data property hasNumericalValue.
comment: A number is actually a string (e.g. 1.4, 1e-8) of numerical digits and other symbols. However, in order not to increase complexity of the taxonomy and relations, here we take a number as an "atomic" object, without decomposit it in digits (i.e. we do not include digits in the EMMO as alphabet for numbers).
comment: A numerical data value.
comment: In math usually number and numeral are distinct concepts, the numeral being the symbol or a composition of symbols (e.g. 3.14, 010010, three) and the number is the idea behind it. More than one numeral stands for the same number. In the EMMO abstract entities do not exists, and numbers are simply defined by other numerals, so that a number is the class of all the numerals that are equivalent (e.g. 3 and 0011 are numerals that stands for the same number). Or alternatively, an integer numeral may also stands for a set of a specific cardinality (e.g. 3 stands for a set of three apples). Rational and real numbers are simply a syntactic arrangment of integers (digits, in decimal system). The fact that you can't give a name to a number without using a numeral or, in case of positive integers, without referring to a real world objects set with specific cardinality, suggests that the abstract concept of number is not a concept that can be practically used. For these reasons, the EMMO will consider numerals and numbers as the same concept.
alternative label: Numeral
EMMO 967080e5 2f42 4eb2 a3a9 c58143e835f9: A numerical data value.

Numerical
type: Class
comment: A 'Mathematical' that has no unknown value, i.e. all its 'Variable"-s parts refers to a 'Number' (for scalars that have a built-in datatype) or to another 'Numerical' (for complex numerical data structures that should rely on external implementations).
EMMO 967080e5 2f42 4eb2 a3a9 c58143e835f9: A 'Mathematical' that has no unknown value, i.e. all its 'Variable"-s parts refers to a 'Number' (for scalars that have a built-in datatype) or to another 'Numerical' (for complex numerical data structures that should rely on external implementations).

MathematicalSymbol
type: Class
equivalent class: Class
subclass of: Class
  complement of: Restriction

LuminousEfficacyUnit
type: Class
subclass of: Restriction
  has value: T+3 L-2 M-1 I0 Θ0 N0 J+1
comment: The class of units with dimensionality 'LuminousEfficacy'.
EMMO 967080e5 2f42 4eb2 a3a9 c58143e835f9: The class of units with dimensionality 'LuminousEfficacy'.

CoulombPerCubicMetre
type: Class
subclass of: Restriction
  has value: 1.0
subclass of: Restriction
  has value: 0.0
comment: Coulomb Per Cubic Meter (C/m³) is a unit in the category of Electric charge density. It is also known as coulomb per cubic metre, coulombs per cubic meter, coulombs per cubic metre, coulomb/cubic meter, coulomb/cubic metre. This unit is commonly used in the SI unit system. Coulomb Per Cubic Meter has a dimension of L⁻³TI where L is length, T is time, and I is electric current. This unit is the standard SI unit in this category. -- QUDT
alternative label: Coulomb per Cubic Metre
EMMO 1f1b164d ec6a 4faa 8d5e 88bda62316cc: http://qudt.org/vocab/unit/C-PER-M3
EMMO 33ae2d07 5526 4555 a0b4 8f4c031b5652: C.m-3
EMMO 33ae2d07 5526 4555 a0b4 8f4c031b5652: C/m3
EMMO 7f1dec83 d85e 4e1b b7bd c9442d4f5a64: C/m³
EMMO 967080e5 2f42 4eb2 a3a9 c58143e835f9: Coulomb Per Cubic Meter (C/m³) is a unit in the category of Electric charge density. It is also known as coulomb per cubic metre, coulombs per cubic meter, coulombs per cubic metre, coulomb/cubic meter, coulomb/cubic metre. This unit is commonly used in the SI unit system. Coulomb Per Cubic Meter has a dimension of L⁻³TI where L is length, T is time, and I is electric current. This unit is the standard SI unit in this category. -- QUDT

MeasuringSystem
type: Class
subclass of: Restriction
comment: A set of one or more 'MeasuringInstruments' and often other devices, including any reagent and supply, assembled and adapted to give information used to generate 'MeasuredQuantityProperty' within specified intervals for quantities of specified kinds. -- VIM
EMMO 967080e5 2f42 4eb2 a3a9 c58143e835f9: A set of one or more 'MeasuringInstruments' and often other devices, including any reagent and supply, assembled and adapted to give information used to generate 'MeasuredQuantityProperty' within specified intervals for quantities of specified kinds. -- VIM
EMMO bb49844b 45d7 4f0d 8cae 8e552cbc20d6: measuring system

Measurer
type: Class
comment: An observer that makes use of a measurement tool and provides a quantitative property.
EMMO 967080e5 2f42 4eb2 a3a9 c58143e835f9: An observer that makes use of a measurement tool and provides a quantitative property.

BurgersVector
type: Class
subclass of: Restriction
comment: Vector characterising a dislocation in a crystal lattice.
EMMO 1f1b164d ec6a 4faa 8d5e 88bda62316cc: https://qudt.org/vocab/quantitykind/BurgersVector
EMMO 26bf1bef d192 4da6 b0eb d2209698fb54: https://www.wikidata.org/wiki/Q623093
EMMO 8de5d5bf db1c 40ac b698 095ba3b18578: 12-6
EMMO 967080e5 2f42 4eb2 a3a9 c58143e835f9: Vector characterising a dislocation in a crystal lattice.

MilliAmperePerGram
type: Class
subclass of: Restriction
  has value: 1.0
subclass of: Restriction
  has value: 0.0
comment: a unit of electric current per mass
EMMO 967080e5 2f42 4eb2 a3a9 c58143e835f9: a unit of electric current per mass

RelativeLinearStrain
type: Class
comment: Relative change of length with respect the original length.
EMMO 1f1b164d ec6a 4faa 8d5e 88bda62316cc: https://qudt.org/vocab/quantitykind/LinearStrain
EMMO 26bf1bef d192 4da6 b0eb d2209698fb54: https://www.wikidata.org/wiki/Q1990546
EMMO 50c298c2 55a2 4068 b3ac 4e948c33181f: https://www.electropedia.org/iev/iev.nsf/display
EMMO 8de5d5bf db1c 40ac b698 095ba3b18578: 4-17.2
EMMO 967080e5 2f42 4eb2 a3a9 c58143e835f9: Relative change of length with respect the original length.
EMMO fe015383 afb3 44a6 ae86 043628697aa2: https://doi.org/10.1351/goldbook.L03560

NanoMole
type: Class
subclass of: Restriction
  some values from: Mole
subclass of: Restriction
  has value: 1e-09
subclass of: Restriction
  has value: 0.0
EMMO 1f1b164d ec6a 4faa 8d5e 88bda62316cc: http://qudt.org/vocab/unit/NanoMOL
EMMO 7f1dec83 d85e 4e1b b7bd c9442d4f5a64: nmol

LutetiumAtom
type: Class
subclass of: Restriction
subclass of: Restriction
  has value: 174.9668
subclass of: Restriction
  has value: 71
comment: Atom subclass for lutetium.
EMMO 967080e5 2f42 4eb2 a3a9 c58143e835f9: Atom subclass for lutetium.

AttoJouleSecond
type: Class
subclass of: Restriction
  some values from: JouleSecond
subclass of: Restriction
  has value: 1e-18
subclass of: Restriction
  has value: 0.0
comment: unit of the Planck's constant as product of the SI derived unit joule and the SI base unit second -- QUDT
alternative label: Attojoule Second
EMMO 1f1b164d ec6a 4faa 8d5e 88bda62316cc: http://qudt.org/vocab/unit/AttoJ-SEC
EMMO 33ae2d07 5526 4555 a0b4 8f4c031b5652: aJ.s
EMMO 7f1dec83 d85e 4e1b b7bd c9442d4f5a64: aJ⋅s
EMMO 967080e5 2f42 4eb2 a3a9 c58143e835f9: unit of the Planck's constant as product of the SI derived unit joule and the SI base unit second -- QUDT

CuriumAtom
type: Class
subclass of: Restriction
subclass of: Restriction
  has value: 247.07035
subclass of: Restriction
  has value: 96
comment: Atom subclass for curium.
EMMO 967080e5 2f42 4eb2 a3a9 c58143e835f9: Atom subclass for curium.

ArchetypeManufacturing
type: Class
comment: A manufacturing in which the product is a solid body with a well defined geometrical shape made from shapeless original material parts, whose cohesion is created during the process.
see also: DIN 8580:2020
alternative label: PrimitiveForming
alternative label: Urformen @de
EMMO 967080e5 2f42 4eb2 a3a9 c58143e835f9: A manufacturing in which the product is a solid body with a well defined geometrical shape made from shapeless original material parts, whose cohesion is created during the process.

CatalyticActivity
type: Class
subclass of: Restriction
comment: Increase in the rate of reaction of a specified chemical reaction that an enzyme produces in a specific assay system.
EMMO 1f1b164d ec6a 4faa 8d5e 88bda62316cc: http://qudt.org/vocab/quantitykind/CatalyticActivity
EMMO 967080e5 2f42 4eb2 a3a9 c58143e835f9: Increase in the rate of reaction of a specified chemical reaction that an enzyme produces in a specific assay system.
EMMO fe015383 afb3 44a6 ae86 043628697aa2: https://doi.org/10.1351/goldbook.C00881

PerSecond
type: Class
subclass of: Restriction
  has value: 1.0
subclass of: Restriction
  has value: 0.0
comment: A reciprical unit of time for `reciprocal second` or `inverse second`. The `Per Second` is a unit of rate. -- QUDT
alternative label: ReciprocalSecond
EMMO 1f1b164d ec6a 4faa 8d5e 88bda62316cc: http://qudt.org/vocab/unit/PER-SEC
EMMO 33ae2d07 5526 4555 a0b4 8f4c031b5652: /s
EMMO 33ae2d07 5526 4555 a0b4 8f4c031b5652: s-1
EMMO 7f1dec83 d85e 4e1b b7bd c9442d4f5a64: /s
EMMO 967080e5 2f42 4eb2 a3a9 c58143e835f9: A reciprical unit of time for `reciprocal second` or `inverse second`. The `Per Second` is a unit of rate. -- QUDT

MeasurementUnitByPrefix
type: Class

AmpereSquareMetrePerJouleSecond
type: Class
subclass of: Restriction
  has value: 1.0
subclass of: Restriction
  has value: 0.0
comment: The SI unit of gyromagnetic ratio. -- QUDT
alternative label: Ampere Square Metre Per Joule Second
EMMO 1f1b164d ec6a 4faa 8d5e 88bda62316cc: http://qudt.org/vocab/unit/A-M2-PER-J-SEC
EMMO 33ae2d07 5526 4555 a0b4 8f4c031b5652: A.m2.J-1.s-1
EMMO 33ae2d07 5526 4555 a0b4 8f4c031b5652: A.m2/(J.s)
EMMO 7f1dec83 d85e 4e1b b7bd c9442d4f5a64: A⋅m²/(J⋅s)
EMMO 967080e5 2f42 4eb2 a3a9 c58143e835f9: The SI unit of gyromagnetic ratio. -- QUDT

TechnetiumSymbol
type: Class
subclass of: Restriction
  has value: Tc
comment: The symbol that stands for the technetium atom.
EMMO 967080e5 2f42 4eb2 a3a9 c58143e835f9: The symbol that stands for the technetium atom.

DimensionalUnit
type: Class
comment: A subclass of measurement unit focusing on the physical dimensionality that is carried by the unit.
comment: The current version of EMMO does not provide explicit classes for physical dimensions. Rather it embraces the fact that the physical dimensionality of a physical quantity is carried by its measurement unit. The role of dimensional unit and its subclasses is to express the physical dimensionality that is carried by the unit. Since the dimensionality of a physical quantity can be written as the product of powers of the physical dimensions of the base quantities in the selected system of quantities, the physical dimensionality of a measurement unit is uniquely determined by the exponents. For a dimensional unit, at least one of these exponents must be non-zero (making it disjoint from dimensionless units).
EMMO 967080e5 2f42 4eb2 a3a9 c58143e835f9: A subclass of measurement unit focusing on the physical dimensionality that is carried by the unit.
EMMO c7b62dd7 063a 4c2a 8504 42f7264ba83f: The current version of EMMO does not provide explicit classes for physical dimensions. Rather it embraces the fact that the physical dimensionality of a physical quantity is carried by its measurement unit. The role of dimensional unit and its subclasses is to express the physical dimensionality that is carried by the unit. Since the dimensionality of a physical quantity can be written as the product of powers of the physical dimensions of the base quantities in the selected system of quantities, the physical dimensionality of a measurement unit is uniquely determined by the exponents. For a dimensional unit, at least one of these exponents must be non-zero (making it disjoint from dimensionless units).

MilliPascal
type: Class
subclass of: Restriction
  some values from: Pascal
subclass of: Restriction
  has value: 0.001
subclass of: Restriction
  has value: 0.0
comment: 0.001-fold of the SI derived unit pascal -- QUDT
EMMO 1f1b164d ec6a 4faa 8d5e 88bda62316cc: http://qudt.org/vocab/unit/MilliPA
EMMO 33ae2d07 5526 4555 a0b4 8f4c031b5652: mPa
EMMO 7f1dec83 d85e 4e1b b7bd c9442d4f5a64: mPa
EMMO 967080e5 2f42 4eb2 a3a9 c58143e835f9: 0.001-fold of the SI derived unit pascal -- QUDT

OsmiumAtom
type: Class
subclass of: Restriction
subclass of: Restriction
  has value: 190.23
subclass of: Restriction
  has value: 76
comment: Atom subclass for osmium.
EMMO 967080e5 2f42 4eb2 a3a9 c58143e835f9: Atom subclass for osmium.

Galvanizing
type: Class

ArchetypeJoin
type: Class
comment: Archetype join attaches two workpiece with geometrically defined shape together, using supplementary workpiece made of amorphous material (e.g. powder).
EMMO 967080e5 2f42 4eb2 a3a9 c58143e835f9: Archetype join attaches two workpiece with geometrically defined shape together, using supplementary workpiece made of amorphous material (e.g. powder).

CoulombPerSquareMilliMetre
type: Class
subclass of: Restriction
  has value: 1000000.0
subclass of: Restriction
  has value: 0.0
comment: derived SI unit coulomb divided by the 0.000 001-fold of the power of the SI base unit metre by exponent 2 -- QUDT
alternative label: Coulomb Per Square Millimetre
EMMO 1f1b164d ec6a 4faa 8d5e 88bda62316cc: http://qudt.org/vocab/unit/C-PER-MilliM2
EMMO 33ae2d07 5526 4555 a0b4 8f4c031b5652: C.mm-2
EMMO 33ae2d07 5526 4555 a0b4 8f4c031b5652: C/mm2
EMMO 7f1dec83 d85e 4e1b b7bd c9442d4f5a64: C/mm²
EMMO 967080e5 2f42 4eb2 a3a9 c58143e835f9: derived SI unit coulomb divided by the 0.000 001-fold of the power of the SI base unit metre by exponent 2 -- QUDT

HydrogenSymbol
type: Class
subclass of: Restriction
  has value: H
comment: The symbol that stands for the hydrogen atom.
EMMO 967080e5 2f42 4eb2 a3a9 c58143e835f9: The symbol that stands for the hydrogen atom.

NanoSecond
type: Class
subclass of: Restriction
  some values from: Second
subclass of: Restriction
  has value: 1e-09
subclass of: Restriction
  has value: 0.0
comment: A nanosecond is a SI unit of time equal to one billionth of a second (10-9 or 1/1,000,000,000 s). One nanosecond is to one second as one second is to 31.69 years. The word nanosecond is formed by the prefix nano and the unit second. -- QUDT
alternative label: nanosecond
EMMO 1f1b164d ec6a 4faa 8d5e 88bda62316cc: http://qudt.org/vocab/unit/NanoSEC
EMMO 33ae2d07 5526 4555 a0b4 8f4c031b5652: ns
EMMO 7f1dec83 d85e 4e1b b7bd c9442d4f5a64: ns
EMMO 967080e5 2f42 4eb2 a3a9 c58143e835f9: A nanosecond is a SI unit of time equal to one billionth of a second (10-9 or 1/1,000,000,000 s). One nanosecond is to one second as one second is to 31.69 years. The word nanosecond is formed by the prefix nano and the unit second. -- QUDT
EMMO c84c6752 6d64 48cc 9500 e54a3c34898d: http://en.wikipedia.org/wiki/Nanosecond

NewtonSquareMetrePerSquareKilogram
type: Class
subclass of: Restriction
  has value: 1.0
subclass of: Restriction
  has value: 0.0
comment: unit of gravitational constant as product of the derived SI unit newton, the power of the SI base unit metre with the exponent 2 divided by the power of the SI base unit kilogram with the exponent 2 -- QUDT
alternative label: Newton Square Metre Per Square Kilogram
EMMO 1f1b164d ec6a 4faa 8d5e 88bda62316cc: http://qudt.org/vocab/unit/N-M2-PER-KiloGM2
EMMO 33ae2d07 5526 4555 a0b4 8f4c031b5652: N.m2.kg-2
EMMO 7f1dec83 d85e 4e1b b7bd c9442d4f5a64: N⋅m²/kg²
EMMO 967080e5 2f42 4eb2 a3a9 c58143e835f9: unit of gravitational constant as product of the derived SI unit newton, the power of the SI base unit metre with the exponent 2 divided by the power of the SI base unit kilogram with the exponent 2 -- QUDT

NewtonianConstantOfGravityUnit
type: Class
subclass of: Restriction
  has value: T-2 L+3 M-1 I0 Θ0 N0 J0
comment: The class of units with dimensionality 'NewtonianConstantOfGravity'.
EMMO 967080e5 2f42 4eb2 a3a9 c58143e835f9: The class of units with dimensionality 'NewtonianConstantOfGravity'.

Replica
type: Class
equivalent class: Class
comment: An icon that not only resembles the object, but also can express some of the object's functions.
example: A small scale replica of a plane tested in a wind gallery shares the same functionality in terms of aerodynamic behaviour of the bigger one.
example: Pinocchio is a functional icon of a boy since it imitates the external behaviour without having the internal biological structure of a human being (it is made of magic wood...).
EMMO 967080e5 2f42 4eb2 a3a9 c58143e835f9: An icon that not only resembles the object, but also can express some of the object's functions.

RelativeMassFractionOfVapour
type: Class
comment: Quotient of mass concentration of water vapour and mass concentration at its saturation ψ = r/rsat where r is mass ratio of water vapour to dry gas and rsat is the mass ratio of water vapour to dry gas at saturation of the same temperature.
EMMO 8de5d5bf db1c 40ac b698 095ba3b18578: 5-35
EMMO 967080e5 2f42 4eb2 a3a9 c58143e835f9: Quotient of mass concentration of water vapour and mass concentration at its saturation ψ = r/rsat where r is mass ratio of water vapour to dry gas and rsat is the mass ratio of water vapour to dry gas at saturation of the same temperature.

GrandCanonicalPartionFunction
type: Class
comment: Sum of canonical partition function Z (NA,NB,…) for the given number of particles A, B, ... multiplied by absolute activities of particles A, B, ...
alternative label: GrandPartionFunction
EMMO 1f1b164d ec6a 4faa 8d5e 88bda62316cc: https://qudt.org/vocab/quantitykind/GrandCanonicalPartitionFunction
EMMO 26bf1bef d192 4da6 b0eb d2209698fb54: https://www.wikidata.org/wiki/Q96176022
EMMO 8de5d5bf db1c 40ac b698 095ba3b18578: 9-35.3
EMMO 967080e5 2f42 4eb2 a3a9 c58143e835f9: Sum of canonical partition function Z (NA,NB,…) for the given number of particles A, B, ... multiplied by absolute activities of particles A, B, ...

Henry
type: Class
subclass of: Restriction
  has value: H
comment: H = Wb/A = V·s/A = Ω·s
comment: SI unit for electrical inductance.
EMMO 0b1cbe60 d380 4787 b92e be26bdacf2c2: 81
EMMO 1f1b164d ec6a 4faa 8d5e 88bda62316cc: http://qudt.org/vocab/unit/H
EMMO 33ae2d07 5526 4555 a0b4 8f4c031b5652: H
EMMO 6dd685dd 1895 46e4 b227 be9f7d643c25: http://dbpedia.org/resource/Henry
EMMO 967080e5 2f42 4eb2 a3a9 c58143e835f9: SI unit for electrical inductance.
EMMO c7b62dd7 063a 4c2a 8504 42f7264ba83f: H = Wb/A = V·s/A = Ω·s
EMMO c7b62dd7 063a 4c2a 8504 42f7264ba83f: The SI unit of electric inductance. A changing magnetic field induces an electric current in a loop of wire (or in a coil of many loops) located in the field. Although the induced voltage depends only on the rate at which the magnetic flux changes, measured in webers per second, the amount of the current depends also on the physical properties of the coil. A coil with an inductance of one henry requires a flux of one weber for each ampere of induced current. If, on the other hand, it is the current which changes, then the induced field will generate a potential difference within the coil: if the inductance is one henry a current change of one ampere per second generates a potential difference of one volt. The henry is a large unit; inductances in practical circuits are measured in millihenrys (mH) or microhenrys (μH). The unit is named for the American physicist Joseph Henry (1797-1878), one of several scientists who discovered independently how magnetic fields can be used to generate alternating currents. -- QUDT
EMMO c84c6752 6d64 48cc 9500 e54a3c34898d: http://en.wikipedia.org/wiki/Henry
EMMO fe015383 afb3 44a6 ae86 043628697aa2: https://doi.org/10.1351/goldbook.H02782

InductanceUnit
type: Class
subclass of: Restriction
  has value: T-2 L+2 M+1 I-2 Θ0 N0 J0
comment: The class of units with dimensionality 'Inductance'.
EMMO 967080e5 2f42 4eb2 a3a9 c58143e835f9: The class of units with dimensionality 'Inductance'.

File
type: Class
subclass of: Restriction
comment: In computing, a computer file is a resource for recording data on a computer storage device, primarily identified by its file path.
EMMO 967080e5 2f42 4eb2 a3a9 c58143e835f9: In computing, a computer file is a resource for recording data on a computer storage device, primarily identified by its file path.

SystemResource
type: Class
subclass of: Class
  intersection of: Restriction
comment: Any physical or virtual component of limited availability within a computer system.
alternative label: Resource
EMMO 967080e5 2f42 4eb2 a3a9 c58143e835f9: Any physical or virtual component of limited availability within a computer system.

Litre
type: Class
subclass of: Restriction
  has value: 0.001
subclass of: Restriction
  has value: 0.0
subclass of: Restriction
  has value: L
comment: A non-SI unit of volume defined as 1 cubic decimetre (dm3),
comment: Other used symbols for litre are "l" and "ℓ".
comment: The litre (American spelling: `liter`; SI symbol l or L) is a non-SI metric system unit of volume equal to 1 `cubic decimetre` (dm³), 1,000 cubic centimetres (cm³) or 1/1000 `cubic metre`. If the lower case "L" is used as the symbol, it is sometimes rendered as a italic "l" to help distinguish it from the capital "I", although this usage has no official approval by any international bureau. -- QUDT
alternative label: liter
EMMO 0b1cbe60 d380 4787 b92e be26bdacf2c2: B51
EMMO 1f1b164d ec6a 4faa 8d5e 88bda62316cc: http://qudt.org/vocab/unit/L
EMMO 33ae2d07 5526 4555 a0b4 8f4c031b5652: L
EMMO 33ae2d07 5526 4555 a0b4 8f4c031b5652: l
EMMO 70fe84ff 99b6 4206 a9fc 9a8931836d84: A non-SI unit of volume defined as 1 cubic decimetre (dm3),
EMMO 967080e5 2f42 4eb2 a3a9 c58143e835f9: The litre (American spelling: `liter`; SI symbol l or L) is a non-SI metric system unit of volume equal to 1 `cubic decimetre` (dm³), 1,000 cubic centimetres (cm³) or 1/1000 `cubic metre`. If the lower case "L" is used as the symbol, it is sometimes rendered as a italic "l" to help distinguish it from the capital "I", although this usage has no official approval by any international bureau. -- QUDT
EMMO fe015383 afb3 44a6 ae86 043628697aa2: https://doi.org/10.1351/goldbook.L03594

GalliumSymbol
type: Class
subclass of: Restriction
  has value: Ga
comment: The symbol that stands for the gallium atom.
EMMO 967080e5 2f42 4eb2 a3a9 c58143e835f9: The symbol that stands for the gallium atom.

LinearAttenuationCoefficient
type: Class
comment: In nuclear physics, fraction of interacting particles per distance traversed in a given material.
EMMO 26bf1bef d192 4da6 b0eb d2209698fb54: https://www.wikidata.org/wiki/Q98583077
EMMO 50c298c2 55a2 4068 b3ac 4e948c33181f: https://www.electropedia.org/iev/iev.nsf/display
EMMO 8de5d5bf db1c 40ac b698 095ba3b18578: 10-49
EMMO 967080e5 2f42 4eb2 a3a9 c58143e835f9: In nuclear physics, fraction of interacting particles per distance traversed in a given material.

DebyeAngularWaveNumber
type: Class
comment: Cut-off angular wavenumber in the Debye model of the vibrational spectrum of a solid.
alternative label: DebyeAngluarRepetency
EMMO 1f1b164d ec6a 4faa 8d5e 88bda62316cc: https://qudt.org/vocab/quantitykind/DebyeAngularWavenumber
EMMO 26bf1bef d192 4da6 b0eb d2209698fb54: https://www.wikidata.org/wiki/Q105554370
EMMO 8de5d5bf db1c 40ac b698 095ba3b18578: 12-9.3
EMMO 967080e5 2f42 4eb2 a3a9 c58143e835f9: Cut-off angular wavenumber in the Debye model of the vibrational spectrum of a solid.

PrecipitationHardening
type: Class
comment: hardening of a workpiece caused by the precipitation of one or more compounds from a supersaturated solid solution
EMMO c7b62dd7 063a 4c2a 8504 42f7264ba83f: hardening of a workpiece caused by the precipitation of one or more compounds from a supersaturated solid solution

TransformationLanguage
type: Class
comment: A construction language designed to transform some input text in a certain formal language into a modified output text that meets some specific goal.
example: Tritium, XSLT, XQuery, STX, FXT, XDuce, CDuce, HaXml, XMLambda, FleXML
EMMO 967080e5 2f42 4eb2 a3a9 c58143e835f9: A construction language designed to transform some input text in a certain formal language into a modified output text that meets some specific goal.
EMMO c84c6752 6d64 48cc 9500 e54a3c34898d: https://en.wikipedia.org/wiki/Transformation_language

SamariumAtom
type: Class
subclass of: Restriction
subclass of: Restriction
  has value: 150.36
subclass of: Restriction
  has value: 62
comment: Atom subclass for samarium.
EMMO 967080e5 2f42 4eb2 a3a9 c58143e835f9: Atom subclass for samarium.

JoulePerMetre
type: Class
subclass of: Restriction
  has value: 1.0
subclass of: Restriction
  has value: 0.0
comment: Joule per metre.
EMMO 1f1b164d ec6a 4faa 8d5e 88bda62316cc: http://qudt.org/vocab/unit/J-PER-M
EMMO 33ae2d07 5526 4555 a0b4 8f4c031b5652: J.m-1
EMMO 33ae2d07 5526 4555 a0b4 8f4c031b5652: J/m
EMMO 7f1dec83 d85e 4e1b b7bd c9442d4f5a64: J/m
EMMO 967080e5 2f42 4eb2 a3a9 c58143e835f9: Joule per metre.

ProcedureUnit
type: Class
comment: A reference unit provided by a measurement procedure.
comment: Procedure units and measurement units are disjoint.
alternative label: MeasurementProcedure
example: Rockwell C hardness of a given sample (150 kg load): 43.5HRC(150 kg)
EMMO 967080e5 2f42 4eb2 a3a9 c58143e835f9: A reference unit provided by a measurement procedure.
EMMO c7b62dd7 063a 4c2a 8504 42f7264ba83f: Procedure units and measurement units are disjoint.

AbsorbedDose
type: Class
subclass of: Restriction
comment: Energy imparted to matter by ionizing radiation in a suitable small element of volume divided by the mass of that element of volume.
EMMO 1f1b164d ec6a 4faa 8d5e 88bda62316cc: http://qudt.org/vocab/quantitykind/AbsorbedDose
EMMO 8de5d5bf db1c 40ac b698 095ba3b18578: 10-81.1
EMMO 967080e5 2f42 4eb2 a3a9 c58143e835f9: Energy imparted to matter by ionizing radiation in a suitable small element of volume divided by the mass of that element of volume.
EMMO fe015383 afb3 44a6 ae86 043628697aa2: https://doi.org/10.1351/goldbook.A00031

PicoFaradPerMetre
type: Class
subclass of: Restriction
  some values from: FaradPerMetre
subclass of: Restriction
  has value: 1e-12
subclass of: Restriction
  has value: 0.0
comment: 1e-12 fold of the SI derived unit farad divided by the SI base unit metre. -- QUDT
alternative label: Picofarad Per Metre
EMMO 1f1b164d ec6a 4faa 8d5e 88bda62316cc: http://qudt.org/vocab/unit/PicoFARAD-PER-M
EMMO 33ae2d07 5526 4555 a0b4 8f4c031b5652: pF.m-1
EMMO 7f1dec83 d85e 4e1b b7bd c9442d4f5a64: pF/m
EMMO 967080e5 2f42 4eb2 a3a9 c58143e835f9: 1e-12 fold of the SI derived unit farad divided by the SI base unit metre. -- QUDT

ArgonSymbol
type: Class
subclass of: Restriction
  has value: Ar
comment: The symbol that stands for the argon atom.
EMMO 967080e5 2f42 4eb2 a3a9 c58143e835f9: The symbol that stands for the argon atom.

MolarEnthalpy
type: Class
comment: Enthalpy per amount of substance.
EMMO 26bf1bef d192 4da6 b0eb d2209698fb54: https://www.wikidata.org/wiki/Q88769977
EMMO 8de5d5bf db1c 40ac b698 095ba3b18578: 9-6.2
EMMO 967080e5 2f42 4eb2 a3a9 c58143e835f9: Enthalpy per amount of substance.

HeliumSymbol
type: Class
subclass of: Restriction
  has value: He
comment: The symbol that stands for the helium atom.
EMMO 967080e5 2f42 4eb2 a3a9 c58143e835f9: The symbol that stands for the helium atom.

TotalMassStoppingPower
type: Class
subclass of: Restriction
comment: Quotient of the total linear stopping power S and the mass density ρ of the material.
alternative label: MassStoppingPower
EMMO 1f1b164d ec6a 4faa 8d5e 88bda62316cc: https://qudt.org/vocab/quantitykind/TotalMassStoppingPower
EMMO 26bf1bef d192 4da6 b0eb d2209698fb54: https://www.wikidata.org/wiki/Q98642795
EMMO 50c298c2 55a2 4068 b3ac 4e948c33181f: https://www.electropedia.org/iev/iev.nsf/display
EMMO 8de5d5bf db1c 40ac b698 095ba3b18578: 10-55
EMMO 967080e5 2f42 4eb2 a3a9 c58143e835f9: Quotient of the total linear stopping power S and the mass density ρ of the material.

MolePerSquareMetrePerSecondPerSteradian
type: Class
subclass of: Restriction
  has value: 1.0
subclass of: Restriction
  has value: 0.0
comment: Moles per square metre per second per steradian.
EMMO 1f1b164d ec6a 4faa 8d5e 88bda62316cc: http://qudt.org/vocab/unit/MOL-PER-M2-SEC-SR
EMMO 33ae2d07 5526 4555 a0b4 8f4c031b5652: mol.m-2.s-1.sr-1
EMMO 7f1dec83 d85e 4e1b b7bd c9442d4f5a64: mol/(m²⋅s⋅sr)
EMMO 967080e5 2f42 4eb2 a3a9 c58143e835f9: Moles per square metre per second per steradian.

ElectricReactance
type: Class
comment: The imaginary part of the impedance.
comment: The opposition of a circuit element to a change in current or voltage, due to that element's inductance or capacitance.
alternative label: Reactance
EMMO 1f1b164d ec6a 4faa 8d5e 88bda62316cc: http://qudt.org/vocab/quantitykind/Reactance
EMMO 26bf1bef d192 4da6 b0eb d2209698fb54: https://www.wikidata.org/wiki/Q193972
EMMO 8de5d5bf db1c 40ac b698 095ba3b18578: 6-51.3
EMMO 967080e5 2f42 4eb2 a3a9 c58143e835f9: The opposition of a circuit element to a change in current or voltage, due to that element's inductance or capacitance.
EMMO c7b62dd7 063a 4c2a 8504 42f7264ba83f: The imaginary part of the impedance.
EMMO c84c6752 6d64 48cc 9500 e54a3c34898d: https://en.wikipedia.org/wiki/Electrical_reactance
EMMO fe015383 afb3 44a6 ae86 043628697aa2: https://doi.org/10.1351/goldbook.R05162

CoulombPerCubicMilliMetre
type: Class
subclass of: Restriction
  has value: 1000000000.0
subclass of: Restriction
  has value: 0.0
comment: derived SI unit coulomb divided by the 0.000 000 001-fold of the power of the SI base unit metre by exponent 3 -- QUDT
alternative label: Coulomb Per Cubic Millimetre
EMMO 1f1b164d ec6a 4faa 8d5e 88bda62316cc: http://qudt.org/vocab/unit/C-PER-MilliM3
EMMO 33ae2d07 5526 4555 a0b4 8f4c031b5652: C.mm-3
EMMO 33ae2d07 5526 4555 a0b4 8f4c031b5652: C/mm3
EMMO 7f1dec83 d85e 4e1b b7bd c9442d4f5a64: C/mm³
EMMO 967080e5 2f42 4eb2 a3a9 c58143e835f9: derived SI unit coulomb divided by the 0.000 000 001-fold of the power of the SI base unit metre by exponent 3 -- QUDT

WattPerSquareMetrePerMetrePerSteradian
type: Class
subclass of: Restriction
  has value: 1.0
subclass of: Restriction
  has value: 0.0
comment: Watts per square metre and metre and steradian.
EMMO 1f1b164d ec6a 4faa 8d5e 88bda62316cc: http://qudt.org/vocab/unit/W-PER-M2-M-SR
EMMO 33ae2d07 5526 4555 a0b4 8f4c031b5652: W.m-2.m-1.sr-1
EMMO 7f1dec83 d85e 4e1b b7bd c9442d4f5a64: W/m²⋅m⋅sr
EMMO 967080e5 2f42 4eb2 a3a9 c58143e835f9: Watts per square metre and metre and steradian.

NormalizedStringData
type: Class

IridiumAtom
type: Class
subclass of: Restriction
subclass of: Restriction
  has value: 192.217
subclass of: Restriction
  has value: 77
comment: Atom subclass for iridium.
EMMO 967080e5 2f42 4eb2 a3a9 c58143e835f9: Atom subclass for iridium.

AstatineSymbol
type: Class
subclass of: Restriction
  has value: At
comment: The symbol that stands for the astatine atom.
EMMO 967080e5 2f42 4eb2 a3a9 c58143e835f9: The symbol that stands for the astatine atom.

MeitneriumSymbol
type: Class
subclass of: Restriction
  has value: Mt
comment: The symbol that stands for the meitnerium atom.
EMMO 967080e5 2f42 4eb2 a3a9 c58143e835f9: The symbol that stands for the meitnerium atom.

MilliHenry
type: Class
subclass of: Restriction
  some values from: Henry
subclass of: Restriction
  has value: 0.001
subclass of: Restriction
  has value: 0.0
comment: A unit of inductance equal to one thousandth of a henry. -- QUDT
EMMO 1f1b164d ec6a 4faa 8d5e 88bda62316cc: http://qudt.org/vocab/unit/MilliH
EMMO 33ae2d07 5526 4555 a0b4 8f4c031b5652: mH
EMMO 7f1dec83 d85e 4e1b b7bd c9442d4f5a64: mH
EMMO 967080e5 2f42 4eb2 a3a9 c58143e835f9: A unit of inductance equal to one thousandth of a henry. -- QUDT

MicroBecquerelPerKilogram
type: Class
subclass of: Restriction
  some values from: BecquerelPerKilogram
subclass of: Restriction
  has value: 1e-06
subclass of: Restriction
  has value: 0.0
comment: One radioactive disintegration per hundred thousand seconds from an SI standard unit of mass of sample. -- QUDT
alternative label: Microbecquerels per kilogram
EMMO 1f1b164d ec6a 4faa 8d5e 88bda62316cc: http://qudt.org/vocab/unit/MicroBQ-PER-KiloGM
EMMO 33ae2d07 5526 4555 a0b4 8f4c031b5652: uBq.kg-1
EMMO 7f1dec83 d85e 4e1b b7bd c9442d4f5a64: µBq/kg
EMMO 967080e5 2f42 4eb2 a3a9 c58143e835f9: One radioactive disintegration per hundred thousand seconds from an SI standard unit of mass of sample. -- QUDT

MolePerSecond
type: Class
subclass of: Restriction
  has value: 1.0
subclass of: Restriction
  has value: 0.0
comment: SI base unit mol divided by the SI base unit second -- QUDT
alternative label: Mole Per Second
EMMO 1f1b164d ec6a 4faa 8d5e 88bda62316cc: http://qudt.org/vocab/unit/MOL-PER-SEC
EMMO 33ae2d07 5526 4555 a0b4 8f4c031b5652: mol.s-1
EMMO 33ae2d07 5526 4555 a0b4 8f4c031b5652: mol/s
EMMO 7f1dec83 d85e 4e1b b7bd c9442d4f5a64: mol/s
EMMO 967080e5 2f42 4eb2 a3a9 c58143e835f9: SI base unit mol divided by the SI base unit second -- QUDT

PhaseVelocity
type: Class
comment: For a sinusoidal wave at a given point, velocity in the direction of propagation of the wavefront corresponding to a specified phase.
alternative label: PhaseSpeed
EMMO 26bf1bef d192 4da6 b0eb d2209698fb54: https://www.wikidata.org/wiki/Q13824
EMMO 50c298c2 55a2 4068 b3ac 4e948c33181f: https://www.electropedia.org/iev/iev.nsf/display
EMMO 6dd685dd 1895 46e4 b227 be9f7d643c25: https://dbpedia.org/page/Phase_velocity
EMMO 8de5d5bf db1c 40ac b698 095ba3b18578: 3-23.1
EMMO 967080e5 2f42 4eb2 a3a9 c58143e835f9: For a sinusoidal wave at a given point, velocity in the direction of propagation of the wavefront corresponding to a specified phase.
EMMO c84c6752 6d64 48cc 9500 e54a3c34898d: https://en.wikipedia.org/wiki/Phase_velocity

OrbitalAngularMomentumQuantumNumber
type: Class
comment: Atomic quantum number related to the orbital angular momentum l of a one-electron state.
EMMO 1f1b164d ec6a 4faa 8d5e 88bda62316cc: https://qudt.org/vocab/quantitykind/OrbitalAngularMomentumQuantumNumber
EMMO 26bf1bef d192 4da6 b0eb d2209698fb54: https://www.wikidata.org/wiki/Q1916324
EMMO 8de5d5bf db1c 40ac b698 095ba3b18578: 10-13.3
EMMO 967080e5 2f42 4eb2 a3a9 c58143e835f9: Atomic quantum number related to the orbital angular momentum l of a one-electron state.

QuantumNumber
type: Class
comment: Number describing a particular state of a quantum system.
EMMO 1f1b164d ec6a 4faa 8d5e 88bda62316cc: https://qudt.org/vocab/quantitykind/QuantumNumber
EMMO 26bf1bef d192 4da6 b0eb d2209698fb54: https://www.wikidata.org/wiki/Q232431
EMMO 8de5d5bf db1c 40ac b698 095ba3b18578: 10-13.1
EMMO 967080e5 2f42 4eb2 a3a9 c58143e835f9: Number describing a particular state of a quantum system.

NeonSymbol
type: Class
subclass of: Restriction
  has value: Ne
comment: The symbol that stands for the neon atom.
EMMO 967080e5 2f42 4eb2 a3a9 c58143e835f9: The symbol that stands for the neon atom.

GigaOhm
type: Class
subclass of: Restriction
  some values from: Ohm
subclass of: Restriction
  has value: 1000000000.0
subclass of: Restriction
  has value: 0.0
comment: 1 000 000 000-fold of the SI derived unit ohm -- QUDT
EMMO 1f1b164d ec6a 4faa 8d5e 88bda62316cc: http://qudt.org/vocab/unit/GigaOHM
EMMO 33ae2d07 5526 4555 a0b4 8f4c031b5652: GOhm
EMMO 7f1dec83 d85e 4e1b b7bd c9442d4f5a64: GΩ
EMMO 967080e5 2f42 4eb2 a3a9 c58143e835f9: 1 000 000 000-fold of the SI derived unit ohm -- QUDT

PascalSecondPerMetre
type: Class
subclass of: Restriction
  has value: 1.0
subclass of: Restriction
  has value: 0.0
comment: Pascal Second Per Meter (Pa-s/m) is a unit in the category of Specific acoustic impedance. It is also known as pascal-second/meter. Pascal Second Per Meter has a dimension of ML²T⁻¹ where M is mass, L is length, and T is time. It essentially the same as the corresponding standard SI unit kg/m2· s. -- QUDT
alternative label: Pascal Second Per Metre
EMMO 1f1b164d ec6a 4faa 8d5e 88bda62316cc: http://qudt.org/vocab/unit/PA-SEC-PER-M
EMMO 33ae2d07 5526 4555 a0b4 8f4c031b5652: Pa.s.m-1
EMMO 7f1dec83 d85e 4e1b b7bd c9442d4f5a64: Pa⋅s/m
EMMO 967080e5 2f42 4eb2 a3a9 c58143e835f9: Pascal Second Per Meter (Pa-s/m) is a unit in the category of Specific acoustic impedance. It is also known as pascal-second/meter. Pascal Second Per Meter has a dimension of ML²T⁻¹ where M is mass, L is length, and T is time. It essentially the same as the corresponding standard SI unit kg/m2· s. -- QUDT

JoulePerSquareCentiMetre
type: Class
subclass of: Restriction
  has value: 10000.0
subclass of: Restriction
  has value: 0.0
comment: derived SI unit joule divided by the 0.0001-fold of the power of the SI base unit metre by exponent 2 -- QUDT
alternative label: Joule Per Square Centimetre
EMMO 1f1b164d ec6a 4faa 8d5e 88bda62316cc: http://qudt.org/vocab/unit/J-PER-CentiM2
EMMO 33ae2d07 5526 4555 a0b4 8f4c031b5652: J.cm-2
EMMO 7f1dec83 d85e 4e1b b7bd c9442d4f5a64: J/cm²
EMMO 967080e5 2f42 4eb2 a3a9 c58143e835f9: derived SI unit joule divided by the 0.0001-fold of the power of the SI base unit metre by exponent 2 -- QUDT

Curvature
type: Class
comment: Inverse of the radius of curvature.
EMMO 1f1b164d ec6a 4faa 8d5e 88bda62316cc: https://qudt.org/vocab/quantitykind/CurvatureFromRadius
EMMO 26bf1bef d192 4da6 b0eb d2209698fb54: https://www.wikidata.org/wiki/Q214881
EMMO 50c298c2 55a2 4068 b3ac 4e948c33181f: https://www.electropedia.org/iev/iev.nsf/display
EMMO 6dd685dd 1895 46e4 b227 be9f7d643c25: https://dbpedia.org/page/Curvature
EMMO 8de5d5bf db1c 40ac b698 095ba3b18578: 3-2
EMMO 967080e5 2f42 4eb2 a3a9 c58143e835f9: Inverse of the radius of curvature.

ChemicalCompositionQuantity
type: Class

Concentration
type: Class
comment: the abundance of a constituent divided by the total volume of a mixture.
EMMO 1f1b164d ec6a 4faa 8d5e 88bda62316cc: https://qudt.org/vocab/quantitykind/Concentration
EMMO 26bf1bef d192 4da6 b0eb d2209698fb54: https://www.wikidata.org/wiki/Q3686031
EMMO 6dd685dd 1895 46e4 b227 be9f7d643c25: https://dbpedia.org/page/Concentration
EMMO 967080e5 2f42 4eb2 a3a9 c58143e835f9: the abundance of a constituent divided by the total volume of a mixture.
EMMO c84c6752 6d64 48cc 9500 e54a3c34898d: https://en.wikipedia.org/wiki/Concentration
EMMO fe015383 afb3 44a6 ae86 043628697aa2: https://goldbook.iupac.org/terms/view/C01222

MilliCoulombPerSquareMetre
type: Class
subclass of: Restriction
  some values from: CoulombPerSquareMetre
subclass of: Restriction
  has value: 0.001
subclass of: Restriction
  has value: 0.0
comment: 0.001-fold of the SI derived unit coulomb divided by the power of the SI base unit metre with the exponent 2 -- QUDT
alternative label: Millicoulomb Per Square Metre
EMMO 1f1b164d ec6a 4faa 8d5e 88bda62316cc: http://qudt.org/vocab/unit/MilliC-PER-M2
EMMO 33ae2d07 5526 4555 a0b4 8f4c031b5652: mC.m-2
EMMO 7f1dec83 d85e 4e1b b7bd c9442d4f5a64: mC/m²
EMMO 967080e5 2f42 4eb2 a3a9 c58143e835f9: 0.001-fold of the SI derived unit coulomb divided by the power of the SI base unit metre with the exponent 2 -- QUDT

NewtonSecondPerMetre
type: Class
subclass of: Restriction
  has value: 1.0
subclass of: Restriction
  has value: 0.0
comment: Newton second measured per metre -- QUDT
alternative label: Newton Second per Metre
EMMO 1f1b164d ec6a 4faa 8d5e 88bda62316cc: http://qudt.org/vocab/unit/N-SEC-PER-M
EMMO 33ae2d07 5526 4555 a0b4 8f4c031b5652: N.s.m-1
EMMO 7f1dec83 d85e 4e1b b7bd c9442d4f5a64: N⋅s/m
EMMO 967080e5 2f42 4eb2 a3a9 c58143e835f9: Newton second measured per metre -- QUDT

ParticleNumberDensity
type: Class
subclass of: Restriction
comment: Mean number of particles per volume.
EMMO 1f1b164d ec6a 4faa 8d5e 88bda62316cc: https://qudt.org/vocab/quantitykind/ParticleNumberDensity
EMMO 26bf1bef d192 4da6 b0eb d2209698fb54: https://www.wikidata.org/wiki/Q98601569
EMMO 8de5d5bf db1c 40ac b698 095ba3b18578: 10-62.1
EMMO 967080e5 2f42 4eb2 a3a9 c58143e835f9: Mean number of particles per volume.
EMMO fe015383 afb3 44a6 ae86 043628697aa2: https://doi.org/10.1351/goldbook.N04262

LinearDensityOfElectricCharge
type: Class
subclass of: Restriction
comment: The derivative of the electric charge of a system with respect to the length.
EMMO 26bf1bef d192 4da6 b0eb d2209698fb54: https://www.wikidata.org/wiki/Q77267838
EMMO 50c298c2 55a2 4068 b3ac 4e948c33181f: https://www.electropedia.org/iev/iev.nsf/display
EMMO 8de5d5bf db1c 40ac b698 095ba3b18578: 6-5
EMMO 967080e5 2f42 4eb2 a3a9 c58143e835f9: The derivative of the electric charge of a system with respect to the length.

CoulombSquareMetre
type: Class
subclass of: Restriction
  has value: 1.0
subclass of: Restriction
  has value: 0.0
comment: Coulomb Square Meter (C-m2) is a unit in the category of Electric quadrupole moment. This unit is commonly used in the SI unit system. Coulomb Square Meter (C-m2) has a dimension of L2TI where L is length, T is time, and I is electric current. This unit is the standard SI unit in this category. -- QUDT
alternative label: Coulomb Square Metre
EMMO 1f1b164d ec6a 4faa 8d5e 88bda62316cc: http://qudt.org/vocab/unit/C-M2
EMMO 33ae2d07 5526 4555 a0b4 8f4c031b5652: C.m2
EMMO 7f1dec83 d85e 4e1b b7bd c9442d4f5a64: C⋅m²
EMMO 967080e5 2f42 4eb2 a3a9 c58143e835f9: Coulomb Square Meter (C-m2) is a unit in the category of Electric quadrupole moment. This unit is commonly used in the SI unit system. Coulomb Square Meter (C-m2) has a dimension of L2TI where L is length, T is time, and I is electric current. This unit is the standard SI unit in this category. -- QUDT

ElectricChargeAreaUnit
type: Class
subclass of: Restriction
  has value: T+1 L+2 M0 I+1 Θ0 N0 J0
comment: The class of units with dimensionality 'ElectricChargeArea'.
EMMO 967080e5 2f42 4eb2 a3a9 c58143e835f9: The class of units with dimensionality 'ElectricChargeArea'.

StandardAbsoluteActivityOfSolvent
type: Class
comment: For solvent A, standard absolute activity of the pure substance A at the same temperature and at a standard pressure.
EMMO 26bf1bef d192 4da6 b0eb d2209698fb54: https://www.wikidata.org/wiki/Q89556185
EMMO 8de5d5bf db1c 40ac b698 095ba3b18578: 9-27.3
EMMO 967080e5 2f42 4eb2 a3a9 c58143e835f9: For solvent A, standard absolute activity of the pure substance A at the same temperature and at a standard pressure.

DynamicViscosity
type: Class
subclass of: Restriction
comment: The measure of the resistance of a fluid to flow when an external force is applied.
alternative label: Viscosity
EMMO 1f1b164d ec6a 4faa 8d5e 88bda62316cc: https://qudt.org/vocab/quantitykind/DynamicViscosity
EMMO 26bf1bef d192 4da6 b0eb d2209698fb54: https://www.wikidata.org/wiki/Q15152757
EMMO 50c298c2 55a2 4068 b3ac 4e948c33181f: https://www.electropedia.org/iev/iev.nsf/display
EMMO 8de5d5bf db1c 40ac b698 095ba3b18578: 4-24
EMMO 967080e5 2f42 4eb2 a3a9 c58143e835f9: The measure of the resistance of a fluid to flow when an external force is applied.
EMMO fe015383 afb3 44a6 ae86 043628697aa2: https://doi.org/10.1351/goldbook.D01877

LuminousIntensityUnit
type: Class
subclass of: Restriction
  has value: T0 L0 M0 I0 Θ0 N0 J+1
comment: The class of units with dimensionality 'LuminousIntensity'.
EMMO 967080e5 2f42 4eb2 a3a9 c58143e835f9: The class of units with dimensionality 'LuminousIntensity'.

Property
type: Class
comment: A coded that makes use of an atomic symbol with respect to the code used to refer to the interaction.
comment: A property is atomic in the sense that is aimed to deliver one and one only aspect of the object according to one code, such as the color with one sign (e.g., black) or a quantitiative property (e.g., 1.4 kg).
example: Hardness is a subclass of properties. Vickers hardness is a subclass of hardness that involves the procedures and instruments defined by the standard hardness test.
example: The name "red" which is atomic in the code made of the list of colors.
EMMO 967080e5 2f42 4eb2 a3a9 c58143e835f9: A coded that makes use of an atomic symbol with respect to the code used to refer to the interaction.
EMMO c7b62dd7 063a 4c2a 8504 42f7264ba83f: A property is atomic in the sense that is aimed to deliver one and one only aspect of the object according to one code, such as the color with one sign (e.g., black) or a quantitiative property (e.g., 1.4 kg).

JouleSquareMetrePerKilogram
type: Class
subclass of: Restriction
  has value: 1.0
subclass of: Restriction
  has value: 0.0
comment: Joule square metre per kilogram.
EMMO 1f1b164d ec6a 4faa 8d5e 88bda62316cc: http://qudt.org/vocab/unit/J-M2-PER-KiloGM
EMMO 33ae2d07 5526 4555 a0b4 8f4c031b5652: J.m2.kg-1
EMMO 7f1dec83 d85e 4e1b b7bd c9442d4f5a64: j⋅m²/kg
EMMO 967080e5 2f42 4eb2 a3a9 c58143e835f9: Joule square metre per kilogram.

MassStoppingPowerUnit
type: Class
subclass of: Restriction
  has value: T-2 L+4 M0 I0 Θ0 N0 J0
comment: The class of units with dimensionality 'MassStoppingPower'.
EMMO 967080e5 2f42 4eb2 a3a9 c58143e835f9: The class of units with dimensionality 'MassStoppingPower'.

MilliCoulomb
type: Class
subclass of: Restriction
  some values from: Coulomb
subclass of: Restriction
  has value: 0.001
subclass of: Restriction
  has value: 0.0
comment: A MilliCoulomb is 10⁻³ C. -- QUDT
EMMO 1f1b164d ec6a 4faa 8d5e 88bda62316cc: http://qudt.org/vocab/unit/MilliC
EMMO 33ae2d07 5526 4555 a0b4 8f4c031b5652: mC
EMMO 7f1dec83 d85e 4e1b b7bd c9442d4f5a64: mC
EMMO 967080e5 2f42 4eb2 a3a9 c58143e835f9: A MilliCoulomb is 10⁻³ C. -- QUDT

MechanicalEfficiency
type: Class
comment: Quotient of mechanical output and input power.
EMMO 26bf1bef d192 4da6 b0eb d2209698fb54: https://www.wikidata.org/wiki/Q2628085
EMMO 8de5d5bf db1c 40ac b698 095ba3b18578: 4-29
EMMO 967080e5 2f42 4eb2 a3a9 c58143e835f9: Quotient of mechanical output and input power.

KiloJoulePerKilogram
type: Class
subclass of: Restriction
  some values from: JoulePerKilogram
subclass of: Restriction
  has value: 1000.0
subclass of: Restriction
  has value: 0.0
comment: 1 000-fold of the SI derived unit joule divided by the SI base unit kilogram -- QUDT
alternative label: Kilojoule Per Kilogram
EMMO 1f1b164d ec6a 4faa 8d5e 88bda62316cc: http://qudt.org/vocab/unit/KiloJ-PER-KiloGM
EMMO 33ae2d07 5526 4555 a0b4 8f4c031b5652: kJ.kg-1
EMMO 33ae2d07 5526 4555 a0b4 8f4c031b5652: kJ/kg
EMMO 7f1dec83 d85e 4e1b b7bd c9442d4f5a64: kJ/kg
EMMO 967080e5 2f42 4eb2 a3a9 c58143e835f9: 1 000-fold of the SI derived unit joule divided by the SI base unit kilogram -- QUDT

MassFlow
type: Class
subclass of: Restriction
comment: At a point in a fluid, the product of mass density and velocity.
EMMO 26bf1bef d192 4da6 b0eb d2209698fb54: https://www.wikidata.org/wiki/Q3265048
EMMO 8de5d5bf db1c 40ac b698 095ba3b18578: 4-30.1
EMMO 967080e5 2f42 4eb2 a3a9 c58143e835f9: At a point in a fluid, the product of mass density and velocity.

Radian
type: Class
subclass of: Restriction
  has value: rad
comment: Dimensionless measurement unit for plane angle.
comment: Measure of plane angle.
EMMO 0b1cbe60 d380 4787 b92e be26bdacf2c2: C81
EMMO 1f1b164d ec6a 4faa 8d5e 88bda62316cc: http://qudt.org/vocab/unit/RAD
EMMO 33ae2d07 5526 4555 a0b4 8f4c031b5652: rad
EMMO 6dd685dd 1895 46e4 b227 be9f7d643c25: http://dbpedia.org/resource/Radian
EMMO 967080e5 2f42 4eb2 a3a9 c58143e835f9: Measure of plane angle.
EMMO c84c6752 6d64 48cc 9500 e54a3c34898d: http://en.wikipedia.org/wiki/Radian
EMMO fe015383 afb3 44a6 ae86 043628697aa2: https://doi.org/10.1351/goldbook.R05036

SINonCoherentUnit
type: Class
disjoint union of:
  rest:
    rest: nil
comment: A non-SI coherent can be expressed in terms of its corresponding SI coherent unit, as nonsi_coherent_unit = si_coherent_unit * multiplier + offset where `multiplier` and `offset` are specified via the 'hasConversionMultiplier' and 'hasConversionOffset' data properties, respectively.
comment: An SI unit whos numerical factor in front of the product of base SI units is NOT equal to one.
EMMO 967080e5 2f42 4eb2 a3a9 c58143e835f9: An SI unit whos numerical factor in front of the product of base SI units is NOT equal to one.
EMMO c7b62dd7 063a 4c2a 8504 42f7264ba83f: A non-SI coherent can be expressed in terms of its corresponding SI coherent unit, as nonsi_coherent_unit = si_coherent_unit * multiplier + offset where `multiplier` and `offset` are specified via the 'hasConversionMultiplier' and 'hasConversionOffset' data properties, respectively.

SIUnit
type: Class
comment: The complete set of SI units includes both the coherent set and the multiples and sub-multiples formed by using the SI prefixes.
comment: The names, symbols and prefixes of SI units are defined by the General Conference on Weights and Measures (CGPM). https://en.wikipedia.org/wiki/General_Conference_on_Weights_and_Measures
comment: The set of units provided by the SI referring to the ISQ.
EMMO 967080e5 2f42 4eb2 a3a9 c58143e835f9: The set of units provided by the SI referring to the ISQ.

ActiniumSymbol
type: Class
subclass of: Restriction
  has value: Ac
comment: The symbol that stands for the actinium atom.
EMMO 967080e5 2f42 4eb2 a3a9 c58143e835f9: The symbol that stands for the actinium atom.

ThermochemicalTreatment
type: Class

DoseEquivalentRate
type: Class
comment: Time derivative of the dose equivalent.
EMMO 26bf1bef d192 4da6 b0eb d2209698fb54: https://www.wikidata.org/wiki/Q99604810
EMMO 50c298c2 55a2 4068 b3ac 4e948c33181f: https://www.electropedia.org/iev/iev.nsf/display
EMMO 8de5d5bf db1c 40ac b698 095ba3b18578: 10-83.2
EMMO 967080e5 2f42 4eb2 a3a9 c58143e835f9: Time derivative of the dose equivalent.

AbsorbedDoseRate
type: Class
subclass of: Restriction
comment: Differential quotient of the absorbed dose with respect to time.
EMMO 1f1b164d ec6a 4faa 8d5e 88bda62316cc: https://qudt.org/vocab/quantitykind/AbsorbedDoseRate
EMMO 26bf1bef d192 4da6 b0eb d2209698fb54: https://www.wikidata.org/wiki/Q69428958
EMMO 50c298c2 55a2 4068 b3ac 4e948c33181f: https://www.electropedia.org/iev/iev.nsf/display
EMMO 8de5d5bf db1c 40ac b698 095ba3b18578: 10-84
EMMO 967080e5 2f42 4eb2 a3a9 c58143e835f9: Differential quotient of the absorbed dose with respect to time.

StatisticalWeightOfSubsystem
type: Class
comment: Number of different microstates in a subsystem.
EMMO 26bf1bef d192 4da6 b0eb d2209698fb54: https://www.wikidata.org/wiki/Q96207431
EMMO 8de5d5bf db1c 40ac b698 095ba3b18578: 9-36.1
EMMO 967080e5 2f42 4eb2 a3a9 c58143e835f9: Number of different microstates in a subsystem.

CoulombPerSquareCentiMetre
type: Class
subclass of: Restriction
  has value: 10000.0
subclass of: Restriction
  has value: 0.0
comment: derived SI unit coulomb divided by the 0.0001-fold of the power of the SI base unit metre by exponent 2 -- QUDT
alternative label: Coulomb Per Square Centimetre
EMMO 1f1b164d ec6a 4faa 8d5e 88bda62316cc: http://qudt.org/vocab/unit/C-PER-CentiM2
EMMO 33ae2d07 5526 4555 a0b4 8f4c031b5652: C.cm-2
EMMO 33ae2d07 5526 4555 a0b4 8f4c031b5652: C/cm2
EMMO 7f1dec83 d85e 4e1b b7bd c9442d4f5a64: C/cm²
EMMO 967080e5 2f42 4eb2 a3a9 c58143e835f9: derived SI unit coulomb divided by the 0.0001-fold of the power of the SI base unit metre by exponent 2 -- QUDT

PerMicroMetre
type: Class
subclass of: Restriction
  has value: 1000000.0
subclass of: Restriction
  has value: 0.0
comment: Per Micrometer Unit is a denominator unit with dimensions /microm. -- QUDT
alternative label: ReciprocalMicroMetre
EMMO 1f1b164d ec6a 4faa 8d5e 88bda62316cc: http://qudt.org/vocab/unit/PER-MicroM
EMMO 33ae2d07 5526 4555 a0b4 8f4c031b5652: /um
EMMO 33ae2d07 5526 4555 a0b4 8f4c031b5652: um-1
EMMO 7f1dec83 d85e 4e1b b7bd c9442d4f5a64: /µm
EMMO 967080e5 2f42 4eb2 a3a9 c58143e835f9: Per Micrometer Unit is a denominator unit with dimensions /microm. -- QUDT

StyleSheetLanguage
type: Class
comment: A computer language that expresses the presentation of structured documents.
example: CSS
EMMO 967080e5 2f42 4eb2 a3a9 c58143e835f9: A computer language that expresses the presentation of structured documents.
EMMO c84c6752 6d64 48cc 9500 e54a3c34898d: https://en.wikipedia.org/wiki/Style_sheet_language

PicoGram
type: Class
subclass of: Restriction
  some values from: Gram
subclass of: Restriction
  has value: 1e-15
subclass of: Restriction
  has value: 0.0
comment: 10**-12 grams or one 10**-15 of the SI standard unit of mass (kilogram). -- QUDT
EMMO 1f1b164d ec6a 4faa 8d5e 88bda62316cc: http://qudt.org/vocab/unit/PicoGM
EMMO 33ae2d07 5526 4555 a0b4 8f4c031b5652: pg
EMMO 7f1dec83 d85e 4e1b b7bd c9442d4f5a64: pg
EMMO 967080e5 2f42 4eb2 a3a9 c58143e835f9: 10**-12 grams or one 10**-15 of the SI standard unit of mass (kilogram). -- QUDT

VoltPerCentiMetre
type: Class
subclass of: Restriction
  has value: 100.0
subclass of: Restriction
  has value: 0.0
comment: derived SI unit volt divided by the 0.01-fold of the SI base unit metre -- QUDT
alternative label: Volt Per Centimetre
EMMO 1f1b164d ec6a 4faa 8d5e 88bda62316cc: http://qudt.org/vocab/unit/V-PER-CentiM
EMMO 33ae2d07 5526 4555 a0b4 8f4c031b5652: V.cm-1
EMMO 7f1dec83 d85e 4e1b b7bd c9442d4f5a64: V/cm
EMMO 967080e5 2f42 4eb2 a3a9 c58143e835f9: derived SI unit volt divided by the 0.01-fold of the SI base unit metre -- QUDT

RadianSquareMetrePerKilogram
type: Class
subclass of: Restriction
  has value: 1.0
subclass of: Restriction
  has value: 0.0
comment: Radian square metre per kilogram.
EMMO 1f1b164d ec6a 4faa 8d5e 88bda62316cc: http://qudt.org/vocab/unit/RAD-M2-PER-KiloGM
EMMO 33ae2d07 5526 4555 a0b4 8f4c031b5652: rad.m2.kg-1
EMMO 7f1dec83 d85e 4e1b b7bd c9442d4f5a64: rad⋅m²/kg
EMMO 967080e5 2f42 4eb2 a3a9 c58143e835f9: Radian square metre per kilogram.

ThermalSprayingForming
type: Class

CobaltSymbol
type: Class
subclass of: Restriction
  has value: Co
comment: The symbol that stands for the cobalt atom.
EMMO 967080e5 2f42 4eb2 a3a9 c58143e835f9: The symbol that stands for the cobalt atom.

MilliBecquerel
type: Class
subclass of: Restriction
  some values from: Becquerel
subclass of: Restriction
  has value: 0.001
subclass of: Restriction
  has value: 0.0
EMMO 1f1b164d ec6a 4faa 8d5e 88bda62316cc: http://qudt.org/vocab/unit/MilliBQ
EMMO 7f1dec83 d85e 4e1b b7bd c9442d4f5a64: mBq

QWhole
type: Class
alternative label: QualifiedWhole

Holistic
type: Class
comment: A perspective characterized by the belief that: - a whole is more than merely the sum of its parts (wholism) - the parts of a whole are interconnected in a way that can be explained only by reference to the whole (rolism).
comment: An holistic perspective considers each part of the whole as equally important, without the need to position the parts within a hierarchy (in time or space). The interest is on the whole, on its parts (how they contribute to the whole, i.e. their roles), and their types, without going further into specifying the spatial hierarchy or the temporal position of each part. This class allows the picking of parts without necessarily going trough a rigid hierarchy of spatial compositions (e.g. body -> organ -> cell -> molecule) or temporal composition. This is inline with the transitive nature of parthood, as it is usually defined in literature.
comment: The holistic perspective is not excluding the reductionistic perspective, on the contrary it can be considered its complement.
comment: The union of classes whole and part.
alternative label: Wholistic
example: A molecule of a body can have role in the body evolution, without caring if its part of a specific organ and without specifying the time interval in which this role occurred.
example: A product is a role that can be fulfilled by many objects, but always requires a process to which the product participates and from which it is generated.
EMMO 31252f35 c767 4b97 a877 1235076c3e13: An holistic perspective considers each part of the whole as equally important, without the need to position the parts within a hierarchy (in time or space). The interest is on the whole, on its parts (how they contribute to the whole, i.e. their roles), and their types, without going further into specifying the spatial hierarchy or the temporal position of each part. This class allows the picking of parts without necessarily going trough a rigid hierarchy of spatial compositions (e.g. body -> organ -> cell -> molecule) or temporal composition. This is inline with the transitive nature of parthood, as it is usually defined in literature.
EMMO 70fe84ff 99b6 4206 a9fc 9a8931836d84: The union of classes whole and part.
EMMO 967080e5 2f42 4eb2 a3a9 c58143e835f9: A perspective characterized by the belief that: - a whole is more than merely the sum of its parts (wholism) - the parts of a whole are interconnected in a way that can be explained only by reference to the whole (rolism).
EMMO c7b62dd7 063a 4c2a 8504 42f7264ba83f: The holistic perspective is not excluding the reductionistic perspective, on the contrary it can be considered its complement.

Participant
type: Class
subclass of: Restriction
comment: An object which is an holistic spatial part of a process.
example: A student during an examination.
EMMO 967080e5 2f42 4eb2 a3a9 c58143e835f9: An object which is an holistic spatial part of a process.

AmperePerSquareMetre
type: Class
subclass of: Restriction
  has value: 1.0
subclass of: Restriction
  has value: 0.0
comment: `Ampere Per Square Meter` is a unit in the category of electric current density. This unit is commonly used in the SI unit system. -- QUDT
alternative label: Ampere per Square Metre
EMMO 1f1b164d ec6a 4faa 8d5e 88bda62316cc: http://qudt.org/vocab/unit/A-PER-M2
EMMO 33ae2d07 5526 4555 a0b4 8f4c031b5652: A.m-2
EMMO 33ae2d07 5526 4555 a0b4 8f4c031b5652: A/m2
EMMO 7f1dec83 d85e 4e1b b7bd c9442d4f5a64: A/m²
EMMO 967080e5 2f42 4eb2 a3a9 c58143e835f9: `Ampere Per Square Meter` is a unit in the category of electric current density. This unit is commonly used in the SI unit system. -- QUDT

Quantity
type: Class
subclass of: Restriction
  qualified cardinality: 1
comment: A quantifiable property of a phenomenon, body, or substance.
comment: VIM defines a quantity as a "property of a phenomenon, body, or substance, where the property has a magnitude that can be expressed as a number and a reference". A quantity in EMMO is a property and therefore only addresses the first part of the VIM definition (that is a property of a phenomenon, body, or substance). The second part (that it can be expressed as a number and a reference) is syntactic and addressed by emmo:QuantityValue.
alternative label: Measurand
example: length Rockwell C hardness electric resistance
EMMO 1f1b164d ec6a 4faa 8d5e 88bda62316cc: https://qudt.org/schema/qudt/Quantity
EMMO 8a137e9f 579c 4e28 baca e8980eb0c3db: DisjointUnionOf: SubjectiveProperty, ObjectiveProperty
EMMO 8a137e9f 579c 4e28 baca e8980eb0c3db: EquivalentTo: PhysicalQuantity or OrdinalQuantity
EMMO 967080e5 2f42 4eb2 a3a9 c58143e835f9: A quantifiable property of a phenomenon, body, or substance.
EMMO bb49844b 45d7 4f0d 8cae 8e552cbc20d6: measurand
EMMO bb49844b 45d7 4f0d 8cae 8e552cbc20d6: quantity
EMMO c7b62dd7 063a 4c2a 8504 42f7264ba83f: VIM defines a quantity as a "property of a phenomenon, body, or substance, where the property has a magnitude that can be expressed as a number and a reference". A quantity in EMMO is a property and therefore only addresses the first part of the VIM definition (that is a property of a phenomenon, body, or substance). The second part (that it can be expressed as a number and a reference) is syntactic and addressed by emmo:QuantityValue.

AmpereSecond
type: Class
subclass of: Restriction
  has value: 1.0
subclass of: Restriction
  has value: 0.0
comment: product out of the SI base unit ampere and the SI base unit second -- QUDT
alternative label: Ampere Second
EMMO 1f1b164d ec6a 4faa 8d5e 88bda62316cc: http://qudt.org/vocab/unit/A-SEC
EMMO 33ae2d07 5526 4555 a0b4 8f4c031b5652: A.s
EMMO 7f1dec83 d85e 4e1b b7bd c9442d4f5a64: A⋅s
EMMO 967080e5 2f42 4eb2 a3a9 c58143e835f9: product out of the SI base unit ampere and the SI base unit second -- QUDT

OganessonAtom
type: Class
subclass of: Restriction
subclass of: Restriction
  has value: 294.214
subclass of: Restriction
  has value: 118
comment: Atom subclass for oganesson.
EMMO 967080e5 2f42 4eb2 a3a9 c58143e835f9: Atom subclass for oganesson.

DirectionAndEnergyDistributionOfCrossSection
type: Class
subclass of: Restriction
comment: Partial differential quotient of the cross section of a process with respect to the solid angle around a given direction and the energy of a particle scattered in that direction.
EMMO 1f1b164d ec6a 4faa 8d5e 88bda62316cc: https://qudt.org/vocab/quantitykind/SpectralAngularCrossSection
EMMO 26bf1bef d192 4da6 b0eb d2209698fb54: https://www.wikidata.org/wiki/Q98269571
EMMO 8de5d5bf db1c 40ac b698 095ba3b18578: 10-41
EMMO 967080e5 2f42 4eb2 a3a9 c58143e835f9: Partial differential quotient of the cross section of a process with respect to the solid angle around a given direction and the energy of a particle scattered in that direction.

CubicCentiMetrePerCubicMetre
type: Class
subclass of: Restriction
  has value: 1e-06
subclass of: Restriction
  has value: 0.0
comment: volume ratio consisting of the 0.000 001-fold of the power of the SI base unit metre with the exponent 3 divided by the power of the SI base unit metre with the exponent 3 -- QUDT
alternative label: Cubic Centimetre Per Cubic Metre
EMMO 1f1b164d ec6a 4faa 8d5e 88bda62316cc: http://qudt.org/vocab/unit/CentiM3-PER-M3
EMMO 33ae2d07 5526 4555 a0b4 8f4c031b5652: cm3.m-3
EMMO 33ae2d07 5526 4555 a0b4 8f4c031b5652: cm3/m3
EMMO 7f1dec83 d85e 4e1b b7bd c9442d4f5a64: cm³/m³
EMMO 967080e5 2f42 4eb2 a3a9 c58143e835f9: volume ratio consisting of the 0.000 001-fold of the power of the SI base unit metre with the exponent 3 divided by the power of the SI base unit metre with the exponent 3 -- QUDT

Grinding
type: Class
comment: Removal of material by means of rigid or flexible discs or belts containing abrasives.
alternative label: Schleifen

UndefinedEdgeCutting
type: Class
alternative label: Spanen mit geometrisch unbestimmten Schneiden

IonicStrength
type: Class
subclass of: Restriction
comment: Charge number is a quantity of dimension one defined in ChargeNumber.
comment: For all types of ions in a solution, half the sum of the products of their molality b_i and the square of their charge number z_i.
EMMO 1f1b164d ec6a 4faa 8d5e 88bda62316cc: https://qudt.org/vocab/quantitykind/IonicStrength
EMMO 26bf1bef d192 4da6 b0eb d2209698fb54: https://www.wikidata.org/wiki/Q898396
EMMO 50c298c2 55a2 4068 b3ac 4e948c33181f: https://www.electropedia.org/iev/iev.nsf/display
EMMO 8de5d5bf db1c 40ac b698 095ba3b18578: 9-42
EMMO 967080e5 2f42 4eb2 a3a9 c58143e835f9: For all types of ions in a solution, half the sum of the products of their molality b_i and the square of their charge number z_i.
EMMO fe015383 afb3 44a6 ae86 043628697aa2: https://doi.org/10.1351/goldbook.I03180

ArithmeticExpression
type: Class
subclass of: Class
  complement of: Restriction
example: 2+2

WattSecondPerSquareMetre
type: Class
subclass of: Restriction
  has value: 1.0
subclass of: Restriction
  has value: 0.0
comment: Watt second per square metre.
EMMO 1f1b164d ec6a 4faa 8d5e 88bda62316cc: http://qudt.org/vocab/unit/W-SEC-PER-M2
EMMO 33ae2d07 5526 4555 a0b4 8f4c031b5652: W.s.m-2
EMMO 7f1dec83 d85e 4e1b b7bd c9442d4f5a64: W⋅s/m²
EMMO 967080e5 2f42 4eb2 a3a9 c58143e835f9: Watt second per square metre.

SquareElectricPotentialPerSquareTemperatureUnit
type: Class
subclass of: Restriction
  has value: T-6 L+4 M+2 I-2 Θ-2 N0 J0
comment: The class of units with dimensionality 'SquareElectricPotentialPerSquareTemperature'.
EMMO 967080e5 2f42 4eb2 a3a9 c58143e835f9: The class of units with dimensionality 'SquareElectricPotentialPerSquareTemperature'.

IlluminanceTimeUnit
type: Class
subclass of: Restriction
  has value: T+1 L-2 M0 I0 Θ0 N0 J+1
comment: The class of units with dimensionality 'IlluminanceTime'.
EMMO 967080e5 2f42 4eb2 a3a9 c58143e835f9: The class of units with dimensionality 'IlluminanceTime'.

MilliFarad
type: Class
subclass of: Restriction
  some values from: Farad
subclass of: Restriction
  has value: 0.001
subclass of: Restriction
  has value: 0.0
comment: 0.001-fold of the SI derived unit farad -- QUDT
EMMO 1f1b164d ec6a 4faa 8d5e 88bda62316cc: http://qudt.org/vocab/unit/MilliFARAD
EMMO 33ae2d07 5526 4555 a0b4 8f4c031b5652: mF
EMMO 7f1dec83 d85e 4e1b b7bd c9442d4f5a64: mF
EMMO 967080e5 2f42 4eb2 a3a9 c58143e835f9: 0.001-fold of the SI derived unit farad -- QUDT

MicroFaradPerKiloMetre
type: Class
subclass of: Restriction
  has value: 1e-09
subclass of: Restriction
  has value: 0.0
comment: 0.000001-fold of the SI derived unit farad divided by the 1,000-fold of the SI base unit metre -- QUDT
alternative label: Microfarad Per Kilometre
EMMO 1f1b164d ec6a 4faa 8d5e 88bda62316cc: http://qudt.org/vocab/unit/MicroFARAD-PER-KiloM
EMMO 33ae2d07 5526 4555 a0b4 8f4c031b5652: uF.km-1
EMMO 7f1dec83 d85e 4e1b b7bd c9442d4f5a64: μF/km
EMMO 967080e5 2f42 4eb2 a3a9 c58143e835f9: 0.000001-fold of the SI derived unit farad divided by the 1,000-fold of the SI base unit metre -- QUDT

ElectricChargeDensity
type: Class
subclass of: Restriction
comment: Electric charge per volume.
alternative label: VolumeElectricCharge
EMMO 1f1b164d ec6a 4faa 8d5e 88bda62316cc: https://qudt.org/vocab/quantitykind/ElectricChargeDensity
EMMO 26bf1bef d192 4da6 b0eb d2209698fb54: https://www.wikidata.org/wiki/Q69425629
EMMO 50c298c2 55a2 4068 b3ac 4e948c33181f: https://www.electropedia.org/iev/iev.nsf/display
EMMO 8de5d5bf db1c 40ac b698 095ba3b18578: 6-3
EMMO 967080e5 2f42 4eb2 a3a9 c58143e835f9: Electric charge per volume.
EMMO fe015383 afb3 44a6 ae86 043628697aa2: https://doi.org/10.1351/goldbook.C00988

TotalCurrentDensity
type: Class
comment: Sum of electric current density and displacement current density.
EMMO 1f1b164d ec6a 4faa 8d5e 88bda62316cc: https://qudt.org/vocab/quantitykind/TotalCurrentDensity
EMMO 26bf1bef d192 4da6 b0eb d2209698fb54: https://www.wikidata.org/wiki/Q77680811
EMMO 50c298c2 55a2 4068 b3ac 4e948c33181f: https://www.electropedia.org/iev/iev.nsf/display
EMMO 8de5d5bf db1c 40ac b698 095ba3b18578: 6-20
EMMO 967080e5 2f42 4eb2 a3a9 c58143e835f9: Sum of electric current density and displacement current density.

ElectricCurrentDensity
type: Class
subclass of: Restriction
comment: Electric current divided by the cross-sectional area it is passing through.
alternative label: AreicElectricCurrent
alternative label: CurrentDensity
EMMO 1f1b164d ec6a 4faa 8d5e 88bda62316cc: http://qudt.org/vocab/quantitykind/ElectricCurrentDensity
EMMO 26bf1bef d192 4da6 b0eb d2209698fb54: https://www.wikidata.org/wiki/Q234072
EMMO 50c298c2 55a2 4068 b3ac 4e948c33181f: https://www.electropedia.org/iev/iev.nsf/display
EMMO 8de5d5bf db1c 40ac b698 095ba3b18578: 6-8
EMMO 967080e5 2f42 4eb2 a3a9 c58143e835f9: Electric current divided by the cross-sectional area it is passing through.
EMMO c84c6752 6d64 48cc 9500 e54a3c34898d: https://en.wikipedia.org/wiki/Current_density
EMMO fe015383 afb3 44a6 ae86 043628697aa2: https://doi.org/10.1351/goldbook.E01928

Interpretant
type: Class
subclass of: Restriction
comment: The interpreter's internal representation of the object in a semiosis process.
example: A film is the interpretant for a camera, which is the interpreter. The object captured by the camera is the referent. The film is the internal representation of the object, i.e. how the camera understand the object according to its capacity. The film (interpretant) refers to the object (referent) according to the camera (interpreter). When the film is removed from the camera, developed and printed on photographic paper (or for digital camera the image is downloaded as jpeg and displayed on a laptop) then we create a sign other than the interpretant. However, in case of analogic film we can always look at the negatve that will suggest the intended referent. This is because both sign and interpretant are related to the referent in a similar way. (What we call sign and interpretant in EMMO are both intended as "signs" in Peirce semiotics, the first being external signal for the interpreter and the second the internal sign)
EMMO 967080e5 2f42 4eb2 a3a9 c58143e835f9: The interpreter's internal representation of the object in a semiosis process.

SourceCode
type: Class
comment: A programming language entity expressing a formal detailed plan of what a software is intended to do.
comment: A source code is the companion of an application, being it the entity used to generate the application list of CPU executable instructions.
EMMO 967080e5 2f42 4eb2 a3a9 c58143e835f9: A programming language entity expressing a formal detailed plan of what a software is intended to do.
EMMO c7b62dd7 063a 4c2a 8504 42f7264ba83f: A source code is the companion of an application, being it the entity used to generate the application list of CPU executable instructions.
EMMO c7b62dd7 063a 4c2a 8504 42f7264ba83f: Source code (also referred to as source or code) is the version of software as it is originally written (i.e., typed into a computer) by a human in plain text (i.e., human readable alphanumeric characters).

PerSquareMetre
type: Class
subclass of: Restriction
  has value: 1.0
subclass of: Restriction
  has value: 0.0
comment: "Per Square Meter" is a denominator unit with dimensions /m². -- QUDT
alternative label: ReciprocalSquareMetre
EMMO 1f1b164d ec6a 4faa 8d5e 88bda62316cc: http://qudt.org/vocab/unit/PER-M2
EMMO 33ae2d07 5526 4555 a0b4 8f4c031b5652: /m2
EMMO 33ae2d07 5526 4555 a0b4 8f4c031b5652: m-2
EMMO 7f1dec83 d85e 4e1b b7bd c9442d4f5a64: /m²
EMMO 967080e5 2f42 4eb2 a3a9 c58143e835f9: "Per Square Meter" is a denominator unit with dimensions /m². -- QUDT

Heap
type: Class
comment: A heap class H (subclass of Heap) is defined by choosing a reference type φ, with H subclass of φ, so that each H entity has non overlapping φ parts.
comment: The superclass for all classes of entities that have at least two non overlapping proper parts of the same type of the whole.
EMMO 967080e5 2f42 4eb2 a3a9 c58143e835f9: The superclass for all classes of entities that have at least two non overlapping proper parts of the same type of the whole.
EMMO c7b62dd7 063a 4c2a 8504 42f7264ba83f: A heap class H (subclass of Heap) is defined by choosing a reference type φ, with H subclass of φ, so that each H entity has non overlapping φ parts.

Minute
type: Class
subclass of: Restriction
  has value: 60.0
subclass of: Restriction
  has value: 0.0
subclass of: Restriction
  has value: min
comment: A minute is a unit of measurement of time. The minute is a unit of time equal to 1/60 (the first sexagesimal fraction of an hour or 60 seconds. In the UTC time scale, a minute on rare occasions has 59 or 61 seconds; see leap second. The minute is not an SI unit; however, it is accepted for use with SI units. The SI symbol for minute or minutes is min (for time measurement) or the prime symbol after a number, e.g. 5' (for angle measurement, even if it is informally used for time). -- QUDT
comment: Non-SI time unit defined as 60 seconds.
EMMO 0b1cbe60 d380 4787 b92e be26bdacf2c2: MIN
EMMO 1f1b164d ec6a 4faa 8d5e 88bda62316cc: http://qudt.org/vocab/unit/MIN
EMMO 33ae2d07 5526 4555 a0b4 8f4c031b5652: min
EMMO 6dd685dd 1895 46e4 b227 be9f7d643c25: http://dbpedia.org/page/Minute
EMMO 70fe84ff 99b6 4206 a9fc 9a8931836d84: Non-SI time unit defined as 60 seconds.
EMMO 967080e5 2f42 4eb2 a3a9 c58143e835f9: A minute is a unit of measurement of time. The minute is a unit of time equal to 1/60 (the first sexagesimal fraction of an hour or 60 seconds. In the UTC time scale, a minute on rare occasions has 59 or 61 seconds; see leap second. The minute is not an SI unit; however, it is accepted for use with SI units. The SI symbol for minute or minutes is min (for time measurement) or the prime symbol after a number, e.g. 5' (for angle measurement, even if it is informally used for time). -- QUDT

AntimonySymbol
type: Class
subclass of: Restriction
  has value: Sb
comment: The symbol that stands for the antimony atom.
EMMO 967080e5 2f42 4eb2 a3a9 c58143e835f9: The symbol that stands for the antimony atom.

LorenzCoefficient
type: Class
subclass of: Restriction
comment: Quotient of thermal conductivity, and the product of electric conductivity and thermodynamic temperature.
alternative label: LorenzNumber
EMMO 1f1b164d ec6a 4faa 8d5e 88bda62316cc: https://qudt.org/vocab/quantitykind/LorenzCoefficient
EMMO 26bf1bef d192 4da6 b0eb d2209698fb54: https://www.wikidata.org/wiki/Q105728754
EMMO 8de5d5bf db1c 40ac b698 095ba3b18578: 12-18
EMMO 967080e5 2f42 4eb2 a3a9 c58143e835f9: Quotient of thermal conductivity, and the product of electric conductivity and thermodynamic temperature.

RutherfordiumSymbol
type: Class
subclass of: Restriction
  has value: Rf
comment: The symbol that stands for the rutherfordium atom.
EMMO 967080e5 2f42 4eb2 a3a9 c58143e835f9: The symbol that stands for the rutherfordium atom.

ThermodynamicGrueneisenParameter
type: Class
comment: A dimensionless thermodynamic parameter named after German physicist Eduard Grüneisen.
EMMO 26bf1bef d192 4da6 b0eb d2209698fb54: https://www.wikidata.org/wiki/Q105658620
EMMO 8de5d5bf db1c 40ac b698 095ba3b18578: 12-13
EMMO 967080e5 2f42 4eb2 a3a9 c58143e835f9: A dimensionless thermodynamic parameter named after German physicist Eduard Grüneisen.
EMMO c84c6752 6d64 48cc 9500 e54a3c34898d: https://en.wikipedia.org/wiki/Gr%C3%BCneisen_parameter

TemperaturePerTimeUnit
type: Class
subclass of: Restriction
  has value: T-1 L0 M0 I0 Θ+1 N0 J0
comment: The class of units with dimensionality 'TemperaturePerTime'.
EMMO 967080e5 2f42 4eb2 a3a9 c58143e835f9: The class of units with dimensionality 'TemperaturePerTime'.

VolumeFraction
type: Class
comment: Volume of a constituent of a mixture divided by the sum of volumes of all constituents prior to mixing.
EMMO 1f1b164d ec6a 4faa 8d5e 88bda62316cc: http://qudt.org/vocab/quantitykind/VolumeFraction
EMMO 8de5d5bf db1c 40ac b698 095ba3b18578: 9-14
EMMO 967080e5 2f42 4eb2 a3a9 c58143e835f9: Volume of a constituent of a mixture divided by the sum of volumes of all constituents prior to mixing.
EMMO fe015383 afb3 44a6 ae86 043628697aa2: https://doi.org/10.1351/goldbook.V06643

ElectricFluxUnit
type: Class
subclass of: Restriction
  has value: T-3 L+3 M+1 I-1 Θ0 N0 J0
comment: The class of units with dimensionality 'ElectricFlux'.
EMMO 967080e5 2f42 4eb2 a3a9 c58143e835f9: The class of units with dimensionality 'ElectricFlux'.

MicrowaveSintering
type: Class

GigaHertz
type: Class
subclass of: Restriction
  some values from: Hertz
subclass of: Restriction
  has value: 1000000000.0
subclass of: Restriction
  has value: 0.0
comment: The hertz (symbol Hz) is the SI unit of frequency defined as the number of cycles per second of a periodic phenomenon. A GigaHertz is 10⁹ hz. -- QUDT
EMMO 1f1b164d ec6a 4faa 8d5e 88bda62316cc: http://qudt.org/vocab/unit/GigaHZ
EMMO 33ae2d07 5526 4555 a0b4 8f4c031b5652: GHz
EMMO 7f1dec83 d85e 4e1b b7bd c9442d4f5a64: GHz
EMMO 967080e5 2f42 4eb2 a3a9 c58143e835f9: The hertz (symbol Hz) is the SI unit of frequency defined as the number of cycles per second of a periodic phenomenon. A GigaHertz is 10⁹ hz. -- QUDT

MagneticSusceptibility
type: Class
comment: Scalar or tensor quantity the product of which by the magnetic constant μ0 and by the magnetic field strength H is equal to the magnetic polarization J.
EMMO 1f1b164d ec6a 4faa 8d5e 88bda62316cc: https://qudt.org/vocab/unit/SUSCEPTIBILITY_MAG.html
EMMO 26bf1bef d192 4da6 b0eb d2209698fb54: https://www.wikidata.org/wiki/Q691463
EMMO 50c298c2 55a2 4068 b3ac 4e948c33181f: https://www.electropedia.org/iev/iev.nsf/display
EMMO 8de5d5bf db1c 40ac b698 095ba3b18578: 6-28
EMMO 967080e5 2f42 4eb2 a3a9 c58143e835f9: Scalar or tensor quantity the product of which by the magnetic constant μ0 and by the magnetic field strength H is equal to the magnetic polarization J.

ChlorineSymbol
type: Class
subclass of: Restriction
  has value: Cl
comment: The symbol that stands for the chlorine atom.
EMMO 967080e5 2f42 4eb2 a3a9 c58143e835f9: The symbol that stands for the chlorine atom.

PicoCoulomb
type: Class
subclass of: Restriction
  some values from: Coulomb
subclass of: Restriction
  has value: 1e-12
subclass of: Restriction
  has value: 0.0
comment: A PicoCoulomb is 10⁻¹² C. -- QUDT
EMMO 1f1b164d ec6a 4faa 8d5e 88bda62316cc: http://qudt.org/vocab/unit/PicoC
EMMO 33ae2d07 5526 4555 a0b4 8f4c031b5652: pC
EMMO 7f1dec83 d85e 4e1b b7bd c9442d4f5a64: pC
EMMO 967080e5 2f42 4eb2 a3a9 c58143e835f9: A PicoCoulomb is 10⁻¹² C. -- QUDT

ManganeseSymbol
type: Class
subclass of: Restriction
  has value: Mn
comment: The symbol that stands for the manganese atom.
EMMO 967080e5 2f42 4eb2 a3a9 c58143e835f9: The symbol that stands for the manganese atom.

SpeedFractionUnit
type: Class
comment: Unit for quantities of dimension one that are the fraction of two speeds.
example: Unit for refractive index.
EMMO 967080e5 2f42 4eb2 a3a9 c58143e835f9: Unit for quantities of dimension one that are the fraction of two speeds.

Mathematical
type: Class
comment: A mathematical object in this branch is not representing a concept but an actual graphical object built using mathematcal symbols arranged in some way, according to math conventions.
comment: The class of general mathematical symbolic objects respecting mathematical syntactic rules.
EMMO 967080e5 2f42 4eb2 a3a9 c58143e835f9: The class of general mathematical symbolic objects respecting mathematical syntactic rules.
EMMO c7b62dd7 063a 4c2a 8504 42f7264ba83f: A mathematical object in this branch is not representing a concept but an actual graphical object built using mathematcal symbols arranged in some way, according to math conventions.

Kilogram
type: Class
subclass of: Restriction
  has value: kg
comment: The kilogram, symbol kg, is the SI unit of mass. It is defined by taking the fixed numerical value of the Planck constant h to be 6.62607015×10−34 when expressed in the unit J s, which is equal to kg m2 s−1, where the metre and the second are defined in terms of c and ∆νCs.
EMMO 0b1cbe60 d380 4787 b92e be26bdacf2c2: KGM
EMMO 1f1b164d ec6a 4faa 8d5e 88bda62316cc: http://qudt.org/vocab/unit/KiloGM
EMMO 33ae2d07 5526 4555 a0b4 8f4c031b5652: kg
EMMO 6dd685dd 1895 46e4 b227 be9f7d643c25: http://dbpedia.org/resource/Kilogram
EMMO 70fe84ff 99b6 4206 a9fc 9a8931836d84: The kilogram, symbol kg, is the SI unit of mass. It is defined by taking the fixed numerical value of the Planck constant h to be 6.62607015×10−34 when expressed in the unit J s, which is equal to kg m2 s−1, where the metre and the second are defined in terms of c and ∆νCs.
EMMO c84c6752 6d64 48cc 9500 e54a3c34898d: http://en.wikipedia.org/wiki/Kilogram
EMMO fe015383 afb3 44a6 ae86 043628697aa2: https://doi.org/10.1351/goldbook.K03391

NeutralAtom
type: Class
comment: A standalone atom that has no net charge.
EMMO 967080e5 2f42 4eb2 a3a9 c58143e835f9: A standalone atom that has no net charge.

FastFissionFactor
type: Class
comment: In an infinite medium, the ratio of the mean number of neutrons produced by fission due to neutrons of all energies to the mean number of neutrons produced by fissions due to thermal neutrons only.
EMMO 1f1b164d ec6a 4faa 8d5e 88bda62316cc: https://qudt.org/vocab/quantitykind/FastFissionFactor
EMMO 26bf1bef d192 4da6 b0eb d2209698fb54: https://www.wikidata.org/wiki/Q99197493
EMMO 8de5d5bf db1c 40ac b698 095ba3b18578: 10-75
EMMO 967080e5 2f42 4eb2 a3a9 c58143e835f9: In an infinite medium, the ratio of the mean number of neutrons produced by fission due to neutrons of all energies to the mean number of neutrons produced by fissions due to thermal neutrons only.

CadmiumAtom
type: Class
subclass of: Restriction
subclass of: Restriction
  has value: 112.414
subclass of: Restriction
  has value: 48
comment: Atom subclass for cadmium.
EMMO 967080e5 2f42 4eb2 a3a9 c58143e835f9: Atom subclass for cadmium.

WattPerSquareCentiMetre
type: Class
subclass of: Restriction
  has value: 10000.0
subclass of: Restriction
  has value: 0.0
comment: Watt Per Square Centimeter is a unit of heat flux or thermal flux, the rate of heat energy transfer through a given surface. -- QUDT
alternative label: Watt per Square Centimetre
EMMO 1f1b164d ec6a 4faa 8d5e 88bda62316cc: http://qudt.org/vocab/unit/W-PER-CentiM2
EMMO 33ae2d07 5526 4555 a0b4 8f4c031b5652: W.cm-2
EMMO 7f1dec83 d85e 4e1b b7bd c9442d4f5a64: W/cm²
EMMO 967080e5 2f42 4eb2 a3a9 c58143e835f9: Watt Per Square Centimeter is a unit of heat flux or thermal flux, the rate of heat energy transfer through a given surface. -- QUDT

Document
type: Class
comment: A heterogeneous object made of different graphical object parts.
EMMO 967080e5 2f42 4eb2 a3a9 c58143e835f9: A heterogeneous object made of different graphical object parts.

CalciumSymbol
type: Class
subclass of: Restriction
  has value: Ca
comment: The symbol that stands for the calcium atom.
EMMO 967080e5 2f42 4eb2 a3a9 c58143e835f9: The symbol that stands for the calcium atom.

MassAttenuationCoefficient
type: Class
subclass of: Restriction
comment: Quotient of the linear attenuation coefficient µ and the mass density ρ of the medium.
EMMO 1f1b164d ec6a 4faa 8d5e 88bda62316cc: https://qudt.org/vocab/quantitykind/MassAttenuationCoefficient
EMMO 26bf1bef d192 4da6 b0eb d2209698fb54: https://www.wikidata.org/wiki/Q98591983
EMMO 50c298c2 55a2 4068 b3ac 4e948c33181f: https://www.electropedia.org/iev/iev.nsf/display
EMMO 8de5d5bf db1c 40ac b698 095ba3b18578: 10-50
EMMO 967080e5 2f42 4eb2 a3a9 c58143e835f9: Quotient of the linear attenuation coefficient µ and the mass density ρ of the medium.

NanoGramPerSquareMetrePerPascalPerSecond
type: Class
subclass of: Restriction
  has value: 1e-12
subclass of: Restriction
  has value: 0.0
alternative label: Nanograms per square metre per Pascal per second
EMMO 1f1b164d ec6a 4faa 8d5e 88bda62316cc: http://qudt.org/vocab/unit/NanoGM-PER-M2-PA-SEC
EMMO 7f1dec83 d85e 4e1b b7bd c9442d4f5a64: ng/(m²⋅s⋅Pa)
EMMO c84c6752 6d64 48cc 9500 e54a3c34898d: https://en.wikipedia.org/wiki/Perm_(unit)

WattPerCubicMetre
type: Class
subclass of: Restriction
  has value: 1.0
subclass of: Restriction
  has value: 0.0
comment: SI derived unit watt divided by the power of the SI base unit metre with the exponent 3 -- QUDT
alternative label: Watt Per Cubic Metre
EMMO 1f1b164d ec6a 4faa 8d5e 88bda62316cc: http://qudt.org/vocab/unit/W-PER-M3
EMMO 33ae2d07 5526 4555 a0b4 8f4c031b5652: W.m-3
EMMO 7f1dec83 d85e 4e1b b7bd c9442d4f5a64: W/m³
EMMO 967080e5 2f42 4eb2 a3a9 c58143e835f9: SI derived unit watt divided by the power of the SI base unit metre with the exponent 3 -- QUDT

SpecificVolume
type: Class
subclass of: Restriction
comment: inverse of the mass density ρ, thus v = 1/ρ.
alternative label: MassicVolume
EMMO 1f1b164d ec6a 4faa 8d5e 88bda62316cc: https://qudt.org/vocab/quantitykind/SpecificVolume
EMMO 26bf1bef d192 4da6 b0eb d2209698fb54: https://www.wikidata.org/wiki/Q683556
EMMO 50c298c2 55a2 4068 b3ac 4e948c33181f: https://www.electropedia.org/iev/iev.nsf/display
EMMO 8de5d5bf db1c 40ac b698 095ba3b18578: 4-3
EMMO 967080e5 2f42 4eb2 a3a9 c58143e835f9: inverse of the mass density ρ, thus v = 1/ρ.
EMMO fe015383 afb3 44a6 ae86 043628697aa2: https://doi.org/10.1351/goldbook.S05807

HertzPerKelvin
type: Class
subclass of: Restriction
  has value: 1.0
subclass of: Restriction
  has value: 0.0
comment: `Hertz per Kelvin` is a unit for 'Inverse Time Temperature' expressed as Hz K⁻¹. -- QUDT
alternative label: Hertz per Kelvin
EMMO 1f1b164d ec6a 4faa 8d5e 88bda62316cc: http://qudt.org/vocab/unit/HZ-PER-K
EMMO 33ae2d07 5526 4555 a0b4 8f4c031b5652: Hz.K-1
EMMO 7f1dec83 d85e 4e1b b7bd c9442d4f5a64: Hz/K
EMMO 967080e5 2f42 4eb2 a3a9 c58143e835f9: `Hertz per Kelvin` is a unit for 'Inverse Time Temperature' expressed as Hz K⁻¹. -- QUDT

TotalAngularMomentum
type: Class
comment: Vector quantity in a quantum system composed of the vectorial sum of angular momentum L and spin s.
EMMO 1f1b164d ec6a 4faa 8d5e 88bda62316cc: https://qudt.org/vocab/quantitykind/TotalAngularMomentum
EMMO 26bf1bef d192 4da6 b0eb d2209698fb54: https://www.wikidata.org/wiki/Q97496506
EMMO 8de5d5bf db1c 40ac b698 095ba3b18578: 10-11
EMMO 967080e5 2f42 4eb2 a3a9 c58143e835f9: Vector quantity in a quantum system composed of the vectorial sum of angular momentum L and spin s.

NonActivePower
type: Class
comment: For a two-terminal element or a two-terminal circuit under periodic conditions, quantity equal to the square root of the difference of the squares of the apparent power S and the active power P.
EMMO 1f1b164d ec6a 4faa 8d5e 88bda62316cc: https://qudt.org/vocab/quantitykind/NonActivePower
EMMO 26bf1bef d192 4da6 b0eb d2209698fb54: https://www.wikidata.org/wiki/Q79813060
EMMO 50c298c2 55a2 4068 b3ac 4e948c33181f: https://www.electropedia.org/iev/iev.nsf/display
EMMO 8de5d5bf db1c 40ac b698 095ba3b18578: 6-61
EMMO 967080e5 2f42 4eb2 a3a9 c58143e835f9: For a two-terminal element or a two-terminal circuit under periodic conditions, quantity equal to the square root of the difference of the squares of the apparent power S and the active power P.

MolePerKilogramPascal
type: Class
subclass of: Restriction
  has value: 1.0
subclass of: Restriction
  has value: 0.0
comment: Mole Per Kilogram Pascal (mol/kg-pa) is a unit of Molar Mass variation due to Pressure. -- QUDT
alternative label: Mole per Kilogram Pascal
EMMO 1f1b164d ec6a 4faa 8d5e 88bda62316cc: http://qudt.org/vocab/unit/MOL-PER-KiloGM-PA
EMMO 33ae2d07 5526 4555 a0b4 8f4c031b5652: mol.kg-1.Pa-1
EMMO 7f1dec83 d85e 4e1b b7bd c9442d4f5a64: mol/(kg⋅Pa)
EMMO 967080e5 2f42 4eb2 a3a9 c58143e835f9: Mole Per Kilogram Pascal (mol/kg-pa) is a unit of Molar Mass variation due to Pressure. -- QUDT

AmountPerMassPressureUnit
type: Class
subclass of: Restriction
  has value: T+2 L+1 M-2 I0 Θ0 N+1 J0
comment: The class of units with dimensionality 'AmountPerMassPressure'.
EMMO 967080e5 2f42 4eb2 a3a9 c58143e835f9: The class of units with dimensionality 'AmountPerMassPressure'.

DeciNewtonMetre
type: Class
subclass of: Restriction
  some values from: NewtonMetre
subclass of: Restriction
  has value: 0.1
subclass of: Restriction
  has value: 0.0
comment: 0.1-fold of the product of the derived SI unit joule and the SI base unit metre -- QUDT
alternative label: Decinewton Metre
EMMO 1f1b164d ec6a 4faa 8d5e 88bda62316cc: http://qudt.org/vocab/unit/DeciN-M
EMMO 33ae2d07 5526 4555 a0b4 8f4c031b5652: dN.m
EMMO 7f1dec83 d85e 4e1b b7bd c9442d4f5a64: dN⋅m
EMMO 967080e5 2f42 4eb2 a3a9 c58143e835f9: 0.1-fold of the product of the derived SI unit joule and the SI base unit metre -- QUDT

ActivityFactor
type: Class
comment: Activity factors can also be obtained applying Raoult's law or Henry's law.
comment: For substance X in a liquid or a solid mixture; quotient of absolute activity of substance X and the product of absolute activity of the pure substance X at the same temperature and pressure and amount-of-substance fraction of substance X.
EMMO 26bf1bef d192 4da6 b0eb d2209698fb54: https://www.wikidata.org/wiki/Q89335167
EMMO 8de5d5bf db1c 40ac b698 095ba3b18578: 9-22
EMMO 967080e5 2f42 4eb2 a3a9 c58143e835f9: For substance X in a liquid or a solid mixture; quotient of absolute activity of substance X and the product of absolute activity of the pure substance X at the same temperature and pressure and amount-of-substance fraction of substance X.
EMMO c7b62dd7 063a 4c2a 8504 42f7264ba83f: Activity factors can also be obtained applying Raoult's law or Henry's law.

ActivityCoefficient
type: Class
comment: A coefficient in thermodynamics used to account for deviation of a mixture of chemical substances from ideal behaviour.
EMMO 1f1b164d ec6a 4faa 8d5e 88bda62316cc: https://qudt.org/vocab/quantitykind/ActivityCoefficient
EMMO 26bf1bef d192 4da6 b0eb d2209698fb54: https://www.wikidata.org/wiki/Q745224
EMMO 8de5d5bf db1c 40ac b698 095ba3b18578: 9-25
EMMO 967080e5 2f42 4eb2 a3a9 c58143e835f9: A coefficient in thermodynamics used to account for deviation of a mixture of chemical substances from ideal behaviour.
EMMO fe015383 afb3 44a6 ae86 043628697aa2: https://doi.org/10.1351/goldbook.A00116

MegaHertzMetre
type: Class
subclass of: Restriction
  some values from: HertzMetre
subclass of: Restriction
  has value: 1000000.0
subclass of: Restriction
  has value: 0.0
comment: product of the 1 000 000-fold of the SI derived unit hertz and the 1 000-fold of the SI base unit metre -- QUDT
alternative label: Megahertz Metre
EMMO 1f1b164d ec6a 4faa 8d5e 88bda62316cc: http://qudt.org/vocab/unit/MegaHZ-M
EMMO 33ae2d07 5526 4555 a0b4 8f4c031b5652: MHz.m
EMMO 7f1dec83 d85e 4e1b b7bd c9442d4f5a64: MHz⋅m
EMMO 967080e5 2f42 4eb2 a3a9 c58143e835f9: product of the 1 000 000-fold of the SI derived unit hertz and the 1 000-fold of the SI base unit metre -- QUDT

Width
type: Class
comment: Length in a given direction regarded as horizontal.
comment: The terms breadth and width are often used by convention, as distinguished from length and from height or thickness.
alternative label: Breadth
EMMO 1f1b164d ec6a 4faa 8d5e 88bda62316cc: https://qudt.org/vocab/quantitykind/Width
EMMO 26bf1bef d192 4da6 b0eb d2209698fb54: https://www.wikidata.org/wiki/Q35059
EMMO 50c298c2 55a2 4068 b3ac 4e948c33181f: https://www.electropedia.org/iev/iev.nsf/display
EMMO 8de5d5bf db1c 40ac b698 095ba3b18578: 3-1.2
EMMO 967080e5 2f42 4eb2 a3a9 c58143e835f9: Length in a given direction regarded as horizontal.

LandeFactor
type: Class
comment: Quotient of the magnetic dipole moment of an atom, and the product of the total angular momentum quantum number and the Bohr magneton.
alternative label: GFactorOfAtom
EMMO 1f1b164d ec6a 4faa 8d5e 88bda62316cc: https://qudt.org/vocab/quantitykind/LandeGFactor
EMMO 26bf1bef d192 4da6 b0eb d2209698fb54: https://www.wikidata.org/wiki/Q1191684
EMMO 8de5d5bf db1c 40ac b698 095ba3b18578: 10-14.1
EMMO 967080e5 2f42 4eb2 a3a9 c58143e835f9: Quotient of the magnetic dipole moment of an atom, and the product of the total angular momentum quantum number and the Bohr magneton.

UnintentionalAgency
type: Class

Kilo
type: Class
subclass of: Restriction
  has value: k
subclass of: Restriction
  has value: 1000.0
comment: SI prefix who's value is 1000.
EMMO 967080e5 2f42 4eb2 a3a9 c58143e835f9: SI prefix who's value is 1000.

SilverAtom
type: Class
subclass of: Restriction
subclass of: Restriction
  has value: 107.8682
subclass of: Restriction
  has value: 47
comment: Atom subclass for silver.
EMMO 967080e5 2f42 4eb2 a3a9 c58143e835f9: Atom subclass for silver.

SharedAgent
type: Class

IntentionalAgentByKind
type: Class

MilliSiemensPerMetre
type: Class
subclass of: Restriction
  some values from: SiemensPerMetre
subclass of: Restriction
  has value: 0.001
subclass of: Restriction
  has value: 0.0
alternative label: MilliSiemens per metre
EMMO 1f1b164d ec6a 4faa 8d5e 88bda62316cc: http://qudt.org/vocab/unit/MilliS-PER-M
EMMO 33ae2d07 5526 4555 a0b4 8f4c031b5652: mS.m-1
EMMO 7f1dec83 d85e 4e1b b7bd c9442d4f5a64: mS/m

Broadcast
type: Class
comment: A mixed tiling in which a tile has next spatially connected tiles.
EMMO 967080e5 2f42 4eb2 a3a9 c58143e835f9: A mixed tiling in which a tile has next spatially connected tiles.

MixedTiling
type: Class
subclass of: Restriction
comment: A well formed tessellation with at least a junction tile.
EMMO 967080e5 2f42 4eb2 a3a9 c58143e835f9: A well formed tessellation with at least a junction tile.

HectoPascalCubicMetrePerSecond
type: Class
subclass of: Restriction
  some values from: PascalCubicMetrePerSecond
subclass of: Restriction
  has value: 100.0
subclass of: Restriction
  has value: 0.0
comment: product out of the 100-fold of the SI unit pascal and the power of the SI base unit metre with the exponent 3 divided by the SI base unit second -- QUDT
alternative label: Hectopascal Cubic Metre Per Second
EMMO 1f1b164d ec6a 4faa 8d5e 88bda62316cc: http://qudt.org/vocab/unit/HectoPA-M3-PER-SEC
EMMO 33ae2d07 5526 4555 a0b4 8f4c031b5652: hPa.m3.s-1
EMMO 7f1dec83 d85e 4e1b b7bd c9442d4f5a64: hPa⋅m³/s
EMMO 967080e5 2f42 4eb2 a3a9 c58143e835f9: product out of the 100-fold of the SI unit pascal and the power of the SI base unit metre with the exponent 3 divided by the SI base unit second -- QUDT

PowerAreaUnit
type: Class
subclass of: Restriction
  has value: T-3 L+4 M+1 I0 Θ0 N0 J0
comment: The class of units with dimensionality 'PowerArea'.
EMMO 967080e5 2f42 4eb2 a3a9 c58143e835f9: The class of units with dimensionality 'PowerArea'.

KermaRate
type: Class
subclass of: Restriction
comment: Time derivative of kerma.
EMMO 1f1b164d ec6a 4faa 8d5e 88bda62316cc: https://qudt.org/vocab/quantitykind/KermaRate
EMMO 26bf1bef d192 4da6 b0eb d2209698fb54: https://www.wikidata.org/wiki/Q99713105
EMMO 50c298c2 55a2 4068 b3ac 4e948c33181f: https://www.electropedia.org/iev/iev.nsf/display
EMMO 8de5d5bf db1c 40ac b698 095ba3b18578: 10-86.2
EMMO 967080e5 2f42 4eb2 a3a9 c58143e835f9: Time derivative of kerma.

JosephsonConstant
type: Class
subclass of: Restriction
comment: Inverse of the magnetic flux quantum.
comment: The DBpedia definition (http://dbpedia.org/page/Magnetic_flux_quantum) is outdated as May 20, 2019. It is now an exact quantity.
EMMO 1f1b164d ec6a 4faa 8d5e 88bda62316cc: http://qudt.org/vocab/constant/JosephsonConstant
EMMO 967080e5 2f42 4eb2 a3a9 c58143e835f9: Inverse of the magnetic flux quantum.

ElectricChargePerLengthUnit
type: Class
subclass of: Restriction
  has value: T+1 L-1 M0 I+1 Θ0 N0 J0
comment: The class of units with dimensionality 'ElectricChargePerLength'.
EMMO 967080e5 2f42 4eb2 a3a9 c58143e835f9: The class of units with dimensionality 'ElectricChargePerLength'.

ElectricDipoleMomentUnit
type: Class
subclass of: Restriction
  has value: T+1 L+1 M0 I+1 Θ0 N0 J0
comment: The class of units with dimensionality 'ElectricDipoleMoment'.
EMMO 967080e5 2f42 4eb2 a3a9 c58143e835f9: The class of units with dimensionality 'ElectricDipoleMoment'.

Decay
type: Class
comment: A collapse is a fundamental process occurring to one particle that is expressed as a complete bipartite directed graph K(1,n) with n>1, being n the number of outgoing particles.
EMMO 31252f35 c767 4b97 a877 1235076c3e13: A collapse is a fundamental process occurring to one particle that is expressed as a complete bipartite directed graph K(1,n) with n>1, being n the number of outgoing particles.

QuarticMetrePerSecond
type: Class
comment: Metre to the power four per second.
EMMO 1f1b164d ec6a 4faa 8d5e 88bda62316cc: http://qudt.org/vocab/unit/M4-PER-SEC
EMMO 33ae2d07 5526 4555 a0b4 8f4c031b5652: m4.s-1
EMMO 7f1dec83 d85e 4e1b b7bd c9442d4f5a64: m⁴/s
EMMO 967080e5 2f42 4eb2 a3a9 c58143e835f9: Metre to the power four per second.

QuarticLengthPerTimeUnit
type: Class
subclass of: Restriction
  has value: T-1 L+4 M0 I0 Θ0 N0 J0
comment: The class of units with dimensionality 'QuarticLengthPerTime'.
EMMO 967080e5 2f42 4eb2 a3a9 c58143e835f9: The class of units with dimensionality 'QuarticLengthPerTime'.

MilliWattPerSquareMetre
type: Class
subclass of: Restriction
  some values from: WattPerSquareMetre
subclass of: Restriction
  has value: 0.001
subclass of: Restriction
  has value: 0.0
comment: 0.001-fold of the SI derived unit weber divided by the power of the SI base unit metre with the exponent 2 -- QUDT
alternative label: Milliwatt Per Square Metre
EMMO 1f1b164d ec6a 4faa 8d5e 88bda62316cc: http://qudt.org/vocab/unit/MilliW-PER-M2
EMMO 33ae2d07 5526 4555 a0b4 8f4c031b5652: mW.m-2
EMMO 7f1dec83 d85e 4e1b b7bd c9442d4f5a64: mW/m²
EMMO 967080e5 2f42 4eb2 a3a9 c58143e835f9: 0.001-fold of the SI derived unit weber divided by the power of the SI base unit metre with the exponent 2 -- QUDT

WattPerSquareMetre
type: Class
subclass of: Restriction
  has value: 1.0
subclass of: Restriction
  has value: 0.0
comment: "Watt per Square Meter} is a unit of irradiance defined as the power received per area. This is a unit in the category of Energy flux. It is also known as watts per square meter, watt per square metre, watts per square metre, watt/square meter, watt/square metre. This unit is commonly used in the SI unit system. Watt Per Square Meter (W/m²) has a dimension of MT^{-3" where M is mass, and T is time. This unit is the standard SI unit in this category. -- QUDT
alternative label: Watt per Square Metre
EMMO 1f1b164d ec6a 4faa 8d5e 88bda62316cc: http://qudt.org/vocab/unit/W-PER-M2
EMMO 33ae2d07 5526 4555 a0b4 8f4c031b5652: W.m-2
EMMO 33ae2d07 5526 4555 a0b4 8f4c031b5652: W/m2
EMMO 7f1dec83 d85e 4e1b b7bd c9442d4f5a64: W/m²
EMMO 967080e5 2f42 4eb2 a3a9 c58143e835f9: "Watt per Square Meter} is a unit of irradiance defined as the power received per area. This is a unit in the category of Energy flux. It is also known as watts per square meter, watt per square metre, watts per square metre, watt/square meter, watt/square metre. This unit is commonly used in the SI unit system. Watt Per Square Meter (W/m²) has a dimension of MT^{-3" where M is mass, and T is time. This unit is the standard SI unit in this category. -- QUDT

CubicCentiMetrePerKelvin
type: Class
subclass of: Restriction
  has value: 1e-06
subclass of: Restriction
  has value: 0.0
comment: 0,000 001-fold of the power of the SI base unit metre with the exponent 3 divided by the SI base unit kelvin -- QUDT
alternative label: Cubic Centimetre Per Kelvin
EMMO 1f1b164d ec6a 4faa 8d5e 88bda62316cc: http://qudt.org/vocab/unit/CentiM3-PER-K
EMMO 33ae2d07 5526 4555 a0b4 8f4c031b5652: cm3.K-1
EMMO 33ae2d07 5526 4555 a0b4 8f4c031b5652: cm3/K
EMMO 7f1dec83 d85e 4e1b b7bd c9442d4f5a64: cm³/K
EMMO 967080e5 2f42 4eb2 a3a9 c58143e835f9: 0,000 001-fold of the power of the SI base unit metre with the exponent 3 divided by the SI base unit kelvin -- QUDT

TinAtom
type: Class
subclass of: Restriction
subclass of: Restriction
  has value: 118.71
subclass of: Restriction
  has value: 50
comment: Atom subclass for tin.
EMMO 967080e5 2f42 4eb2 a3a9 c58143e835f9: Atom subclass for tin.

MilliGramPerSquareMetrePerSecond
type: Class
subclass of: Restriction
  has value: 1e-06
subclass of: Restriction
  has value: 0.0
alternative label: Milligrams per square metre per second
EMMO 1f1b164d ec6a 4faa 8d5e 88bda62316cc: http://qudt.org/vocab/unit/MilliGM-PER-M2-SEC
EMMO 33ae2d07 5526 4555 a0b4 8f4c031b5652: mg.m-2.s-1
EMMO 7f1dec83 d85e 4e1b b7bd c9442d4f5a64: mg/(m²⋅s)

LeakageFactor
type: Class
comment: One minus the square of the coupling factor
EMMO 26bf1bef d192 4da6 b0eb d2209698fb54: https://www.wikidata.org/wiki/Q78102042
EMMO 50c298c2 55a2 4068 b3ac 4e948c33181f: https://www.electropedia.org/iev/iev.nsf/display
EMMO 8de5d5bf db1c 40ac b698 095ba3b18578: 6-42.2
EMMO 967080e5 2f42 4eb2 a3a9 c58143e835f9: One minus the square of the coupling factor

ComplexPower
type: Class
comment: Voltage phasor multiplied by complex conjugate of the current phasor.
alternative label: ComplexApparentPower
EMMO 1f1b164d ec6a 4faa 8d5e 88bda62316cc: https://qudt.org/vocab/quantitykind/ComplexPower
EMMO 26bf1bef d192 4da6 b0eb d2209698fb54: https://www.wikidata.org/wiki/Q65239736
EMMO 50c298c2 55a2 4068 b3ac 4e948c33181f: https://www.electropedia.org/iev/iev.nsf/display
EMMO 8de5d5bf db1c 40ac b698 095ba3b18578: 6-59
EMMO 967080e5 2f42 4eb2 a3a9 c58143e835f9: Voltage phasor multiplied by complex conjugate of the current phasor.

IntegerData
type: Class
comment: A data representing an arbritrary sized integer number.
EMMO 8a137e9f 579c 4e28 baca e8980eb0c3db: EquivalentTo: hasDataValue some xsd:integer
EMMO 967080e5 2f42 4eb2 a3a9 c58143e835f9: A data representing an arbritrary sized integer number.

NanoHenry
type: Class
subclass of: Restriction
  some values from: Henry
subclass of: Restriction
  has value: 1e-09
subclass of: Restriction
  has value: 0.0
comment: 0.000000001-fold of the SI derived unit henry -- QUDT
EMMO 1f1b164d ec6a 4faa 8d5e 88bda62316cc: http://qudt.org/vocab/unit/NanoH
EMMO 33ae2d07 5526 4555 a0b4 8f4c031b5652: nH
EMMO 7f1dec83 d85e 4e1b b7bd c9442d4f5a64: nH
EMMO 967080e5 2f42 4eb2 a3a9 c58143e835f9: 0.000000001-fold of the SI derived unit henry -- QUDT

DataBasedSimulationSoftware
type: Class
comment: A computational application that uses existing data to predict the behaviour of a system without providing a identifiable analogy with the original object.
EMMO 967080e5 2f42 4eb2 a3a9 c58143e835f9: A computational application that uses existing data to predict the behaviour of a system without providing a identifiable analogy with the original object.

MegaJoulePerCubicMetre
type: Class
subclass of: Restriction
  some values from: JoulePerCubicMetre
subclass of: Restriction
  has value: 1000000.0
subclass of: Restriction
  has value: 0.0
comment: 1,000,000-fold of the SI derived unit joule divided by the power of the SI base unit metre with the exponent 3 -- QUDT
alternative label: Megajoule Per Cubic Metre
EMMO 1f1b164d ec6a 4faa 8d5e 88bda62316cc: http://qudt.org/vocab/unit/MegaJ-PER-M3
EMMO 33ae2d07 5526 4555 a0b4 8f4c031b5652: MJ.m-3
EMMO 7f1dec83 d85e 4e1b b7bd c9442d4f5a64: MJ/m³
EMMO 967080e5 2f42 4eb2 a3a9 c58143e835f9: 1,000,000-fold of the SI derived unit joule divided by the power of the SI base unit metre with the exponent 3 -- QUDT

ThermodynamicEfficiency
type: Class
comment: Performance measure of a device that uses thermal energy, expressed as the ratio of work done over thermal energy used.
alternative label: ThermalEfficiency
EMMO 1f1b164d ec6a 4faa 8d5e 88bda62316cc: https://qudt.org/vocab/quantitykind/ThermalEfficiency
EMMO 26bf1bef d192 4da6 b0eb d2209698fb54: https://www.wikidata.org/wiki/Q1452104
EMMO 8de5d5bf db1c 40ac b698 095ba3b18578: 5-25.1
EMMO 967080e5 2f42 4eb2 a3a9 c58143e835f9: Performance measure of a device that uses thermal energy, expressed as the ratio of work done over thermal energy used.

NewtonPerMetre
type: Class
subclass of: Restriction
  has value: 1.0
subclass of: Restriction
  has value: 0.0
comment: Newton Per Meter (N/m) is a unit in the category of Surface tension. It is also known as newtons per meter, newton per metre, newtons per metre, newton/meter, newton/metre. This unit is commonly used in the SI unit system. Newton Per Meter (N/m) has a dimension of MT-2 where M is mass, and T is time. This unit is the standard SI unit in this category. -- QUDT
alternative label: Newton per Metre
EMMO 1f1b164d ec6a 4faa 8d5e 88bda62316cc: http://qudt.org/vocab/unit/N-PER-M
EMMO 33ae2d07 5526 4555 a0b4 8f4c031b5652: N.m-1
EMMO 33ae2d07 5526 4555 a0b4 8f4c031b5652: N/m
EMMO 7f1dec83 d85e 4e1b b7bd c9442d4f5a64: N/m
EMMO 967080e5 2f42 4eb2 a3a9 c58143e835f9: Newton Per Meter (N/m) is a unit in the category of Surface tension. It is also known as newtons per meter, newton per metre, newtons per metre, newton/meter, newton/metre. This unit is commonly used in the SI unit system. Newton Per Meter (N/m) has a dimension of MT-2 where M is mass, and T is time. This unit is the standard SI unit in this category. -- QUDT

KiloMolePerCubicMetre
type: Class
subclass of: Restriction
  some values from: MolePerCubicMetre
subclass of: Restriction
  has value: 1000.0
subclass of: Restriction
  has value: 0.0
comment: 1 000-fold of the SI base unit mol divided by the power of the SI base unit metre with the exponent 3 -- QUDT
alternative label: Kilomole Per Cubic Metre
EMMO 1f1b164d ec6a 4faa 8d5e 88bda62316cc: http://qudt.org/vocab/unit/KiloMOL-PER-M3
EMMO 33ae2d07 5526 4555 a0b4 8f4c031b5652: kmol.m-3
EMMO 7f1dec83 d85e 4e1b b7bd c9442d4f5a64: kmol/m³
EMMO 967080e5 2f42 4eb2 a3a9 c58143e835f9: 1 000-fold of the SI base unit mol divided by the power of the SI base unit metre with the exponent 3 -- QUDT

SystemProgram
type: Class
comment: System program refers to operating systems and utility programs that manage computer resources at a low level enabling a computer to function.
example: An operating system. A graphic driver.
EMMO 967080e5 2f42 4eb2 a3a9 c58143e835f9: System program refers to operating systems and utility programs that manage computer resources at a low level enabling a computer to function.

WattPerSquareMetrePerMetre
type: Class
subclass of: Restriction
  has value: 1.0
subclass of: Restriction
  has value: 0.0
comment: Watts per square metre per metre.
EMMO 1f1b164d ec6a 4faa 8d5e 88bda62316cc: http://qudt.org/vocab/unit/W-PER-M2-M
EMMO 33ae2d07 5526 4555 a0b4 8f4c031b5652: W.m-2.m-1
EMMO 7f1dec83 d85e 4e1b b7bd c9442d4f5a64: W/m²⋅m
EMMO 967080e5 2f42 4eb2 a3a9 c58143e835f9: Watts per square metre per metre.

ElectronDensity
type: Class
subclass of: Restriction
comment: Number of electrons in conduction band per volume.
EMMO 1f1b164d ec6a 4faa 8d5e 88bda62316cc: https://qudt.org/vocab/quantitykind/ElectronDensity
EMMO 50c298c2 55a2 4068 b3ac 4e948c33181f: https://www.electropedia.org/iev/iev.nsf/display
EMMO 8de5d5bf db1c 40ac b698 095ba3b18578: 12-29.1
EMMO 967080e5 2f42 4eb2 a3a9 c58143e835f9: Number of electrons in conduction band per volume.

Crystal
type: Class
comment: A material is a crystal if it has essentially a sharp diffraction pattern. A solid is a crystal if it has essentially a sharp diffraction pattern. The word essentially means that most of the intensity of the diffraction is concentrated in relatively sharp Bragg peaks, besides the always present diffuse scattering. In all cases, the positions of the diffraction peaks can be expressed by H=∑ni=1hia∗i (n≥3)
EMMO 967080e5 2f42 4eb2 a3a9 c58143e835f9: A material is a crystal if it has essentially a sharp diffraction pattern. A solid is a crystal if it has essentially a sharp diffraction pattern. The word essentially means that most of the intensity of the diffraction is concentrated in relatively sharp Bragg peaks, besides the always present diffuse scattering. In all cases, the positions of the diffraction peaks can be expressed by H=∑ni=1hia∗i (n≥3)

CrystallineMaterial
type: Class
comment: Suggestion of Rickard Armiento

IonNumberDensity
type: Class
subclass of: Restriction
comment: Number of ions per volume.
alternative label: IonDensity
EMMO 26bf1bef d192 4da6 b0eb d2209698fb54: https://www.wikidata.org/wiki/Q98831218
EMMO 8de5d5bf db1c 40ac b698 095ba3b18578: 10-62.2
EMMO 967080e5 2f42 4eb2 a3a9 c58143e835f9: Number of ions per volume.

CubicMetrePerCoulomb
type: Class
subclass of: Restriction
  has value: 1.0
subclass of: Restriction
  has value: 0.0
comment: Cubic metre per Coulomb.
EMMO 1f1b164d ec6a 4faa 8d5e 88bda62316cc: http://qudt.org/vocab/unit/M3-PER-C
EMMO 33ae2d07 5526 4555 a0b4 8f4c031b5652: m3.C-1
EMMO 7f1dec83 d85e 4e1b b7bd c9442d4f5a64: m³/C
EMMO 967080e5 2f42 4eb2 a3a9 c58143e835f9: Cubic metre per Coulomb.

ReciprocalElectricChargeDensityUnit
type: Class
subclass of: Restriction
  has value: T-1 L+3 M0 I-1 Θ0 N0 J0
comment: The class of units with dimensionality 'ReciprocalElectricChargeDensity'.
EMMO 967080e5 2f42 4eb2 a3a9 c58143e835f9: The class of units with dimensionality 'ReciprocalElectricChargeDensity'.

MilliJoule
type: Class
subclass of: Restriction
  some values from: Joule
subclass of: Restriction
  has value: 0.001
subclass of: Restriction
  has value: 0.0
comment: 0.001-fold of the SI derived unit joule -- QUDT
EMMO 1f1b164d ec6a 4faa 8d5e 88bda62316cc: http://qudt.org/vocab/unit/MilliJ
EMMO 33ae2d07 5526 4555 a0b4 8f4c031b5652: mJ
EMMO 7f1dec83 d85e 4e1b b7bd c9442d4f5a64: mJ
EMMO 967080e5 2f42 4eb2 a3a9 c58143e835f9: 0.001-fold of the SI derived unit joule -- QUDT

MolarVolume
type: Class
subclass of: Restriction
comment: Volume per amount of substance.
EMMO 1f1b164d ec6a 4faa 8d5e 88bda62316cc: https://qudt.org/vocab/quantitykind/MolarVolume
EMMO 26bf1bef d192 4da6 b0eb d2209698fb54: https://www.wikidata.org/wiki/Q487112
EMMO 8de5d5bf db1c 40ac b698 095ba3b18578: 9-5
EMMO 967080e5 2f42 4eb2 a3a9 c58143e835f9: Volume per amount of substance.

ElectronRadius
type: Class
comment: Radius of a sphere such that the relativistic electron energy is distributed uniformly.
EMMO 26bf1bef d192 4da6 b0eb d2209698fb54: https://www.wikidata.org/wiki/Q2152581
EMMO 8de5d5bf db1c 40ac b698 095ba3b18578: 10-19.2
EMMO 967080e5 2f42 4eb2 a3a9 c58143e835f9: Radius of a sphere such that the relativistic electron energy is distributed uniformly.

LogarithmicDecrement
type: Class
comment: Product of damping coefficient and period duration.
EMMO 26bf1bef d192 4da6 b0eb d2209698fb54: https://www.wikidata.org/wiki/Q1399446
EMMO 50c298c2 55a2 4068 b3ac 4e948c33181f: https://www.electropedia.org/iev/iev.nsf/display
EMMO 8de5d5bf db1c 40ac b698 095ba3b18578: 3-25
EMMO 967080e5 2f42 4eb2 a3a9 c58143e835f9: Product of damping coefficient and period duration.

Hertz
type: Class
subclass of: Restriction
  has value: Hz
comment: SI unit for frequence.
comment: The hertz (symbol Hz) is the SI unit of frequency defined as the number of cycles per second of a periodic phenomenon. One of its most common uses is the description of the sine wave, particularly those used in radio and audio applications, such as the frequency of musical tones. The word "hertz" is named for Heinrich Rudolf Hertz, who was the first to conclusively prove the existence of electromagnetic waves. -- QUDT
EMMO 0b1cbe60 d380 4787 b92e be26bdacf2c2: HTZ
EMMO 1f1b164d ec6a 4faa 8d5e 88bda62316cc: http://qudt.org/vocab/unit/HZ
EMMO 33ae2d07 5526 4555 a0b4 8f4c031b5652: Hz
EMMO 6dd685dd 1895 46e4 b227 be9f7d643c25: http://dbpedia.org/resource/Hertz
EMMO 967080e5 2f42 4eb2 a3a9 c58143e835f9: SI unit for frequence.
EMMO c7b62dd7 063a 4c2a 8504 42f7264ba83f: The hertz (symbol Hz) is the SI unit of frequency defined as the number of cycles per second of a periodic phenomenon. One of its most common uses is the description of the sine wave, particularly those used in radio and audio applications, such as the frequency of musical tones. The word "hertz" is named for Heinrich Rudolf Hertz, who was the first to conclusively prove the existence of electromagnetic waves. -- QUDT
EMMO fe015383 afb3 44a6 ae86 043628697aa2: https://doi.org/10.1351/goldbook.H02785

CodedByStructure
type: Class
comment: A coded classified by its structure.
EMMO 967080e5 2f42 4eb2 a3a9 c58143e835f9: A coded classified by its structure.

KelvinPerKelvin
type: Class
subclass of: Restriction
  has value: 1.0
subclass of: Restriction
  has value: 0.0
comment: SI base unit kelvin divided by the SI base unit kelvin -- QUDT
alternative label: Kelvin Per Kelvin
EMMO 1f1b164d ec6a 4faa 8d5e 88bda62316cc: http://qudt.org/vocab/unit/K-PER-K
EMMO 33ae2d07 5526 4555 a0b4 8f4c031b5652: K.K-1
EMMO 7f1dec83 d85e 4e1b b7bd c9442d4f5a64: K/K
EMMO 967080e5 2f42 4eb2 a3a9 c58143e835f9: SI base unit kelvin divided by the SI base unit kelvin -- QUDT

RotationalDisplacement
type: Class
comment: Quotient of the traversed circular path length of a point in space during a rotation and its distance from the axis or centre of rotation.
alternative label: AngularDisplacement
EMMO 26bf1bef d192 4da6 b0eb d2209698fb54: https://www.wikidata.org/wiki/Q3305038
EMMO 8de5d5bf db1c 40ac b698 095ba3b18578: 3-6
EMMO 967080e5 2f42 4eb2 a3a9 c58143e835f9: Quotient of the traversed circular path length of a point in space during a rotation and its distance from the axis or centre of rotation.
EMMO c84c6752 6d64 48cc 9500 e54a3c34898d: https://en.wikipedia.org/wiki/Angular_displacement

PositionVector
type: Class
subclass of: Restriction
comment: In the usual geometrical three-dimensional space, position vectors are quantities of the dimension length. -- IEC
comment: Vector quantity from the origin of a coordinate system to a point in space.
alternative label: Position
EMMO 1f1b164d ec6a 4faa 8d5e 88bda62316cc: http://qudt.org/vocab/quantitykind/PositionVector
EMMO 26bf1bef d192 4da6 b0eb d2209698fb54: https://www.wikidata.org/wiki/Q192388
EMMO 50c298c2 55a2 4068 b3ac 4e948c33181f: https://www.electropedia.org/iev/iev.nsf/display
EMMO 6dd685dd 1895 46e4 b227 be9f7d643c25: https://dbpedia.org/page/Position_(geometry)
EMMO 8de5d5bf db1c 40ac b698 095ba3b18578: 3-1.10
EMMO 967080e5 2f42 4eb2 a3a9 c58143e835f9: Vector quantity from the origin of a coordinate system to a point in space.
EMMO c7b62dd7 063a 4c2a 8504 42f7264ba83f: In the usual geometrical three-dimensional space, position vectors are quantities of the dimension length. -- IEC
EMMO c7b62dd7 063a 4c2a 8504 42f7264ba83f: Position vectors are so-called bounded vectors, i.e. their magnitude and direction depend on the particular coordinate system used. -- ISO 80000-3
EMMO c84c6752 6d64 48cc 9500 e54a3c34898d: https://en.wikipedia.org/wiki/Position_(geometry)

Bel
type: Class
subclass of: Restriction
  has value: 1.0
subclass of: Restriction
  has value: 0.0
subclass of: Restriction
  has value: B
comment: A logarithmic unit of sound pressure equal to 10 decibels (dB), It is defined as: 1 B = (1/2) log₁₀(Np) -- QUDT
comment: One bel is defined as `1⁄2 ln(10) neper`.
comment: Today decibel (one tenth of a bel) is commonly used instead of bel.
comment: bel is used to express the ratio of one value of a power or field quantity to another, on a logarithmic scale, the logarithmic quantity being called the power level or field level, respectively.
EMMO 0b1cbe60 d380 4787 b92e be26bdacf2c2: M72
EMMO 1f1b164d ec6a 4faa 8d5e 88bda62316cc: http://qudt.org/vocab/unit/B
EMMO 33ae2d07 5526 4555 a0b4 8f4c031b5652: B
EMMO 6dd685dd 1895 46e4 b227 be9f7d643c25: http://dbpedia.org/resource/Bel
EMMO 70fe84ff 99b6 4206 a9fc 9a8931836d84: One bel is defined as `1⁄2 ln(10) neper`.
EMMO 967080e5 2f42 4eb2 a3a9 c58143e835f9: A logarithmic unit of sound pressure equal to 10 decibels (dB), It is defined as: 1 B = (1/2) log₁₀(Np) -- QUDT
EMMO c84c6752 6d64 48cc 9500 e54a3c34898d: https://en.wikipedia.org/wiki/Decibel

YottaCoulomb
type: Class
subclass of: Restriction
  some values from: Coulomb
subclass of: Restriction
  has value: 1e+24
subclass of: Restriction
  has value: 0.0
comment: A YottaCoulomb is 10²⁴ C. -- QUDT
EMMO 1f1b164d ec6a 4faa 8d5e 88bda62316cc: http://qudt.org/vocab/unit/YottaC
EMMO 33ae2d07 5526 4555 a0b4 8f4c031b5652: YC
EMMO 7f1dec83 d85e 4e1b b7bd c9442d4f5a64: YC
EMMO 967080e5 2f42 4eb2 a3a9 c58143e835f9: A YottaCoulomb is 10²⁴ C. -- QUDT

MercuryAtom
type: Class
subclass of: Restriction
subclass of: Restriction
  has value: 200.592
subclass of: Restriction
  has value: 80
comment: Atom subclass for mercury.
EMMO 967080e5 2f42 4eb2 a3a9 c58143e835f9: Atom subclass for mercury.

AngularVelocity
type: Class
subclass of: Restriction
comment: Axial vector quantity describing the rotation around an axis, with magnitude ω=|dφ/dt|, where dφ is the plane angle change during the infinitesimal time interval with duration dt, and with direction along the axis for which the rotation is clockwise.
EMMO 1f1b164d ec6a 4faa 8d5e 88bda62316cc: https://qudt.org/vocab/quantitykind/AngularVelocity
EMMO 50c298c2 55a2 4068 b3ac 4e948c33181f: https://www.electropedia.org/iev/iev.nsf/display
EMMO 6dd685dd 1895 46e4 b227 be9f7d643c25: https://dbpedia.org/page/Angular_velocity
EMMO 8de5d5bf db1c 40ac b698 095ba3b18578: 3-12
EMMO 967080e5 2f42 4eb2 a3a9 c58143e835f9: Axial vector quantity describing the rotation around an axis, with magnitude ω=|dφ/dt|, where dφ is the plane angle change during the infinitesimal time interval with duration dt, and with direction along the axis for which the rotation is clockwise.
EMMO c84c6752 6d64 48cc 9500 e54a3c34898d: https://en.wikipedia.org/wiki/Angular_velocity

StoichiometricNumberOfSubstance
type: Class
comment: For substance B, an integer number or a simple fraction, being negative for a reactant and positive for a product, occurring in the expression for a chemical reaction.
example: The factors 1/2 and 3/2 in the chemical reaction formula below are stoicheiometric mumbers of substance. (1/2)N2 + (3/2)H2 = NH3
EMMO 1f1b164d ec6a 4faa 8d5e 88bda62316cc: https://qudt.org/vocab/quantitykind/StoichiometricNumber
EMMO 26bf1bef d192 4da6 b0eb d2209698fb54: https://www.wikidata.org/wiki/Q95443720
EMMO 50c298c2 55a2 4068 b3ac 4e948c33181f: https://www.electropedia.org/iev/iev.nsf/display
EMMO 8de5d5bf db1c 40ac b698 095ba3b18578: 9-29
EMMO 967080e5 2f42 4eb2 a3a9 c58143e835f9: For substance B, an integer number or a simple fraction, being negative for a reactant and positive for a product, occurring in the expression for a chemical reaction.
EMMO fe015383 afb3 44a6 ae86 043628697aa2: https://doi.org/10.1351/goldbook.S06025

Tessellation
type: Class
subclass of: Restriction
comment: A causal structure that is tessellated in direct parts.
comment: A tessellation (or tiling) is the covering of a surface, often a plane, using one or more geometric shapes, called tiles, with no overlaps and no gaps.
alternative label: Tiling
EMMO 31252f35 c767 4b97 a877 1235076c3e13: A tessellation (or tiling) is the covering of a surface, often a plane, using one or more geometric shapes, called tiles, with no overlaps and no gaps.
EMMO 967080e5 2f42 4eb2 a3a9 c58143e835f9: A causal structure that is tessellated in direct parts.

ExactConstant
type: Class
comment: Physical constant used to define a unit system. Hence, when expressed in that unit system they have an exact value with no associated uncertainty.
EMMO 967080e5 2f42 4eb2 a3a9 c58143e835f9: Physical constant used to define a unit system. Hence, when expressed in that unit system they have an exact value with no associated uncertainty.

MolarGasConstant
type: Class
subclass of: Restriction
comment: Equivalent to the Boltzmann constant, but expressed in units of energy per temperature increment per mole (rather than energy per temperature increment per particle).
EMMO 1f1b164d ec6a 4faa 8d5e 88bda62316cc: http://qudt.org/vocab/constant/MolarGasConstant
EMMO 8de5d5bf db1c 40ac b698 095ba3b18578: 9-37.1
EMMO 967080e5 2f42 4eb2 a3a9 c58143e835f9: Equivalent to the Boltzmann constant, but expressed in units of energy per temperature increment per mole (rather than energy per temperature increment per particle).
EMMO fe015383 afb3 44a6 ae86 043628697aa2: https://doi.org/10.1351/goldbook.G02579

SpecificGasConstant
type: Class
subclass of: Restriction
comment: Quotient of the Boltzmann constant and the mass m.
EMMO 26bf1bef d192 4da6 b0eb d2209698fb54: https://www.wikidata.org/wiki/Q94372268
EMMO 8de5d5bf db1c 40ac b698 095ba3b18578: 5-26
EMMO 967080e5 2f42 4eb2 a3a9 c58143e835f9: Quotient of the Boltzmann constant and the mass m.

HectoGram
type: Class
subclass of: Restriction
  some values from: Gram
subclass of: Restriction
  has value: 0.1
subclass of: Restriction
  has value: 0.0
comment: 0.1-fold of the SI base unit kilogram -- QUDT
EMMO 1f1b164d ec6a 4faa 8d5e 88bda62316cc: http://qudt.org/vocab/unit/HectoGM
EMMO 33ae2d07 5526 4555 a0b4 8f4c031b5652: hg
EMMO 7f1dec83 d85e 4e1b b7bd c9442d4f5a64: hg
EMMO 967080e5 2f42 4eb2 a3a9 c58143e835f9: 0.1-fold of the SI base unit kilogram -- QUDT

WorkpieceForming
type: Class
comment: A manufacturing in which it is formed a solid body with its shape from shapeless original material parts, whose cohesion is created during the process.
alternative label: ArchetypeForming
alternative label: PrimitiveForming

JouleSquareMetre
type: Class
subclass of: Restriction
  has value: 1.0
subclass of: Restriction
  has value: 0.0
comment: Joule square metre.
EMMO 1f1b164d ec6a 4faa 8d5e 88bda62316cc: http://qudt.org/vocab/unit/J-M2
EMMO 33ae2d07 5526 4555 a0b4 8f4c031b5652: J.m2
EMMO 7f1dec83 d85e 4e1b b7bd c9442d4f5a64: J⋅m²
EMMO 967080e5 2f42 4eb2 a3a9 c58143e835f9: Joule square metre.

EnergyAreaUnit
type: Class
subclass of: Restriction
  has value: T-2 L+4 M+1 I0 Θ0 N0 J0
comment: The class of units with dimensionality 'EnergyArea'.
EMMO 967080e5 2f42 4eb2 a3a9 c58143e835f9: The class of units with dimensionality 'EnergyArea'.

NominalProperty
type: Class
comment: "Property of a phenomenon, body, or substance, where the property has no magnitude." "A nominal property has a value, which can be expressed in words, by alphanumerical codes, or by other means." International vocabulary of metrology (VIM)
comment: An 'ObjectiveProperty' that cannot be quantified.
example: CFC is a 'sign' that stands for the fact that the morphology of atoms composing the microstructure of an entity is predominantly Cubic Face Centered A color is a nominal property. Sex of a human being.
EMMO 967080e5 2f42 4eb2 a3a9 c58143e835f9: An 'ObjectiveProperty' that cannot be quantified.
EMMO bb49844b 45d7 4f0d 8cae 8e552cbc20d6: nominal property

Gyroradius
type: Class
comment: Radius of the circular movement of an electrically charged particle in a magnetic field.
alternative label: LarmorRadius
EMMO 26bf1bef d192 4da6 b0eb d2209698fb54: https://www.wikidata.org/wiki/Q1194458
EMMO 8de5d5bf db1c 40ac b698 095ba3b18578: 10-17
EMMO 967080e5 2f42 4eb2 a3a9 c58143e835f9: Radius of the circular movement of an electrically charged particle in a magnetic field.

SquareMetrePerKilogram
type: Class
subclass of: Restriction
  has value: 1.0
subclass of: Restriction
  has value: 0.0
comment: Square Meter Per Kilogram (m2/kg) is a unit in the category of Specific Area. It is also known as square meters per kilogram, square metre per kilogram, square metres per kilogram, square meter/kilogram, square metre/kilogram. This unit is commonly used in the SI unit system. Square Meter Per Kilogram (m2/kg) has a dimension of M-1L2 where M is mass, and L is length. This unit is the standard SI unit in this category. -- QUDT
alternative label: Square Metre per Kilogram
EMMO 1f1b164d ec6a 4faa 8d5e 88bda62316cc: http://qudt.org/vocab/unit/M2-PER-KiloGM
EMMO 33ae2d07 5526 4555 a0b4 8f4c031b5652: m2.kg-1
EMMO 7f1dec83 d85e 4e1b b7bd c9442d4f5a64: m²/kg
EMMO 967080e5 2f42 4eb2 a3a9 c58143e835f9: Square Meter Per Kilogram (m2/kg) is a unit in the category of Specific Area. It is also known as square meters per kilogram, square metre per kilogram, square metres per kilogram, square meter/kilogram, square metre/kilogram. This unit is commonly used in the SI unit system. Square Meter Per Kilogram (m2/kg) has a dimension of M-1L2 where M is mass, and L is length. This unit is the standard SI unit in this category. -- QUDT

TotalCrossSection
type: Class
comment: Sum of all cross sections corresponding to the various reactions or processes between an incident particle of specified type and energy and a target entity.
EMMO 1f1b164d ec6a 4faa 8d5e 88bda62316cc: https://qudt.org/vocab/quantitykind/TotalCrossSection
EMMO 26bf1bef d192 4da6 b0eb d2209698fb54: https://www.wikidata.org/wiki/Q98206553
EMMO 8de5d5bf db1c 40ac b698 095ba3b18578: 10-38.2
EMMO 967080e5 2f42 4eb2 a3a9 c58143e835f9: Sum of all cross sections corresponding to the various reactions or processes between an incident particle of specified type and energy and a target entity.

AtomicPhysicsCrossSection
type: Class
subclass of: Restriction
comment: Measure of probability that a specific process will take place in a collision of two particles.
EMMO 1f1b164d ec6a 4faa 8d5e 88bda62316cc: https://qudt.org/vocab/quantitykind/Cross-Section.html
EMMO 26bf1bef d192 4da6 b0eb d2209698fb54: https://www.wikidata.org/wiki/Q17128025
EMMO 8de5d5bf db1c 40ac b698 095ba3b18578: 10-38.1
EMMO 967080e5 2f42 4eb2 a3a9 c58143e835f9: Measure of probability that a specific process will take place in a collision of two particles.

Candela
type: Class
subclass of: Restriction
  has value: cd
comment: The candela, symbol cd, is the SI unit of luminous intensity in a given direction. It is defined by taking the fixed numerical value of the luminous efficacy of monochromatic radiation of frequency 540×1012 Hz, Kcd, to be 683 when expressed in the unit lm W−1, which is equal to cd sr W−1, or cd sr kg−1 m−2 s3, where the kilogram, metre and second are defined in terms of h, c and ∆νCs.
EMMO 0b1cbe60 d380 4787 b92e be26bdacf2c2: CDL
EMMO 1f1b164d ec6a 4faa 8d5e 88bda62316cc: http://qudt.org/vocab/unit/CD
EMMO 33ae2d07 5526 4555 a0b4 8f4c031b5652: cd
EMMO 6dd685dd 1895 46e4 b227 be9f7d643c25: http://dbpedia.org/resource/Candela
EMMO 70fe84ff 99b6 4206 a9fc 9a8931836d84: The candela, symbol cd, is the SI unit of luminous intensity in a given direction. It is defined by taking the fixed numerical value of the luminous efficacy of monochromatic radiation of frequency 540×1012 Hz, Kcd, to be 683 when expressed in the unit lm W−1, which is equal to cd sr W−1, or cd sr kg−1 m−2 s3, where the kilogram, metre and second are defined in terms of h, c and ∆νCs.
EMMO c84c6752 6d64 48cc 9500 e54a3c34898d: http://en.wikipedia.org/wiki/Candela
EMMO fe015383 afb3 44a6 ae86 043628697aa2: https://doi.org/10.1351/goldbook.C00787

ReactionEnergy
type: Class
comment: In a nuclear reaction, sum of the kinetic energies and photon energies of the reaction products minus the sum of the kinetic and photon energies of the reactants.
EMMO 1f1b164d ec6a 4faa 8d5e 88bda62316cc: https://qudt.org/vocab/quantitykind/ReactionEnergy
EMMO 26bf1bef d192 4da6 b0eb d2209698fb54: https://www.wikidata.org/wiki/Q98164745
EMMO 8de5d5bf db1c 40ac b698 095ba3b18578: 10-37.1
EMMO 967080e5 2f42 4eb2 a3a9 c58143e835f9: In a nuclear reaction, sum of the kinetic energies and photon energies of the reaction products minus the sum of the kinetic and photon energies of the reactants.

CondensedFormula
type: Class
example: An expression that provides information about the element types that constiture a molecule or a molecular substance and their number, together with simple information about the connectivity of its groups by using parenthesis or by goruping element names according to its molecular structure.

MolePerCubicDeciMetre
type: Class
subclass of: Restriction
  has value: 1000.0
subclass of: Restriction
  has value: 0.0
comment: SI base unit mol divided by the 0.001-fold of the power of the SI base unit metre with the exponent 3 -- QUDT
alternative label: Mole Per Cubic Decimetre
EMMO 1f1b164d ec6a 4faa 8d5e 88bda62316cc: http://qudt.org/vocab/unit/MOL-PER-DeciM3
EMMO 33ae2d07 5526 4555 a0b4 8f4c031b5652: mol.dm-3
EMMO 7f1dec83 d85e 4e1b b7bd c9442d4f5a64: mol/dm³
EMMO 967080e5 2f42 4eb2 a3a9 c58143e835f9: SI base unit mol divided by the 0.001-fold of the power of the SI base unit metre with the exponent 3 -- QUDT

ElectricCurrent
type: Class
subclass of: Restriction
comment: A flow of electric charge.
EMMO 1f1b164d ec6a 4faa 8d5e 88bda62316cc: http://qudt.org/vocab/quantitykind/ElectricCurrent
EMMO 8de5d5bf db1c 40ac b698 095ba3b18578: 6-1
EMMO 967080e5 2f42 4eb2 a3a9 c58143e835f9: A flow of electric charge.
EMMO fe015383 afb3 44a6 ae86 043628697aa2: https://doi.org/10.1351/goldbook.E01927

NonLeakageProbability
type: Class
comment: Probability that a neutron will not escape from the reactor during the slowing-down process or while it diffuses as a thermal neutron.
EMMO 1f1b164d ec6a 4faa 8d5e 88bda62316cc: https://qudt.org/vocab/quantitykind/Non-LeakageProbability
EMMO 26bf1bef d192 4da6 b0eb d2209698fb54: https://www.wikidata.org/wiki/Q99415566
EMMO 8de5d5bf db1c 40ac b698 095ba3b18578: 10-77
EMMO 967080e5 2f42 4eb2 a3a9 c58143e835f9: Probability that a neutron will not escape from the reactor during the slowing-down process or while it diffuses as a thermal neutron.

PicoFarad
type: Class
subclass of: Restriction
  some values from: Farad
subclass of: Restriction
  has value: 1e-12
subclass of: Restriction
  has value: 0.0
comment: "PicoF" is a common unit of electric capacitance equal to 10⁻¹² farad. This unit was formerly called the micromicrofarad. -- QUDT
EMMO 1f1b164d ec6a 4faa 8d5e 88bda62316cc: http://qudt.org/vocab/unit/PicoFARAD
EMMO 33ae2d07 5526 4555 a0b4 8f4c031b5652: pF
EMMO 7f1dec83 d85e 4e1b b7bd c9442d4f5a64: pF
EMMO 967080e5 2f42 4eb2 a3a9 c58143e835f9: "PicoF" is a common unit of electric capacitance equal to 10⁻¹² farad. This unit was formerly called the micromicrofarad. -- QUDT
EMMO c84c6752 6d64 48cc 9500 e54a3c34898d: http://en.wikipedia.org/wiki/Farad

CubicCentiMetre
type: Class
subclass of: Restriction
  has value: 1e-06
subclass of: Restriction
  has value: 0.0
comment: The CGS unit of volume, equal to 10-6 cubic meter, 1 milliliter, or about 0.061 023 7 cubic inch -- QUDT
alternative label: cubic centimetre
EMMO 1f1b164d ec6a 4faa 8d5e 88bda62316cc: http://qudt.org/vocab/unit/CentiM3
EMMO 33ae2d07 5526 4555 a0b4 8f4c031b5652: cm3
EMMO 7f1dec83 d85e 4e1b b7bd c9442d4f5a64: cm³
EMMO 967080e5 2f42 4eb2 a3a9 c58143e835f9: The CGS unit of volume, equal to 10-6 cubic meter, 1 milliliter, or about 0.061 023 7 cubic inch -- QUDT

AntimonyAtom
type: Class
subclass of: Restriction
subclass of: Restriction
  has value: 121.76
subclass of: Restriction
  has value: 51
comment: Atom subclass for antimony.
EMMO 967080e5 2f42 4eb2 a3a9 c58143e835f9: Atom subclass for antimony.

NuclidicMass
type: Class
comment: Rest mass of a nuclide X in the ground state.
EMMO 26bf1bef d192 4da6 b0eb d2209698fb54: https://www.wikidata.org/wiki/Q97010809
EMMO 8de5d5bf db1c 40ac b698 095ba3b18578: 10-4.2
EMMO 967080e5 2f42 4eb2 a3a9 c58143e835f9: Rest mass of a nuclide X in the ground state.
EMMO fe015383 afb3 44a6 ae86 043628697aa2: https://doi.org/10.1351/goldbook.N04258

RestMass
type: Class
comment: For particle X, mass of that particle at rest in an inertial frame.
alternative label: InvariantMass
alternative label: ProperMass
EMMO 1f1b164d ec6a 4faa 8d5e 88bda62316cc: https://qudt.org/vocab/quantitykind/RestMass
EMMO 26bf1bef d192 4da6 b0eb d2209698fb54: https://www.wikidata.org/wiki/Q96941619
EMMO 50c298c2 55a2 4068 b3ac 4e948c33181f: https://www.electropedia.org/iev/iev.nsf/display
EMMO 6dd685dd 1895 46e4 b227 be9f7d643c25: https://dbpedia.org/page/Mass_in_special_relativity
EMMO 8de5d5bf db1c 40ac b698 095ba3b18578: 10-2
EMMO 967080e5 2f42 4eb2 a3a9 c58143e835f9: For particle X, mass of that particle at rest in an inertial frame.
EMMO c84c6752 6d64 48cc 9500 e54a3c34898d: https://en.wikipedia.org/wiki/Invariant_mass

Atto
type: Class
subclass of: Restriction
  has value: a
subclass of: Restriction
  has value: 1e-18
comment: SI prefix who's value is 1e-18.
EMMO 967080e5 2f42 4eb2 a3a9 c58143e835f9: SI prefix who's value is 1e-18.

MaximumEfficiency
type: Class
comment: Efficiency of an ideal heat engine operating according to the Carnot process.
alternative label: CarnotEfficiency
EMMO 26bf1bef d192 4da6 b0eb d2209698fb54: https://www.wikidata.org/wiki/Q93949862
EMMO 8de5d5bf db1c 40ac b698 095ba3b18578: 5-25.2
EMMO 967080e5 2f42 4eb2 a3a9 c58143e835f9: Efficiency of an ideal heat engine operating according to the Carnot process.

SquareMassPerSquareTimeUnit
type: Class
subclass of: Restriction
  has value: T-2 L0 M+2 I0 Θ0 N0 J0
comment: The class of units with dimensionality 'SquareMassPerSquareTime'.
EMMO 967080e5 2f42 4eb2 a3a9 c58143e835f9: The class of units with dimensionality 'SquareMassPerSquareTime'.

ElectronAffinity
type: Class
comment: energy difference between an electron at rest at infinity and an electron at the lowest level of the conduction band in an insulator or semiconductor
EMMO 1f1b164d ec6a 4faa 8d5e 88bda62316cc: https://qudt.org/vocab/quantitykind/ElectronAffinity
EMMO 26bf1bef d192 4da6 b0eb d2209698fb54: https://www.wikidata.org/wiki/Q105846486
EMMO 50c298c2 55a2 4068 b3ac 4e948c33181f: https://www.electropedia.org/iev/iev.nsf/display
EMMO 8de5d5bf db1c 40ac b698 095ba3b18578: 12-25
EMMO 967080e5 2f42 4eb2 a3a9 c58143e835f9: energy difference between an electron at rest at infinity and an electron at the lowest level of the conduction band in an insulator or semiconductor

ShortData
type: Class
comment: A data representing 16-bit integer number.
EMMO 8a137e9f 579c 4e28 baca e8980eb0c3db: EquivalentTo: hasDataValue some xsd:short
EMMO 967080e5 2f42 4eb2 a3a9 c58143e835f9: A data representing 16-bit integer number.

UnsignedShortData
type: Class
comment: A data representing 16-bit non-negative integer number, 0...65535.
EMMO 8a137e9f 579c 4e28 baca e8980eb0c3db: EquivalentTo: hasDataValue some xsd:unsignedShort
EMMO 967080e5 2f42 4eb2 a3a9 c58143e835f9: A data representing 16-bit non-negative integer number, 0...65535.

Tortuosity
type: Class
comment: Parameter for diffusion and fluid flow in porous media.
EMMO 26bf1bef d192 4da6 b0eb d2209698fb54: https://www.wikidata.org/wiki/Q2301683
EMMO 967080e5 2f42 4eb2 a3a9 c58143e835f9: Parameter for diffusion and fluid flow in porous media.

SIDerivedUnit
type: Class
disjoint union of:
  rest:
    rest: nil
comment: A derived unit that belongs to the SI system.
EMMO 967080e5 2f42 4eb2 a3a9 c58143e835f9: A derived unit that belongs to the SI system.

NanoSiemensPerMetre
type: Class
subclass of: Restriction
  some values from: SiemensPerMetre
subclass of: Restriction
  has value: 1e-09
subclass of: Restriction
  has value: 0.0
comment: 0.000000001-fold of the SI derived unit Siemens divided by the SI base unit metre -- QUDT
alternative label: Nanosiemens Per Metre
EMMO 1f1b164d ec6a 4faa 8d5e 88bda62316cc: http://qudt.org/vocab/unit/NanoS-PER-M
EMMO 33ae2d07 5526 4555 a0b4 8f4c031b5652: nS.m-1
EMMO 7f1dec83 d85e 4e1b b7bd c9442d4f5a64: nS/m
EMMO 967080e5 2f42 4eb2 a3a9 c58143e835f9: 0.000000001-fold of the SI derived unit Siemens divided by the SI base unit metre -- QUDT

SodiumAtom
type: Class
subclass of: Restriction
subclass of: Restriction
  has value: 22.98976928
subclass of: Restriction
  has value: 11
comment: Atom subclass for sodium.
EMMO 967080e5 2f42 4eb2 a3a9 c58143e835f9: Atom subclass for sodium.

ExaCoulomb
type: Class
subclass of: Restriction
  some values from: Coulomb
subclass of: Restriction
  has value: 1e+18
subclass of: Restriction
  has value: 0.0
comment: An ExaCoulomb is 10¹⁸ C. -- QUDT
EMMO 1f1b164d ec6a 4faa 8d5e 88bda62316cc: http://qudt.org/vocab/unit/ExaC
EMMO 33ae2d07 5526 4555 a0b4 8f4c031b5652: EC
EMMO 7f1dec83 d85e 4e1b b7bd c9442d4f5a64: EC
EMMO 967080e5 2f42 4eb2 a3a9 c58143e835f9: An ExaCoulomb is 10¹⁸ C. -- QUDT

PhysicalLaw
type: Class
comment: A law that provides a connection between a property of the object and other properties, capturing a fundamental physical phenomena.
EMMO 967080e5 2f42 4eb2 a3a9 c58143e835f9: A law that provides a connection between a property of the object and other properties, capturing a fundamental physical phenomena.

AnalogicalIcon
type: Class
comment: An icon that focus on HOW the object works.
comment: An icon that represents the internal logical structure of the object.
example: A physics equation is replicating the mechanisms internal to the object.
example: Electrical diagram is diagrammatic and resemblance
example: MODA and CHADA are diagrammatic representation of a simulation or a characterisation workflow.
EMMO 967080e5 2f42 4eb2 a3a9 c58143e835f9: An icon that represents the internal logical structure of the object.
EMMO c7b62dd7 063a 4c2a 8504 42f7264ba83f: An icon that focus on HOW the object works.
EMMO c7b62dd7 063a 4c2a 8504 42f7264ba83f: The subclass of icon inspired by Peirceian category (b) the diagram, whose internal relations, mainly dyadic or so taken, represent by analogy (with the same logic) the relations in something (e.g. math formula, geometric flowchart).

DeepFreezing
type: Class
comment: Treatment carried out after hardening or case hardening consisting of cooling to a temperature below room temperature to complete the transformation of austenite to martensite
alternative label: Cryogenic treatment, Deep-freeze
alternative label: Tieftemperaturbehandeln
EMMO c7b62dd7 063a 4c2a 8504 42f7264ba83f: Treatment carried out after hardening or case hardening consisting of cooling to a temperature below room temperature to complete the transformation of austenite to martensite

TeraOhm
type: Class
subclass of: Restriction
  some values from: Ohm
subclass of: Restriction
  has value: 1000000000000.0
subclass of: Restriction
  has value: 0.0
comment: 1,000,000,000,000-fold of the SI derived unit ohm -- QUDT
EMMO 1f1b164d ec6a 4faa 8d5e 88bda62316cc: http://qudt.org/vocab/unit/TeraOHM
EMMO 33ae2d07 5526 4555 a0b4 8f4c031b5652: TOhm
EMMO 7f1dec83 d85e 4e1b b7bd c9442d4f5a64: TΩ
EMMO 967080e5 2f42 4eb2 a3a9 c58143e835f9: 1,000,000,000,000-fold of the SI derived unit ohm -- QUDT

PerMetre
type: Class
subclass of: Restriction
  has value: 1.0
subclass of: Restriction
  has value: 0.0
comment: Per Meter Unit is a denominator unit with dimensions /m. -- QUDT
alternative label: Reciprocal metre
EMMO 1f1b164d ec6a 4faa 8d5e 88bda62316cc: http://qudt.org/vocab/unit/PER-M
EMMO 33ae2d07 5526 4555 a0b4 8f4c031b5652: /m
EMMO 33ae2d07 5526 4555 a0b4 8f4c031b5652: m-1
EMMO 7f1dec83 d85e 4e1b b7bd c9442d4f5a64: /m
EMMO 967080e5 2f42 4eb2 a3a9 c58143e835f9: Per Meter Unit is a denominator unit with dimensions /m. -- QUDT

Reductionistic
type: Class
comment: A class devoted to categorize causal objects by specifying their granularity levels.
comment: A granularity level is specified by a tiling decomposition of the whole y. A tiling is identified as a set of items {x1, x2, ... xn} called tiles that: - are proper parts of y - covers the entire whole (y = x1 +x2 + ... + xn) - do not overlap - are part of one, and one only, whole (inverse functional)
EMMO 967080e5 2f42 4eb2 a3a9 c58143e835f9: A class devoted to categorize causal objects by specifying their granularity levels.
EMMO c7b62dd7 063a 4c2a 8504 42f7264ba83f: A granularity level is specified by a tiling decomposition of the whole y. A tiling is identified as a set of items {x1, x2, ... xn} called tiles that: - are proper parts of y - covers the entire whole (y = x1 +x2 + ... + xn) - do not overlap - are part of one, and one only, whole (inverse functional)
EMMO c7b62dd7 063a 4c2a 8504 42f7264ba83f: Direct parthood is the antitransitive parthood relation used to build the class hierarchy (and the granularity hierarchy) for this perspective.

DegreeOfDissociation
type: Class
comment: Dissociation may occur stepwise.
comment: Ratio of the number of dissociation events to the maximum number of theoretically possible dissociation events.
alternative label: DissociationFraction
EMMO 1f1b164d ec6a 4faa 8d5e 88bda62316cc: https://qudt.org/vocab/quantitykind/DegreeOfDissociation
EMMO 26bf1bef d192 4da6 b0eb d2209698fb54: https://www.wikidata.org/wiki/Q907334
EMMO 50c298c2 55a2 4068 b3ac 4e948c33181f: https://www.electropedia.org/iev/iev.nsf/display
EMMO 8de5d5bf db1c 40ac b698 095ba3b18578: 9-43
EMMO 967080e5 2f42 4eb2 a3a9 c58143e835f9: Ratio of the number of dissociation events to the maximum number of theoretically possible dissociation events.
EMMO fe015383 afb3 44a6 ae86 043628697aa2: https://doi.org/10.1351/goldbook.D01566

Nuclear
type: Class
comment: The superclass for all classes of entities that have a proper parts of the same type of the whole that is part of all the other proper parts of the same type.
EMMO 967080e5 2f42 4eb2 a3a9 c58143e835f9: The superclass for all classes of entities that have a proper parts of the same type of the whole that is part of all the other proper parts of the same type.

HafniumAtom
type: Class
subclass of: Restriction
subclass of: Restriction
  has value: 178.49
subclass of: Restriction
  has value: 72
comment: Atom subclass for hafnium.
EMMO 967080e5 2f42 4eb2 a3a9 c58143e835f9: Atom subclass for hafnium.

NanoWatt
type: Class
subclass of: Restriction
  some values from: Watt
subclass of: Restriction
  has value: 1e-09
subclass of: Restriction
  has value: 0.0
comment: 0.000000001-fold of the SI derived unit watt -- QUDT
EMMO 1f1b164d ec6a 4faa 8d5e 88bda62316cc: http://qudt.org/vocab/unit/NanoW
EMMO 33ae2d07 5526 4555 a0b4 8f4c031b5652: nW
EMMO 7f1dec83 d85e 4e1b b7bd c9442d4f5a64: nW
EMMO 967080e5 2f42 4eb2 a3a9 c58143e835f9: 0.000000001-fold of the SI derived unit watt -- QUDT

WattSecond
type: Class
subclass of: Restriction
  has value: 1.0
subclass of: Restriction
  has value: 0.0
comment: product of the SI derived unit watt and SI base unit second -- QUDT
alternative label: Watt Second
EMMO 1f1b164d ec6a 4faa 8d5e 88bda62316cc: http://qudt.org/vocab/unit/W-SEC
EMMO 33ae2d07 5526 4555 a0b4 8f4c031b5652: W.s
EMMO 7f1dec83 d85e 4e1b b7bd c9442d4f5a64: W⋅s
EMMO 967080e5 2f42 4eb2 a3a9 c58143e835f9: product of the SI derived unit watt and SI base unit second -- QUDT

MolecularPartitionFunction
type: Class
comment: Partition function of a molecule.
EMMO 26bf1bef d192 4da6 b0eb d2209698fb54: https://www.wikidata.org/wiki/Q96192064
EMMO 8de5d5bf db1c 40ac b698 095ba3b18578: 9-35.4
EMMO 967080e5 2f42 4eb2 a3a9 c58143e835f9: Partition function of a molecule.

ThalliumSymbol
type: Class
subclass of: Restriction
  has value: Tl
comment: The symbol that stands for the thallium atom.
EMMO 967080e5 2f42 4eb2 a3a9 c58143e835f9: The symbol that stands for the thallium atom.

ReciprocalMassUnit
type: Class
subclass of: Restriction
  has value: T0 L0 M-1 I0 Θ0 N0 J0
comment: The class of units with dimensionality 'ReciprocalMass'.
EMMO 967080e5 2f42 4eb2 a3a9 c58143e835f9: The class of units with dimensionality 'ReciprocalMass'.

NewtonPerRadian
type: Class
subclass of: Restriction
  has value: 1.0
subclass of: Restriction
  has value: 0.0
comment: A one-newton force applied for one angle/torsional torque -- QUDT
alternative label: Newton per radian
EMMO 1f1b164d ec6a 4faa 8d5e 88bda62316cc: http://qudt.org/vocab/unit/N-PER-RAD
EMMO 7f1dec83 d85e 4e1b b7bd c9442d4f5a64: N/rad
EMMO 967080e5 2f42 4eb2 a3a9 c58143e835f9: A one-newton force applied for one angle/torsional torque -- QUDT

AreicSpeedUnit
type: Class
subclass of: Restriction
  has value: T-1 L+2 M0 I0 Θ0 N0 J0
comment: The class of units with dimensionality 'AreicSpeed'.
EMMO 967080e5 2f42 4eb2 a3a9 c58143e835f9: The class of units with dimensionality 'AreicSpeed'.

TelluriumSymbol
type: Class
subclass of: Restriction
  has value: Te
comment: The symbol that stands for the tellurium atom.
EMMO 967080e5 2f42 4eb2 a3a9 c58143e835f9: The symbol that stands for the tellurium atom.

CubicDeciMetrePerCubicMetre
type: Class
subclass of: Restriction
  has value: 0.001
subclass of: Restriction
  has value: 0.0
comment: volume ratio consisting of the 0.001-fold of the power of the SI base unit metre with the exponent 3 divided by the power of the SI base unit metre with the exponent 3 -- QUDT
alternative label: Cubic Decimetre Per Cubic Metre
EMMO 1f1b164d ec6a 4faa 8d5e 88bda62316cc: http://qudt.org/vocab/unit/DeciM3-PER-M3
EMMO 33ae2d07 5526 4555 a0b4 8f4c031b5652: dm3.m-3
EMMO 33ae2d07 5526 4555 a0b4 8f4c031b5652: dm3/m3
EMMO 7f1dec83 d85e 4e1b b7bd c9442d4f5a64: dm³/m³
EMMO 967080e5 2f42 4eb2 a3a9 c58143e835f9: volume ratio consisting of the 0.001-fold of the power of the SI base unit metre with the exponent 3 divided by the power of the SI base unit metre with the exponent 3 -- QUDT

JoulePerKilogramKelvin
type: Class
subclass of: Restriction
  has value: 1.0
subclass of: Restriction
  has value: 0.0
comment: Specific heat capacity - The heat required to raise unit mass of a substance by unit temperature interval under specified conditions, such as constant pressure: usually measured in joules per kelvin per kilogram. Symbol c_p (for constant pressure) Also called specific heat. -- QUDT
alternative label: Joule per Kilogram Kelvin
EMMO 1f1b164d ec6a 4faa 8d5e 88bda62316cc: http://qudt.org/vocab/unit/J-PER-KiloGM-K
EMMO 33ae2d07 5526 4555 a0b4 8f4c031b5652: J.kg-1.K-1
EMMO 7f1dec83 d85e 4e1b b7bd c9442d4f5a64: J/(kg⋅K)
EMMO 967080e5 2f42 4eb2 a3a9 c58143e835f9: Specific heat capacity - The heat required to raise unit mass of a substance by unit temperature interval under specified conditions, such as constant pressure: usually measured in joules per kelvin per kilogram. Symbol c_p (for constant pressure) Also called specific heat. -- QUDT

KiloMetre
type: Class
subclass of: Restriction
  some values from: Metre
subclass of: Restriction
  has value: 1000.0
subclass of: Restriction
  has value: 0.0
comment: A common metric unit of length or distance. One kilometer equals exactly 1000 meters, about 0.621 371 19 mile, 1093.6133 yards, or 3280.8399 feet. Oddly, higher multiples of the meter are rarely used; even the distances to the farthest galaxies are usually measured in kilometers. -- QUDT
EMMO 1f1b164d ec6a 4faa 8d5e 88bda62316cc: http://qudt.org/vocab/unit/KiloM
EMMO 33ae2d07 5526 4555 a0b4 8f4c031b5652: km
EMMO 7f1dec83 d85e 4e1b b7bd c9442d4f5a64: km
EMMO 967080e5 2f42 4eb2 a3a9 c58143e835f9: A common metric unit of length or distance. One kilometer equals exactly 1000 meters, about 0.621 371 19 mile, 1093.6133 yards, or 3280.8399 feet. Oddly, higher multiples of the meter are rarely used; even the distances to the farthest galaxies are usually measured in kilometers. -- QUDT
EMMO c84c6752 6d64 48cc 9500 e54a3c34898d: http://en.wikipedia.org/wiki/Kilometre

CentreOfMass
type: Class
comment: In non-relativistic physics, the centre of mass doesn’t depend on the chosen reference frame.
comment: The unique point where the weighted relative position of the distributed mass of an Item sums to zero. Equivalently, it is the point where if a force is applied to the Item, causes the Item to move in direction of force without rotation.
EMMO 967080e5 2f42 4eb2 a3a9 c58143e835f9: The unique point where the weighted relative position of the distributed mass of an Item sums to zero. Equivalently, it is the point where if a force is applied to the Item, causes the Item to move in direction of force without rotation.
EMMO c84c6752 6d64 48cc 9500 e54a3c34898d: https://en.wikipedia.org/wiki/Center_of_mass

MilliMole
type: Class
subclass of: Restriction
  some values from: Mole
subclass of: Restriction
  has value: 0.001
subclass of: Restriction
  has value: 0.0
comment: 0.001-fold of the SI base unit mol -- QUDT
EMMO 1f1b164d ec6a 4faa 8d5e 88bda62316cc: http://qudt.org/vocab/unit/MilliMOL
EMMO 33ae2d07 5526 4555 a0b4 8f4c031b5652: mmol
EMMO 7f1dec83 d85e 4e1b b7bd c9442d4f5a64: mmol
EMMO 967080e5 2f42 4eb2 a3a9 c58143e835f9: 0.001-fold of the SI base unit mol -- QUDT

Peening
type: Class
comment: (according to DIN 8200) Shot peening to generate residual compressive stresses in layers of the blasting material close to the surface in order to improve certain component properties, e.g. fatigue strength, corrosion resistance, wear resistance (from: DIN 8200:1982)
alternative label: ShotPeening
alternative label: Verfestigungsstrahlen
EMMO c7b62dd7 063a 4c2a 8504 42f7264ba83f: (according to DIN 8200) Shot peening to generate residual compressive stresses in layers of the blasting material close to the surface in order to improve certain component properties, e.g. fatigue strength, corrosion resistance, wear resistance (from: DIN 8200:1982)

HardeningByForming
type: Class
alternative label: Verfestigen durch Umformen

SolidSolidSuspension
type: Class
comment: A coarse dispersion of solid in a solid continuum phase.
example: Granite, sand, dried concrete.
EMMO 967080e5 2f42 4eb2 a3a9 c58143e835f9: A coarse dispersion of solid in a solid continuum phase.

Electroplating
type: Class

ElementaryCharge
type: Class
comment: The DBpedia definition (http://dbpedia.org/page/Elementary_charge) is outdated as May 20, 2019. It is now an exact quantity.
comment: The magnitude of the electric charge carried by a single electron. It defines the base unit Ampere in the SI system.
EMMO 1f1b164d ec6a 4faa 8d5e 88bda62316cc: http://qudt.org/vocab/quantitykind/ElementaryCharge
EMMO 8de5d5bf db1c 40ac b698 095ba3b18578: 10-5.1
EMMO 967080e5 2f42 4eb2 a3a9 c58143e835f9: The magnitude of the electric charge carried by a single electron. It defines the base unit Ampere in the SI system.
EMMO fe015383 afb3 44a6 ae86 043628697aa2: https://doi.org/10.1351/goldbook.E02032

ElectricCharge
type: Class
subclass of: Restriction
comment: The physical property of matter that causes it to experience a force when placed in an electromagnetic field.
alternative label: Charge
EMMO 1f1b164d ec6a 4faa 8d5e 88bda62316cc: http://qudt.org/vocab/quantitykind/ElectricCharge
EMMO 26bf1bef d192 4da6 b0eb d2209698fb54: https://www.wikidata.org/wiki/Q1111
EMMO 8de5d5bf db1c 40ac b698 095ba3b18578: 6-2
EMMO 967080e5 2f42 4eb2 a3a9 c58143e835f9: The physical property of matter that causes it to experience a force when placed in an electromagnetic field.
EMMO fe015383 afb3 44a6 ae86 043628697aa2: https://doi.org/10.1351/goldbook.E01923

AmountPerAreaUnit
type: Class
subclass of: Restriction
  has value: T0 L-2 M0 I0 Θ0 N+1 J0
comment: The class of units with dimensionality 'AmountPerArea'.
EMMO 967080e5 2f42 4eb2 a3a9 c58143e835f9: The class of units with dimensionality 'AmountPerArea'.

CarbonSymbol
type: Class
subclass of: Restriction
  has value: C
comment: The symbol that stands for the carbon atom.
EMMO 967080e5 2f42 4eb2 a3a9 c58143e835f9: The symbol that stands for the carbon atom.

GramPerSquareMetre
type: Class
subclass of: Restriction
  has value: 0.001
subclass of: Restriction
  has value: 0.0
comment: 0,001-fold of the SI base unit kilogram divided by the power of the SI base unit metre with the exponent 2 -- QUDT
alternative label: Gram Per Square Metre
EMMO 1f1b164d ec6a 4faa 8d5e 88bda62316cc: http://qudt.org/vocab/unit/GM-PER-M2
EMMO 33ae2d07 5526 4555 a0b4 8f4c031b5652: g.m-2
EMMO 33ae2d07 5526 4555 a0b4 8f4c031b5652: g/m2
EMMO 7f1dec83 d85e 4e1b b7bd c9442d4f5a64: g/m²
EMMO 967080e5 2f42 4eb2 a3a9 c58143e835f9: 0,001-fold of the SI base unit kilogram divided by the power of the SI base unit metre with the exponent 2 -- QUDT

VonKlitzingConstant
type: Class
comment: Resistance quantum.
comment: The von Klitzing constant is defined as Planck constant divided by the square of the elementary charge.
EMMO 1f1b164d ec6a 4faa 8d5e 88bda62316cc: http://qudt.org/vocab/constant/VonKlitzingConstant
EMMO 70fe84ff 99b6 4206 a9fc 9a8931836d84: The von Klitzing constant is defined as Planck constant divided by the square of the elementary charge.
EMMO 967080e5 2f42 4eb2 a3a9 c58143e835f9: Resistance quantum.

MegaJoulePerSquareMetre
type: Class
subclass of: Restriction
  some values from: JoulePerSquareMetre
subclass of: Restriction
  has value: 1000000.0
subclass of: Restriction
  has value: 0.0
comment: 1,000,000-fold of the SI derived unit joule divided by the power of the SI base unit metre with the exponent 2 -- QUDT
alternative label: Megajoule Per Square Metre
EMMO 1f1b164d ec6a 4faa 8d5e 88bda62316cc: http://qudt.org/vocab/unit/MegaJ-PER-M2
EMMO 33ae2d07 5526 4555 a0b4 8f4c031b5652: MJ.m-2
EMMO 7f1dec83 d85e 4e1b b7bd c9442d4f5a64: MJ/m²
EMMO 967080e5 2f42 4eb2 a3a9 c58143e835f9: 1,000,000-fold of the SI derived unit joule divided by the power of the SI base unit metre with the exponent 2 -- QUDT

Deduction
type: Class
subclass of: Restriction
comment: A semiotic process that assigns a sign by deduction from causal continguity.
alternative label: IndexSemiosis
example: The interpreter feels that the plate is hot and assigns the status of the kitchen stove to be on.
EMMO 967080e5 2f42 4eb2 a3a9 c58143e835f9: A semiotic process that assigns a sign by deduction from causal continguity.

VoltPerSquareMetre
type: Class
subclass of: Restriction
  has value: 1.0
subclass of: Restriction
  has value: 0.0
comment: The divergence at a particular point in a vector field is (roughly) how much the vector field 'spreads out' from that point. Operationally, we take the partial derivative of each of the field with respect to each of its space variables and add all the derivatives together to get the divergence. Electric field (V/m) differentiated with respect to distance (m) yields V/(m²). -- QUDT
alternative label: Volt per Square Metre
EMMO 1f1b164d ec6a 4faa 8d5e 88bda62316cc: http://qudt.org/vocab/unit/V-PER-M2
EMMO 33ae2d07 5526 4555 a0b4 8f4c031b5652: V.m-2
EMMO 7f1dec83 d85e 4e1b b7bd c9442d4f5a64: V/m²
EMMO 967080e5 2f42 4eb2 a3a9 c58143e835f9: The divergence at a particular point in a vector field is (roughly) how much the vector field 'spreads out' from that point. Operationally, we take the partial derivative of each of the field with respect to each of its space variables and add all the derivatives together to get the divergence. Electric field (V/m) differentiated with respect to distance (m) yields V/(m²). -- QUDT

ElectricPotentialPerAreaUnit
type: Class
subclass of: Restriction
  has value: T-3 L0 M+1 I-1 Θ0 N0 J0
comment: The class of units with dimensionality 'ElectricPotentialPerArea'.
EMMO 967080e5 2f42 4eb2 a3a9 c58143e835f9: The class of units with dimensionality 'ElectricPotentialPerArea'.

RelativePermittivity
type: Class
comment: Permittivity divided by electric constant.
EMMO 1f1b164d ec6a 4faa 8d5e 88bda62316cc: https://qudt.org/vocab/unit/PERMITTIVITY_REL
EMMO 26bf1bef d192 4da6 b0eb d2209698fb54: https://www.wikidata.org/wiki/Q4027242
EMMO 50c298c2 55a2 4068 b3ac 4e948c33181f: https://www.electropedia.org/iev/iev.nsf/display
EMMO 8de5d5bf db1c 40ac b698 095ba3b18578: 6-15
EMMO 967080e5 2f42 4eb2 a3a9 c58143e835f9: Permittivity divided by electric constant.

DecaMetre
type: Class
subclass of: Restriction
  some values from: Metre
subclass of: Restriction
  has value: 10.0
subclass of: Restriction
  has value: 0.0
comment: 10-fold of the SI base unit metre -- QUDT
EMMO 1f1b164d ec6a 4faa 8d5e 88bda62316cc: http://qudt.org/vocab/unit/DecaM
EMMO 33ae2d07 5526 4555 a0b4 8f4c031b5652: dam
EMMO 7f1dec83 d85e 4e1b b7bd c9442d4f5a64: dam
EMMO 967080e5 2f42 4eb2 a3a9 c58143e835f9: 10-fold of the SI base unit metre -- QUDT

EffectiveDiffusionCoefficient
type: Class
comment: Diffusion coefficient through the pore space of a porous media.
EMMO 26bf1bef d192 4da6 b0eb d2209698fb54: https://www.wikidata.org/wiki/Q258852
EMMO 967080e5 2f42 4eb2 a3a9 c58143e835f9: Diffusion coefficient through the pore space of a porous media.

DiffusionCoefficient
type: Class
subclass of: Restriction
comment: Proportionality constant in some physical laws.
EMMO 967080e5 2f42 4eb2 a3a9 c58143e835f9: Proportionality constant in some physical laws.

CentiNewtonMetre
type: Class
subclass of: Restriction
  some values from: NewtonMetre
subclass of: Restriction
  has value: 0.01
subclass of: Restriction
  has value: 0.0
comment: 0,01-fold of the product of the SI derived unit newton and SI base unit metre -- QUDT
alternative label: Centinewton Metre
EMMO 1f1b164d ec6a 4faa 8d5e 88bda62316cc: http://qudt.org/vocab/unit/CentiN-M
EMMO 33ae2d07 5526 4555 a0b4 8f4c031b5652: cN.m
EMMO 7f1dec83 d85e 4e1b b7bd c9442d4f5a64: cN⋅m
EMMO 967080e5 2f42 4eb2 a3a9 c58143e835f9: 0,01-fold of the product of the SI derived unit newton and SI base unit metre -- QUDT

CompositeMaterial
type: Class
subclass of: Restriction
  min qualified cardinality: 2
comment: A material that contains two or more constituent materials.
alternative label: Composite
EMMO 967080e5 2f42 4eb2 a3a9 c58143e835f9: A material that contains two or more constituent materials.

MolePerSquareMetrePerSecond
type: Class
subclass of: Restriction
  has value: 1.0
subclass of: Restriction
  has value: 0.0
comment: SI unit of quantity of matter per SI unit area per SI unit of time. -- QUDT
alternative label: Moles per square metre per second
EMMO 1f1b164d ec6a 4faa 8d5e 88bda62316cc: http://qudt.org/vocab/unit/MOL-PER-M2-SEC
EMMO 33ae2d07 5526 4555 a0b4 8f4c031b5652: mol.m-2.s-1
EMMO 7f1dec83 d85e 4e1b b7bd c9442d4f5a64: mol/(m²⋅s)
EMMO 967080e5 2f42 4eb2 a3a9 c58143e835f9: SI unit of quantity of matter per SI unit area per SI unit of time. -- QUDT

PerPascal
type: Class
subclass of: Restriction
  has value: 1.0
subclass of: Restriction
  has value: 0.0
comment: Per Pascal.
alternative label: ReciprocalPascal
EMMO 1f1b164d ec6a 4faa 8d5e 88bda62316cc: http://qudt.org/vocab/unit/PER-PA
EMMO 33ae2d07 5526 4555 a0b4 8f4c031b5652: Pa-1
EMMO 7f1dec83 d85e 4e1b b7bd c9442d4f5a64: /Pa
EMMO 967080e5 2f42 4eb2 a3a9 c58143e835f9: Per Pascal.
EMMO c84c6752 6d64 48cc 9500 e54a3c34898d: http://en.wikipedia.org/wiki/Pascal

MatrixData
type: Class
comment: The datatype for bidimensional arrays.
EMMO 8a137e9f 579c 4e28 baca e8980eb0c3db: SubClassOf: hasSpatialTile some VectorData
EMMO 967080e5 2f42 4eb2 a3a9 c58143e835f9: The datatype for bidimensional arrays.

RadianSquareMetrePerMole
type: Class
subclass of: Restriction
  has value: 1.0
subclass of: Restriction
  has value: 0.0
comment: Radian square metre per mole.
EMMO 1f1b164d ec6a 4faa 8d5e 88bda62316cc: http://qudt.org/vocab/unit/RAD-M2-PER-MOL
EMMO 33ae2d07 5526 4555 a0b4 8f4c031b5652: rad.m2.mol-1
EMMO 7f1dec83 d85e 4e1b b7bd c9442d4f5a64: rad⋅m²/mol
EMMO 967080e5 2f42 4eb2 a3a9 c58143e835f9: Radian square metre per mole.

FleroviumAtom
type: Class
subclass of: Restriction
subclass of: Restriction
  has value: 289.19
subclass of: Restriction
  has value: 114
comment: Atom subclass for flerovium.
EMMO 967080e5 2f42 4eb2 a3a9 c58143e835f9: Atom subclass for flerovium.

AngularAcceleration
type: Class
subclass of: Restriction
comment: Vector quantity giving the rate of change of angular velocity.
EMMO 1f1b164d ec6a 4faa 8d5e 88bda62316cc: https://qudt.org/vocab/quantitykind/AngularAcceleration
EMMO 50c298c2 55a2 4068 b3ac 4e948c33181f: https://www.electropedia.org/iev/iev.nsf/display
EMMO 6dd685dd 1895 46e4 b227 be9f7d643c25: https://dbpedia.org/page/Angular_acceleration
EMMO 8de5d5bf db1c 40ac b698 095ba3b18578: 3-13
EMMO 967080e5 2f42 4eb2 a3a9 c58143e835f9: Vector quantity giving the rate of change of angular velocity.
EMMO c84c6752 6d64 48cc 9500 e54a3c34898d: https://en.wikipedia.org/wiki/Angular_acceleration

AmperePerMetre
type: Class
subclass of: Restriction
  has value: 1.0
subclass of: Restriction
  has value: 0.0
comment: is the SI unit of magnetic field strength. One ampere per meter is equal to π/250 oersteds (12.566 371 millioersteds) in CGS units. The ampere per meter is also the SI unit of "magnetization" in the sense of magnetic dipole moment per unit volume; in this context 1 A/m = 0.001 emu per cubic centimeter. -- QUDT
alternative label: Ampere per Metre
EMMO 1f1b164d ec6a 4faa 8d5e 88bda62316cc: http://qudt.org/vocab/unit/A-PER-M
EMMO 33ae2d07 5526 4555 a0b4 8f4c031b5652: A.m-1
EMMO 33ae2d07 5526 4555 a0b4 8f4c031b5652: A/m
EMMO 7f1dec83 d85e 4e1b b7bd c9442d4f5a64: A/m
EMMO 967080e5 2f42 4eb2 a3a9 c58143e835f9: is the SI unit of magnetic field strength. One ampere per meter is equal to π/250 oersteds (12.566 371 millioersteds) in CGS units. The ampere per meter is also the SI unit of "magnetization" in the sense of magnetic dipole moment per unit volume; in this context 1 A/m = 0.001 emu per cubic centimeter. -- QUDT

MilliMolePerKilogram
type: Class
subclass of: Restriction
  has value: 0.001
subclass of: Restriction
  has value: 0.0
comment: 0.001-fold of the SI base unit mol divided by the SI base unit kilogram -- QUDT
alternative label: Millimole Per Kilogram
EMMO 1f1b164d ec6a 4faa 8d5e 88bda62316cc: http://qudt.org/vocab/unit/MilliMOL-PER-KiloGM
EMMO 33ae2d07 5526 4555 a0b4 8f4c031b5652: mmol.kg-1
EMMO 33ae2d07 5526 4555 a0b4 8f4c031b5652: mmol/kg
EMMO 7f1dec83 d85e 4e1b b7bd c9442d4f5a64: mmol/kg
EMMO 967080e5 2f42 4eb2 a3a9 c58143e835f9: 0.001-fold of the SI base unit mol divided by the SI base unit kilogram -- QUDT

ElementaryParticle
type: Class
comment: A chausal chain whose quantum parts are of the same standard model fundamental type.
comment: An elementary particle is a causal chain of quantum entities of the same type. For example, an elementary electron is a sequence of fundamental electrons only.
alternative label: SingleParticleChain
EMMO 31252f35 c767 4b97 a877 1235076c3e13: An elementary particle is a causal chain of quantum entities of the same type. For example, an elementary electron is a sequence of fundamental electrons only.
EMMO 8a137e9f 579c 4e28 baca e8980eb0c3db: DisjointUnionOf: ElementaryFermion, ElementaryBoson
EMMO 967080e5 2f42 4eb2 a3a9 c58143e835f9: A chausal chain whose quantum parts are of the same standard model fundamental type.

MicroMolePerSquareMetre
type: Class
subclass of: Restriction
  some values from: MolePerSquareMetre
subclass of: Restriction
  has value: 1e-06
subclass of: Restriction
  has value: 0.0
comment: One part per 10**6 (million) of the SI unit of quantity of matter (the mole) per SI unit area. -- QUDT
alternative label: Micromoles per square metre
EMMO 1f1b164d ec6a 4faa 8d5e 88bda62316cc: http://qudt.org/vocab/unit/MicroMOL-PER-M2
EMMO 33ae2d07 5526 4555 a0b4 8f4c031b5652: umol.m-2
EMMO 33ae2d07 5526 4555 a0b4 8f4c031b5652: umol/m2
EMMO 7f1dec83 d85e 4e1b b7bd c9442d4f5a64: µmol/m²
EMMO 967080e5 2f42 4eb2 a3a9 c58143e835f9: One part per 10**6 (million) of the SI unit of quantity of matter (the mole) per SI unit area. -- QUDT

MagneticFieldStrength
type: Class
subclass of: Restriction
comment: Strength of a magnetic field. Commonly denoted H.
alternative label: MagnetizingFieldStrength
EMMO 1f1b164d ec6a 4faa 8d5e 88bda62316cc: http://qudt.org/vocab/quantitykind/MagneticFieldStrength
EMMO 26bf1bef d192 4da6 b0eb d2209698fb54: https://www.wikidata.org/wiki/Q28123
EMMO 50c298c2 55a2 4068 b3ac 4e948c33181f: https://www.electropedia.org/iev/iev.nsf/display
EMMO 8de5d5bf db1c 40ac b698 095ba3b18578: 6-25
EMMO 967080e5 2f42 4eb2 a3a9 c58143e835f9: Strength of a magnetic field. Commonly denoted H.
EMMO fe015383 afb3 44a6 ae86 043628697aa2: https://doi.org/10.1351/goldbook.M03683

Diameter
type: Class
comment: maximal distance of two points of an object, in a given direction or along a straight line passing through the centre.
comment: The diameter of a circle or a sphere is twice its radius.
EMMO 1f1b164d ec6a 4faa 8d5e 88bda62316cc: https://qudt.org/vocab/quantitykind/Diameter
EMMO 50c298c2 55a2 4068 b3ac 4e948c33181f: https://www.electropedia.org/iev/iev.nsf/display
EMMO 6dd685dd 1895 46e4 b227 be9f7d643c25: https://dbpedia.org/page/Diameter
EMMO 8de5d5bf db1c 40ac b698 095ba3b18578: 3-1.5
EMMO 967080e5 2f42 4eb2 a3a9 c58143e835f9: maximal distance of two points of an object, in a given direction or along a straight line passing through the centre.
EMMO c84c6752 6d64 48cc 9500 e54a3c34898d: https://en.wikipedia.org/wiki/Diameter

KiloWatt
type: Class
subclass of: Restriction
  some values from: Watt
subclass of: Restriction
  has value: 1000.0
subclass of: Restriction
  has value: 0.0
comment: The kilowatt is a derived unit of power in the International System of Units (SI), The unit, defined as 1,000 joule per second, measures the rate of energy conversion or transfer. -- QUDT
EMMO 1f1b164d ec6a 4faa 8d5e 88bda62316cc: http://qudt.org/vocab/unit/KiloW
EMMO 33ae2d07 5526 4555 a0b4 8f4c031b5652: kW
EMMO 7f1dec83 d85e 4e1b b7bd c9442d4f5a64: kW
EMMO 967080e5 2f42 4eb2 a3a9 c58143e835f9: The kilowatt is a derived unit of power in the International System of Units (SI), The unit, defined as 1,000 joule per second, measures the rate of energy conversion or transfer. -- QUDT
EMMO c84c6752 6d64 48cc 9500 e54a3c34898d: http://en.wikipedia.org/wiki/Watt

Irradiate
type: Class

PoloniumAtom
type: Class
subclass of: Restriction
subclass of: Restriction
  has value: 208.98243
subclass of: Restriction
  has value: 84
comment: Atom subclass for polonium.
EMMO 967080e5 2f42 4eb2 a3a9 c58143e835f9: Atom subclass for polonium.

Action
type: Class
subclass of: Restriction
comment: Physical quantity of dimension energy × time.
EMMO 1f1b164d ec6a 4faa 8d5e 88bda62316cc: https://qudt.org/vocab/quantitykind/Action
EMMO 26bf1bef d192 4da6 b0eb d2209698fb54: https://www.wikidata.org/wiki/Q846785
EMMO 50c298c2 55a2 4068 b3ac 4e948c33181f: https://www.electropedia.org/iev/iev.nsf/display
EMMO 8de5d5bf db1c 40ac b698 095ba3b18578: 4-32
EMMO 967080e5 2f42 4eb2 a3a9 c58143e835f9: Physical quantity of dimension energy × time.

KiloSiemensPerMetre
type: Class
subclass of: Restriction
  some values from: SiemensPerMetre
subclass of: Restriction
  has value: 1000.0
subclass of: Restriction
  has value: 0.0
comment: 1 000-fold of the SI derived unit siemens divided by the SI base unit metre -- QUDT
alternative label: Kilosiemens Per Metre
EMMO 1f1b164d ec6a 4faa 8d5e 88bda62316cc: http://qudt.org/vocab/unit/KiloS-PER-M
EMMO 33ae2d07 5526 4555 a0b4 8f4c031b5652: kS.m-1
EMMO 7f1dec83 d85e 4e1b b7bd c9442d4f5a64: kS/m
EMMO 967080e5 2f42 4eb2 a3a9 c58143e835f9: 1 000-fold of the SI derived unit siemens divided by the SI base unit metre -- QUDT

DeciCoulomb
type: Class
subclass of: Restriction
  some values from: Coulomb
subclass of: Restriction
  has value: 0.1
subclass of: Restriction
  has value: 0.0
comment: A DeciCoulomb is 10⁻¹ C. -- QUDT
EMMO 1f1b164d ec6a 4faa 8d5e 88bda62316cc: http://qudt.org/vocab/unit/DeciC
EMMO 33ae2d07 5526 4555 a0b4 8f4c031b5652: dC
EMMO 7f1dec83 d85e 4e1b b7bd c9442d4f5a64: dC
EMMO 967080e5 2f42 4eb2 a3a9 c58143e835f9: A DeciCoulomb is 10⁻¹ C. -- QUDT

BromineAtom
type: Class
subclass of: Restriction
subclass of: Restriction
  has value: 79.904
subclass of: Restriction
  has value: 35
comment: Atom subclass for bromine.
EMMO 967080e5 2f42 4eb2 a3a9 c58143e835f9: Atom subclass for bromine.

Katal
type: Class
subclass of: Restriction
  has value: kat
comment: A unit of catalytic activity used especially in the chemistry of enzymes. A catalyst is a substance that starts or speeds a chemical reaction. Enzymes are proteins that act as catalysts within the bodies of living plants and animals. A catalyst has an activity of one katal if it enables a reaction to proceed at the rate of one mole per second. -- QUDT
comment: SI unit for catalytic activity.
EMMO 0b1cbe60 d380 4787 b92e be26bdacf2c2: KAT
EMMO 1f1b164d ec6a 4faa 8d5e 88bda62316cc: http://qudt.org/vocab/unit/KAT
EMMO 33ae2d07 5526 4555 a0b4 8f4c031b5652: kat
EMMO 6dd685dd 1895 46e4 b227 be9f7d643c25: http://dbpedia.org/resource/Katal
EMMO 967080e5 2f42 4eb2 a3a9 c58143e835f9: SI unit for catalytic activity.
EMMO c7b62dd7 063a 4c2a 8504 42f7264ba83f: A unit of catalytic activity used especially in the chemistry of enzymes. A catalyst is a substance that starts or speeds a chemical reaction. Enzymes are proteins that act as catalysts within the bodies of living plants and animals. A catalyst has an activity of one katal if it enables a reaction to proceed at the rate of one mole per second. -- QUDT
EMMO c84c6752 6d64 48cc 9500 e54a3c34898d: http://en.wikipedia.org/wiki/Katal
EMMO fe015383 afb3 44a6 ae86 043628697aa2: https://doi.org/10.1351/goldbook.K03372

Height
type: Class
comment: Minimum length of a straight line segment between a point and a reference line or reference surface.
EMMO 1f1b164d ec6a 4faa 8d5e 88bda62316cc: https://qudt.org/vocab/quantitykind/Height
EMMO 26bf1bef d192 4da6 b0eb d2209698fb54: https://www.wikidata.org/wiki/Q208826
EMMO 50c298c2 55a2 4068 b3ac 4e948c33181f: https://www.electropedia.org/iev/iev.nsf/display
EMMO 6dd685dd 1895 46e4 b227 be9f7d643c25: https://dbpedia.org/page/Height
EMMO 8de5d5bf db1c 40ac b698 095ba3b18578: 3-1.3
EMMO 967080e5 2f42 4eb2 a3a9 c58143e835f9: Minimum length of a straight line segment between a point and a reference line or reference surface.
EMMO c84c6752 6d64 48cc 9500 e54a3c34898d: https://en.wikipedia.org/wiki/Height

NaturalProcess
type: Class
comment: A process occurring by natural (non-intentional) laws.
alternative label: NonIntentionalProcess
EMMO 967080e5 2f42 4eb2 a3a9 c58143e835f9: A process occurring by natural (non-intentional) laws.

CubicCentiMetrePerSecond
type: Class
subclass of: Restriction
  has value: 1e-06
subclass of: Restriction
  has value: 0.0
comment: 0,000 001-fold of the power of the SI base unit metre with the exponent 3 divided by the SI base unit second -- QUDT
alternative label: Cubic Centimetre Per Second
EMMO 1f1b164d ec6a 4faa 8d5e 88bda62316cc: http://qudt.org/vocab/unit/CentiM3-PER-SEC
EMMO 33ae2d07 5526 4555 a0b4 8f4c031b5652: cm3.s-1
EMMO 33ae2d07 5526 4555 a0b4 8f4c031b5652: cm3/s
EMMO 7f1dec83 d85e 4e1b b7bd c9442d4f5a64: cm³/s
EMMO 967080e5 2f42 4eb2 a3a9 c58143e835f9: 0,000 001-fold of the power of the SI base unit metre with the exponent 3 divided by the SI base unit second -- QUDT

SemiosisByStructure
type: Class
comment: Semiosis classified as complete or partial representation of the semiotic triangle (interpretant, sign, referent).
EMMO 967080e5 2f42 4eb2 a3a9 c58143e835f9: Semiosis classified as complete or partial representation of the semiotic triangle (interpretant, sign, referent).

SquareCentiMetrePerCubicCentiMetre
type: Class
subclass of: Restriction
  has value: 100.0
subclass of: Restriction
  has value: 0.0
comment: Square centimetre per cubic centimetre.
EMMO 1f1b164d ec6a 4faa 8d5e 88bda62316cc: http://qudt.org/vocab/unit/CentiM2-PER-CentiM3
EMMO 33ae2d07 5526 4555 a0b4 8f4c031b5652: cm2.cm-3
EMMO 7f1dec83 d85e 4e1b b7bd c9442d4f5a64: cm²/cm³
EMMO 967080e5 2f42 4eb2 a3a9 c58143e835f9: Square centimetre per cubic centimetre.

MassConcentrationOfWater
type: Class
comment: Quotient of the mass of water in a three-dimensional domain, irrespective of the form of aggregation, by the volume of the domain.
comment: The mass concentration of water at saturation is denoted wsat.
EMMO 1f1b164d ec6a 4faa 8d5e 88bda62316cc: https://qudt.org/vocab/quantitykind/MassConcentrationOfWater
EMMO 26bf1bef d192 4da6 b0eb d2209698fb54: https://www.wikidata.org/wiki/Q76378758
EMMO 50c298c2 55a2 4068 b3ac 4e948c33181f: https://www.electropedia.org/iev/iev.nsf/display
EMMO 8de5d5bf db1c 40ac b698 095ba3b18578: 5-27
EMMO 967080e5 2f42 4eb2 a3a9 c58143e835f9: Quotient of the mass of water in a three-dimensional domain, irrespective of the form of aggregation, by the volume of the domain.

KilogramPerSquareMetrePerSecond
type: Class
subclass of: Restriction
  has value: 1.0
subclass of: Restriction
  has value: 0.0
alternative label: Kilograms per square metre per second
EMMO 1f1b164d ec6a 4faa 8d5e 88bda62316cc: http://qudt.org/vocab/unit/KiloGM-PER-M2-SEC
EMMO 33ae2d07 5526 4555 a0b4 8f4c031b5652: kg.m-2.s-1
EMMO 7f1dec83 d85e 4e1b b7bd c9442d4f5a64: kg/(m²⋅s)

IronAtom
type: Class
subclass of: Restriction
subclass of: Restriction
  has value: 55.845
subclass of: Restriction
  has value: 26
comment: Atom subclass for iron.
EMMO 967080e5 2f42 4eb2 a3a9 c58143e835f9: Atom subclass for iron.

Communicating
type: Class
comment: A semiosis where the interpreter perceives a referent, that generates the interpretant as interpreter's internal representation. Than the interpretant is communicated by the interpreter by the production of a sign, i.e. the entity that stands for the referent according to the interpreter.
example: I (interpreter) see an entity (referent) whose perception stimulates in me an internal representation (interpretant). Then I say: "Ketchup." (sign) with the intention of communicate externally something about that entity.
EMMO 967080e5 2f42 4eb2 a3a9 c58143e835f9: A semiosis where the interpreter perceives a referent, that generates the interpretant as interpreter's internal representation. Than the interpretant is communicated by the interpreter by the production of a sign, i.e. the entity that stands for the referent according to the interpreter.

SquareMetrePerMole
type: Class
subclass of: Restriction
  has value: 1.0
subclass of: Restriction
  has value: 0.0
comment: Square Meter Per Mole (m2/mol) is a unit in the category of Specific Area. It is also known as square meters per mole, square metre per per, square metres per per, square meter/per, square metre/per. This unit is commonly used in the SI unit system. Square Meter Per Mole (m2/mol) has a dimension of M-1L2 where M is mass, and L is length. This unit is the standard SI unit in this category. -- QUDT
alternative label: Square Metre per Mole
EMMO 1f1b164d ec6a 4faa 8d5e 88bda62316cc: http://qudt.org/vocab/unit/M2-PER-MOL
EMMO 33ae2d07 5526 4555 a0b4 8f4c031b5652: m2.mol-1
EMMO 7f1dec83 d85e 4e1b b7bd c9442d4f5a64: m²/mol
EMMO 967080e5 2f42 4eb2 a3a9 c58143e835f9: Square Meter Per Mole (m2/mol) is a unit in the category of Specific Area. It is also known as square meters per mole, square metre per per, square metres per per, square meter/per, square metre/per. This unit is commonly used in the SI unit system. Square Meter Per Mole (m2/mol) has a dimension of M-1L2 where M is mass, and L is length. This unit is the standard SI unit in this category. -- QUDT

DampingCoefficient
type: Class
comment: Inverse of the time constant of an exponentially varying quantity.
EMMO 50c298c2 55a2 4068 b3ac 4e948c33181f: https://www.electropedia.org/iev/iev.nsf/display
EMMO 8de5d5bf db1c 40ac b698 095ba3b18578: 3-24
EMMO 967080e5 2f42 4eb2 a3a9 c58143e835f9: Inverse of the time constant of an exponentially varying quantity.

MolarConductivity
type: Class
subclass of: Restriction
comment: Conductivity per molar concentration of electrolyte.
EMMO 1f1b164d ec6a 4faa 8d5e 88bda62316cc: https://qudt.org/vocab/quantitykind/MolarConductivity
EMMO 26bf1bef d192 4da6 b0eb d2209698fb54: https://www.wikidata.org/wiki/Q1943278
EMMO 8de5d5bf db1c 40ac b698 095ba3b18578: 9-45
EMMO 967080e5 2f42 4eb2 a3a9 c58143e835f9: Conductivity per molar concentration of electrolyte.
EMMO fe015383 afb3 44a6 ae86 043628697aa2: https://doi.org/10.1351/goldbook.M03976

PerHenry
type: Class
subclass of: Restriction
  has value: 1.0
subclass of: Restriction
  has value: 0.0
comment: Reciprocal Henry.
alternative label: ReciprocalHenry
EMMO 1f1b164d ec6a 4faa 8d5e 88bda62316cc: http://qudt.org/vocab/unit/PER-H
EMMO 33ae2d07 5526 4555 a0b4 8f4c031b5652: H-1
EMMO 7f1dec83 d85e 4e1b b7bd c9442d4f5a64: /H
EMMO 967080e5 2f42 4eb2 a3a9 c58143e835f9: Reciprocal Henry.

Lux
type: Class
subclass of: Restriction
  has value: lx
comment: SI unit for illuminance.
comment: The SI unit for measuring the illumination (illuminance) of a surface. One lux is defined as an illumination of one lumen per square meter or 0.0001 phot. In considering the various light units, it's useful to think about light originating at a point and shining upon a surface. The intensity of the light source is measured in candelas; the total light flux in transit is measured in lumens (1 lumen = 1 candelau·steradian); and the amount of light received per unit of surface area is measured in lux (1 lux = 1 lumen/square meter). One lux is equal to approximately 0.09290 foot candle. -- QUDT
EMMO 0b1cbe60 d380 4787 b92e be26bdacf2c2: LUX
EMMO 1f1b164d ec6a 4faa 8d5e 88bda62316cc: http://qudt.org/vocab/unit/LUX
EMMO 33ae2d07 5526 4555 a0b4 8f4c031b5652: lx
EMMO 6dd685dd 1895 46e4 b227 be9f7d643c25: http://dbpedia.org/resource/Lux
EMMO 967080e5 2f42 4eb2 a3a9 c58143e835f9: SI unit for illuminance.
EMMO c7b62dd7 063a 4c2a 8504 42f7264ba83f: The SI unit for measuring the illumination (illuminance) of a surface. One lux is defined as an illumination of one lumen per square meter or 0.0001 phot. In considering the various light units, it's useful to think about light originating at a point and shining upon a surface. The intensity of the light source is measured in candelas; the total light flux in transit is measured in lumens (1 lumen = 1 candelau·steradian); and the amount of light received per unit of surface area is measured in lux (1 lux = 1 lumen/square meter). One lux is equal to approximately 0.09290 foot candle. -- QUDT
EMMO c84c6752 6d64 48cc 9500 e54a3c34898d: http://en.wikipedia.org/wiki/Lux
EMMO fe015383 afb3 44a6 ae86 043628697aa2: https://doi.org/10.1351/goldbook.L03651

DiffusionLength
type: Class
comment: In condensed matter physics, the square root of the product of diffusion coefficient and lifetime.
EMMO 1f1b164d ec6a 4faa 8d5e 88bda62316cc: https://qudt.org/vocab/quantitykind/SolidStateDiffusionLength
EMMO 26bf1bef d192 4da6 b0eb d2209698fb54: https://www.wikidata.org/wiki/Q106097176
EMMO 50c298c2 55a2 4068 b3ac 4e948c33181f: https://www.electropedia.org/iev/iev.nsf/display
EMMO 8de5d5bf db1c 40ac b698 095ba3b18578: 12-33
EMMO 967080e5 2f42 4eb2 a3a9 c58143e835f9: In condensed matter physics, the square root of the product of diffusion coefficient and lifetime.

CopperAtom
type: Class
subclass of: Restriction
subclass of: Restriction
  has value: 63.546
subclass of: Restriction
  has value: 29
comment: Atom subclass for copper.
EMMO 967080e5 2f42 4eb2 a3a9 c58143e835f9: Atom subclass for copper.

Exposure
type: Class
subclass of: Restriction
comment: Absolute value of the electric charge of ions produced in dry air by X- or gamma radiation per mass of air.
EMMO 1f1b164d ec6a 4faa 8d5e 88bda62316cc: https://qudt.org/vocab/quantitykind/Exposure
EMMO 26bf1bef d192 4da6 b0eb d2209698fb54: https://www.wikidata.org/wiki/Q336938
EMMO 50c298c2 55a2 4068 b3ac 4e948c33181f: https://www.electropedia.org/iev/iev.nsf/display
EMMO 8de5d5bf db1c 40ac b698 095ba3b18578: 10-88
EMMO 967080e5 2f42 4eb2 a3a9 c58143e835f9: Absolute value of the electric charge of ions produced in dry air by X- or gamma radiation per mass of air.

NewtonMetreSecondPerMetre
type: Class
subclass of: Restriction
  has value: 1.0
subclass of: Restriction
  has value: 0.0
comment: Newton metre seconds measured per metre -- QUDT
alternative label: Newton metre seconds per metre
EMMO 1f1b164d ec6a 4faa 8d5e 88bda62316cc: http://qudt.org/vocab/unit/N-M-SEC-PER-M
EMMO 7f1dec83 d85e 4e1b b7bd c9442d4f5a64: N⋅m⋅s/m
EMMO 967080e5 2f42 4eb2 a3a9 c58143e835f9: Newton metre seconds measured per metre -- QUDT

RelaxationTime
type: Class
comment: time constant for scattering, trapping or annihilation of charge carriers, phonons or other quasiparticles
EMMO 26bf1bef d192 4da6 b0eb d2209698fb54: https://www.wikidata.org/wiki/Q106041085
EMMO 8de5d5bf db1c 40ac b698 095ba3b18578: 12-32.1
EMMO 967080e5 2f42 4eb2 a3a9 c58143e835f9: time constant for scattering, trapping or annihilation of charge carriers, phonons or other quasiparticles

TimeConstant
type: Class
comment: parameter characterizing the response to a step input of a first‑order, linear time‑invariant system
EMMO 26bf1bef d192 4da6 b0eb d2209698fb54: https://www.wikidata.org/wiki/Q1335249
EMMO 50c298c2 55a2 4068 b3ac 4e948c33181f: https://www.electropedia.org/iev/iev.nsf/display
EMMO 8de5d5bf db1c 40ac b698 095ba3b18578: 3-15
EMMO 967080e5 2f42 4eb2 a3a9 c58143e835f9: parameter characterizing the response to a step input of a first‑order, linear time‑invariant system

MicroRadian
type: Class
subclass of: Restriction
  some values from: Radian
subclass of: Restriction
  has value: 1e-06
subclass of: Restriction
  has value: 0.0
alternative label: microradian
EMMO 1f1b164d ec6a 4faa 8d5e 88bda62316cc: http://qudt.org/vocab/unit/MicroRAD
EMMO 33ae2d07 5526 4555 a0b4 8f4c031b5652: urad
EMMO 7f1dec83 d85e 4e1b b7bd c9442d4f5a64: µrad

MathematicalModel
type: Class
equivalent class: Class
comment: A mathematical model can be defined as a description of a system using mathematical concepts and language to facilitate proper explanation of a system or to study the effects of different components and to make predictions on patterns of behaviour. Abramowitz and Stegun, 1968
comment: An analogical icon expressed in mathematical language.
EMMO 967080e5 2f42 4eb2 a3a9 c58143e835f9: An analogical icon expressed in mathematical language.

PlasmaCutting
type: Class

URN
type: Class
comment: The term "Uniform Resource Name" (URN) has been used historically to refer to both URIs under the "urn" scheme [RFC2141], which are required to remain globally unique and persistent even when the resource ceases to exist or becomes unavailable, and to any other URI with the properties of a name.
EMMO 967080e5 2f42 4eb2 a3a9 c58143e835f9: The term "Uniform Resource Name" (URN) has been used historically to refer to both URIs under the "urn" scheme [RFC2141], which are required to remain globally unique and persistent even when the resource ceases to exist or becomes unavailable, and to any other URI with the properties of a name.

ConductanceForAlternatingCurrent
type: Class
comment: Real part of the admittance.
EMMO 26bf1bef d192 4da6 b0eb d2209698fb54: https://www.wikidata.org/wiki/Q79464628
EMMO 50c298c2 55a2 4068 b3ac 4e948c33181f: https://www.electropedia.org/iev/iev.nsf/display
EMMO 8de5d5bf db1c 40ac b698 095ba3b18578: 6-52.2
EMMO 967080e5 2f42 4eb2 a3a9 c58143e835f9: Real part of the admittance.

PascalPerKelvin
type: Class
subclass of: Restriction
  has value: 1.0
subclass of: Restriction
  has value: 0.0
comment: Pascal per Kelvin.
EMMO 1f1b164d ec6a 4faa 8d5e 88bda62316cc: http://qudt.org/vocab/unit/PA-PER-K
EMMO 33ae2d07 5526 4555 a0b4 8f4c031b5652: Pa.K-1
EMMO 7f1dec83 d85e 4e1b b7bd c9442d4f5a64: P/K
EMMO 967080e5 2f42 4eb2 a3a9 c58143e835f9: Pascal per Kelvin.

MesoscopicModel
type: Class
comment: A physics-based model based on a physics equation describing the behaviour of mesoscopic entities, i.e. a set of bounded atoms like a molecule, bead or nanoparticle.
EMMO 967080e5 2f42 4eb2 a3a9 c58143e835f9: A physics-based model based on a physics equation describing the behaviour of mesoscopic entities, i.e. a set of bounded atoms like a molecule, bead or nanoparticle.

MolybdenumSymbol
type: Class
subclass of: Restriction
  has value: Mo
comment: The symbol that stands for the molybdenum atom.
EMMO 967080e5 2f42 4eb2 a3a9 c58143e835f9: The symbol that stands for the molybdenum atom.

NewtonPerCoulomb
type: Class
subclass of: Restriction
  has value: 1.0
subclass of: Restriction
  has value: 0.0
comment: Newton Per Coulomb ( N/C) is a unit in the category of Electric field strength. It is also known as newtons/coulomb. Newton Per Coulomb ( N/C) has a dimension of MLT-3I-1 where M is mass, L is length, T is time, and I is electric current. It essentially the same as the corresponding standard SI unit V/m. -- QUDT
alternative label: Newton per Coulomb
EMMO 1f1b164d ec6a 4faa 8d5e 88bda62316cc: http://qudt.org/vocab/unit/N-PER-C
EMMO 33ae2d07 5526 4555 a0b4 8f4c031b5652: N.C-1
EMMO 7f1dec83 d85e 4e1b b7bd c9442d4f5a64: N/C
EMMO 967080e5 2f42 4eb2 a3a9 c58143e835f9: Newton Per Coulomb ( N/C) is a unit in the category of Electric field strength. It is also known as newtons/coulomb. Newton Per Coulomb ( N/C) has a dimension of MLT-3I-1 where M is mass, L is length, T is time, and I is electric current. It essentially the same as the corresponding standard SI unit V/m. -- QUDT

FermiumAtom
type: Class
subclass of: Restriction
subclass of: Restriction
  has value: 257.09511
subclass of: Restriction
  has value: 100
comment: Atom subclass for fermium.
EMMO 967080e5 2f42 4eb2 a3a9 c58143e835f9: Atom subclass for fermium.

PerJouleCubicMetre
type: Class
subclass of: Restriction
  has value: 1.0
subclass of: Restriction
  has value: 0.0
comment: Per Joule cubic metre.
EMMO 1f1b164d ec6a 4faa 8d5e 88bda62316cc: http://qudt.org/vocab/unit/PER-J-M3
EMMO 33ae2d07 5526 4555 a0b4 8f4c031b5652: J-1.m-3
EMMO 7f1dec83 d85e 4e1b b7bd c9442d4f5a64: /(J⋅m³)
EMMO 967080e5 2f42 4eb2 a3a9 c58143e835f9: Per Joule cubic metre.

RecombinationCoefficient
type: Class
subclass of: Restriction
comment: Coefficient in the law of recombination,
EMMO 1f1b164d ec6a 4faa 8d5e 88bda62316cc: https://qudt.org/vocab/quantitykind/RecombinationCoefficient
EMMO 26bf1bef d192 4da6 b0eb d2209698fb54: https://www.wikidata.org/wiki/Q98842099
EMMO 50c298c2 55a2 4068 b3ac 4e948c33181f: https://www.electropedia.org/iev/iev.nsf/display
EMMO 8de5d5bf db1c 40ac b698 095ba3b18578: 10-63
EMMO 967080e5 2f42 4eb2 a3a9 c58143e835f9: Coefficient in the law of recombination,

PascalSecond
type: Class
subclass of: Restriction
  has value: 1.0
subclass of: Restriction
  has value: 0.0
comment: The SI unit of dynamic viscosity, equal to 10 poises or 1000 centipoises. -- QUDT
alternative label: Pascal Second
EMMO 1f1b164d ec6a 4faa 8d5e 88bda62316cc: http://qudt.org/vocab/unit/PA-SEC
EMMO 33ae2d07 5526 4555 a0b4 8f4c031b5652: Pa.s
EMMO 7f1dec83 d85e 4e1b b7bd c9442d4f5a64: Pa⋅s
EMMO 967080e5 2f42 4eb2 a3a9 c58143e835f9: The SI unit of dynamic viscosity, equal to 10 poises or 1000 centipoises. -- QUDT

KilogramPerCubicMetrePerSecond
type: Class
subclass of: Restriction
  has value: 1.0
subclass of: Restriction
  has value: 0.0
alternative label: Kilograms per cubic metre per second
EMMO 1f1b164d ec6a 4faa 8d5e 88bda62316cc: http://qudt.org/vocab/unit/KiloGM-PER-M3-SEC
EMMO 33ae2d07 5526 4555 a0b4 8f4c031b5652: kg.m-3.s-1
EMMO 7f1dec83 d85e 4e1b b7bd c9442d4f5a64: kg/(m³⋅s)

PerCubicMilliMetre
type: Class
subclass of: Restriction
  has value: 1000000000.0
subclass of: Restriction
  has value: 0.0
comment: reciprocal value of the 0.000000001-fold of the power of the SI base unit metre with the exponent 3 -- QUDT
alternative label: ReciprocalCubicMilliMetre
EMMO 1f1b164d ec6a 4faa 8d5e 88bda62316cc: http://qudt.org/vocab/unit/PER-MilliM3
EMMO 33ae2d07 5526 4555 a0b4 8f4c031b5652: mm-3
EMMO 7f1dec83 d85e 4e1b b7bd c9442d4f5a64: /mm³
EMMO 967080e5 2f42 4eb2 a3a9 c58143e835f9: reciprocal value of the 0.000000001-fold of the power of the SI base unit metre with the exponent 3 -- QUDT

Permeability
type: Class
subclass of: Restriction
comment: Measure for how the magnetization of material is affected by the application of an external magnetic field .
alternative label: ElectromagneticPermeability
EMMO 1f1b164d ec6a 4faa 8d5e 88bda62316cc: http://qudt.org/vocab/quantitykind/ElectromagneticPermeability
EMMO 8de5d5bf db1c 40ac b698 095ba3b18578: 6-26.2
EMMO 967080e5 2f42 4eb2 a3a9 c58143e835f9: Measure for how the magnetization of material is affected by the application of an external magnetic field .
EMMO fe015383 afb3 44a6 ae86 043628697aa2: https://doi.org/10.1351/goldbook.P04503

MagneticDipoleMoment
type: Class
subclass of: Restriction
comment: For an atom or nucleus, this energy is quantized and can be written as: W = g μ M B where g is the appropriate g factor, μ is mostly the Bohr magneton or nuclear magneton, M is magnetic quantum number, and B is magnitude of the magnetic flux density. -- ISO 80000
comment: Vector quantity μ causing a change to its energy ΔW in an external magnetic field of field flux density B: ΔW = −μ · B
EMMO 1f1b164d ec6a 4faa 8d5e 88bda62316cc: http://qudt.org/vocab/quantitykind/MagneticDipoleMoment
EMMO 50c298c2 55a2 4068 b3ac 4e948c33181f: https://www.electropedia.org/iev/iev.nsf/display
EMMO 8de5d5bf db1c 40ac b698 095ba3b18578: 10-9.1
EMMO 8de5d5bf db1c 40ac b698 095ba3b18578: 6-30
EMMO 967080e5 2f42 4eb2 a3a9 c58143e835f9: Vector quantity μ causing a change to its energy ΔW in an external magnetic field of field flux density B: ΔW = −μ · B
EMMO fe015383 afb3 44a6 ae86 043628697aa2: http://goldbook.iupac.org/terms/view/M03688

Kerma
type: Class
comment: Kinetic energy released per mass.
EMMO 1f1b164d ec6a 4faa 8d5e 88bda62316cc: https://qudt.org/vocab/quantitykind/Kerma
EMMO 26bf1bef d192 4da6 b0eb d2209698fb54: https://www.wikidata.org/wiki/Q1739288
EMMO 50c298c2 55a2 4068 b3ac 4e948c33181f: https://www.electropedia.org/iev/iev.nsf/display
EMMO 8de5d5bf db1c 40ac b698 095ba3b18578: 10-86.1
EMMO 967080e5 2f42 4eb2 a3a9 c58143e835f9: Kinetic energy released per mass.

VoltPerMetre
type: Class
subclass of: Restriction
  has value: 1.0
subclass of: Restriction
  has value: 0.0
comment: Volt Per Meter (V/m) is a unit in the category of Electric field strength. It is also known as volts per meter, volt/meter, volt/metre, volt per metre, volts per metre. This unit is commonly used in the SI unit system. Volt Per Meter (V/m) has a dimension of MLT⁻³I⁻¹ where M is mass, L is length, T is time, and I is electric current. This unit is the standard SI unit in this category. -- QUDT
alternative label: Volt per Metre
EMMO 1f1b164d ec6a 4faa 8d5e 88bda62316cc: http://qudt.org/vocab/unit/V-PER-M
EMMO 33ae2d07 5526 4555 a0b4 8f4c031b5652: V.m-1
EMMO 7f1dec83 d85e 4e1b b7bd c9442d4f5a64: V/m
EMMO 967080e5 2f42 4eb2 a3a9 c58143e835f9: Volt Per Meter (V/m) is a unit in the category of Electric field strength. It is also known as volts per meter, volt/meter, volt/metre, volt per metre, volts per metre. This unit is commonly used in the SI unit system. Volt Per Meter (V/m) has a dimension of MLT⁻³I⁻¹ where M is mass, L is length, T is time, and I is electric current. This unit is the standard SI unit in this category. -- QUDT

Assigned
type: Class

MobilityRatio
type: Class
comment: Quotient of electron and hole mobility.
EMMO 1f1b164d ec6a 4faa 8d5e 88bda62316cc: https://qudt.org/vocab/quantitykind/MobilityRatio
EMMO 26bf1bef d192 4da6 b0eb d2209698fb54: https://www.wikidata.org/wiki/Q106010255
EMMO 8de5d5bf db1c 40ac b698 095ba3b18578: 12-31
EMMO 967080e5 2f42 4eb2 a3a9 c58143e835f9: Quotient of electron and hole mobility.

PicoMolePerCubicMetrePerSecond
type: Class
subclass of: Restriction
  some values from: MolePerCubicMetrePerSecond
subclass of: Restriction
  has value: 1e-12
subclass of: Restriction
  has value: 0.0
alternative label: Picomoles per cubic metre per second
EMMO 1f1b164d ec6a 4faa 8d5e 88bda62316cc: http://qudt.org/vocab/unit/PicoMOL-PER-M3-SEC
EMMO 33ae2d07 5526 4555 a0b4 8f4c031b5652: pmol.m-3.s-1
EMMO 7f1dec83 d85e 4e1b b7bd c9442d4f5a64: pmol/(m³⋅s)

TightlyCoupledModelsSimulation
type: Class
comment: A simulation in which more than one model are solved together with a coupled method.
example: Solving within the same linear system the discretised form of the pressure and momentum equation for a fluid, using the ideal gas law as material relation for connecting pressure to density.
EMMO 967080e5 2f42 4eb2 a3a9 c58143e835f9: A simulation in which more than one model are solved together with a coupled method.

MilliWeber
type: Class
subclass of: Restriction
  some values from: Weber
subclass of: Restriction
  has value: 0.001
subclass of: Restriction
  has value: 0.0
comment: 0.001-fold of the SI derived unit weber -- QUDT
EMMO 1f1b164d ec6a 4faa 8d5e 88bda62316cc: http://qudt.org/vocab/unit/MilliWB
EMMO 33ae2d07 5526 4555 a0b4 8f4c031b5652: mWb
EMMO 7f1dec83 d85e 4e1b b7bd c9442d4f5a64: mWb
EMMO 967080e5 2f42 4eb2 a3a9 c58143e835f9: 0.001-fold of the SI derived unit weber -- QUDT

Nucleus
type: Class
subclass of: Restriction
comment: The small, dense region at the centre of an atom consisting of protons and neutrons.
EMMO 967080e5 2f42 4eb2 a3a9 c58143e835f9: The small, dense region at the centre of an atom consisting of protons and neutrons.

HectoPascalPerKelvin
type: Class
subclass of: Restriction
  some values from: PascalPerKelvin
subclass of: Restriction
  has value: 100.0
subclass of: Restriction
  has value: 0.0
comment: 100-fold of the SI derived unit pascal divided by the SI base unit kelvin -- QUDT
alternative label: Hectopascal Per Kelvin
EMMO 1f1b164d ec6a 4faa 8d5e 88bda62316cc: http://qudt.org/vocab/unit/HectoPA-PER-K
EMMO 33ae2d07 5526 4555 a0b4 8f4c031b5652: hPa.K-1
EMMO 7f1dec83 d85e 4e1b b7bd c9442d4f5a64: hPa/K
EMMO 967080e5 2f42 4eb2 a3a9 c58143e835f9: 100-fold of the SI derived unit pascal divided by the SI base unit kelvin -- QUDT

Convergent
type: Class
comment: The superclass for all classes of entities that have a proper parts of the same type φ of the whole, and so that for every two distinct φ proper parts one is part of the other.
EMMO 967080e5 2f42 4eb2 a3a9 c58143e835f9: The superclass for all classes of entities that have a proper parts of the same type φ of the whole, and so that for every two distinct φ proper parts one is part of the other.

ProductionSystem
type: Class
comment: A network of objects that implements a production process through a series of interconnected elements.
EMMO 967080e5 2f42 4eb2 a3a9 c58143e835f9: A network of objects that implements a production process through a series of interconnected elements.

BromineSymbol
type: Class
subclass of: Restriction
  has value: Br
comment: The symbol that stands for the bromine atom.
EMMO 967080e5 2f42 4eb2 a3a9 c58143e835f9: The symbol that stands for the bromine atom.

Homonuclear
type: Class
comment: A molecule composed of only one element type.
alternative label: ElementalMolecule
example: Hydrogen molecule (H₂).
EMMO 967080e5 2f42 4eb2 a3a9 c58143e835f9: A molecule composed of only one element type.

TimePerLengthUnit
type: Class
subclass of: Restriction
  has value: T+1 L-1 M0 I0 Θ0 N0 J0
comment: The class of units with dimensionality 'TimePerLength'.
EMMO 967080e5 2f42 4eb2 a3a9 c58143e835f9: The class of units with dimensionality 'TimePerLength'.

Stress
type: Class
subclass of: Restriction
comment: Force per unit oriented surface area .
comment: Measure of the internal forces that neighboring particles of a continuous material exert on each other.
EMMO 1f1b164d ec6a 4faa 8d5e 88bda62316cc: http://qudt.org/vocab/quantitykind/Stress
EMMO 8de5d5bf db1c 40ac b698 095ba3b18578: 4-15
EMMO 967080e5 2f42 4eb2 a3a9 c58143e835f9: Measure of the internal forces that neighboring particles of a continuous material exert on each other.

MolarMass
type: Class
subclass of: Restriction
comment: Mass per amount of substance.
EMMO 1f1b164d ec6a 4faa 8d5e 88bda62316cc: https://qudt.org/vocab/quantitykind/MolarMass
EMMO 26bf1bef d192 4da6 b0eb d2209698fb54: https://www.wikidata.org/wiki/Q145623
EMMO 8de5d5bf db1c 40ac b698 095ba3b18578: 9-4
EMMO 967080e5 2f42 4eb2 a3a9 c58143e835f9: Mass per amount of substance.

GramPerCubicCentiMetre
type: Class
subclass of: Restriction
  has value: 1000.0
subclass of: Restriction
  has value: 0.0
comment: 0,001-fold of the SI base unit kilogram divided by the 0.000 001-fold of the power of the SI base unit metre with the exponent 3 -- QUDT
alternative label: Gram Per Cubic Centimetre
EMMO 1f1b164d ec6a 4faa 8d5e 88bda62316cc: http://qudt.org/vocab/unit/GM-PER-CentiM3
EMMO 33ae2d07 5526 4555 a0b4 8f4c031b5652: g.cm-3
EMMO 33ae2d07 5526 4555 a0b4 8f4c031b5652: g/cm3
EMMO 7f1dec83 d85e 4e1b b7bd c9442d4f5a64: g/cm³
EMMO 967080e5 2f42 4eb2 a3a9 c58143e835f9: 0,001-fold of the SI base unit kilogram divided by the 0.000 001-fold of the power of the SI base unit metre with the exponent 3 -- QUDT

DrawForms
type: Class

KiloMetrePerSecond
type: Class
subclass of: Restriction
  some values from: MetrePerSecond
subclass of: Restriction
  has value: 1000.0
subclass of: Restriction
  has value: 0.0
comment: "Kilometer per Second" is a C.G.S System unit for 'Linear Velocity' expressed as km/s. -- QUDT
alternative label: Kilometre per Second
EMMO 1f1b164d ec6a 4faa 8d5e 88bda62316cc: http://qudt.org/vocab/unit/KiloM-PER-SEC
EMMO 33ae2d07 5526 4555 a0b4 8f4c031b5652: km.s-1
EMMO 33ae2d07 5526 4555 a0b4 8f4c031b5652: km/s
EMMO 7f1dec83 d85e 4e1b b7bd c9442d4f5a64: km/s
EMMO 967080e5 2f42 4eb2 a3a9 c58143e835f9: "Kilometer per Second" is a C.G.S System unit for 'Linear Velocity' expressed as km/s. -- QUDT

DiffusivityUnit
type: Class
subclass of: Restriction
  has value: T-1 L+2 M0 I0 Θ0 N-1 J0
comment: The class of units with dimensionality 'Diffusivity'.
EMMO 967080e5 2f42 4eb2 a3a9 c58143e835f9: The class of units with dimensionality 'Diffusivity'.

RationalData
type: Class
comment: A symbolic data representing a rational number, that is a number that can be expressed exact by `p/q` where `p` and `q` are integer numbers.
EMMO 8a137e9f 579c 4e28 baca e8980eb0c3db: EquivalentTo: hasDataValue some owl:rational
EMMO 967080e5 2f42 4eb2 a3a9 c58143e835f9: A symbolic data representing a rational number, that is a number that can be expressed exact by `p/q` where `p` and `q` are integer numbers.

GapEnergy
type: Class
comment: Smallest energy difference between the lowest level of conduction band and the highest level of valence band at zero thermodynamic temperature.
alternative label: BandgapEnergy
EMMO 26bf1bef d192 4da6 b0eb d2209698fb54: https://www.wikidata.org/wiki/Q103982939
EMMO 50c298c2 55a2 4068 b3ac 4e948c33181f: https://www.electropedia.org/iev/iev.nsf/display
EMMO 8de5d5bf db1c 40ac b698 095ba3b18578: 12-27.2
EMMO 967080e5 2f42 4eb2 a3a9 c58143e835f9: Smallest energy difference between the lowest level of conduction band and the highest level of valence band at zero thermodynamic temperature.
EMMO fe015383 afb3 44a6 ae86 043628697aa2: https://doi.org/10.1351/goldbook.B00593

JavaScript
type: Class

Planing
type: Class
comment: Type of scratching behaviour where the scratching force and the (displacement) deflection of the scratching tip are constant over the scratching distance during the test.
alternative label: Hobeln

Sievert
type: Class
subclass of: Restriction
  has value: Sv
comment: Although the sievert has the same dimensions as the gray (i.e. joules per kilogram), it measures a different quantity. To avoid any risk of confusion between the absorbed dose and the equivalent dose, the corresponding special units, namely the gray instead of the joule per kilogram for absorbed dose and the sievert instead of the joule per kilogram for the dose equivalent, should be used. -- QUDT
comment: SI unit for equivalent doseof ionizing radiation. Sievert is derived from absorbed dose, but takes into account the biological effectiveness of the radiation, which is dependent on the radiation type and energy.
EMMO 0b1cbe60 d380 4787 b92e be26bdacf2c2: D13
EMMO 1f1b164d ec6a 4faa 8d5e 88bda62316cc: http://qudt.org/vocab/unit/SV
EMMO 33ae2d07 5526 4555 a0b4 8f4c031b5652: Sv
EMMO 6dd685dd 1895 46e4 b227 be9f7d643c25: http://dbpedia.org/resource/Sievert
EMMO 967080e5 2f42 4eb2 a3a9 c58143e835f9: SI unit for equivalent doseof ionizing radiation. Sievert is derived from absorbed dose, but takes into account the biological effectiveness of the radiation, which is dependent on the radiation type and energy.
EMMO c7b62dd7 063a 4c2a 8504 42f7264ba83f: Although the sievert has the same dimensions as the gray (i.e. joules per kilogram), it measures a different quantity. To avoid any risk of confusion between the absorbed dose and the equivalent dose, the corresponding special units, namely the gray instead of the joule per kilogram for absorbed dose and the sievert instead of the joule per kilogram for the dose equivalent, should be used. -- QUDT
EMMO c84c6752 6d64 48cc 9500 e54a3c34898d: http://en.wikipedia.org/wiki/Sievert
EMMO c84c6752 6d64 48cc 9500 e54a3c34898d: https://en.wikipedia.org/wiki/Equivalent_dose
EMMO fe015383 afb3 44a6 ae86 043628697aa2: https://doi.org/10.1351/goldbook.S05658

CentiMetrePerKelvin
type: Class
subclass of: Restriction
  some values from: MetrePerKelvin
subclass of: Restriction
  has value: 0.01
subclass of: Restriction
  has value: 0.0
comment: 0,01-fold of the SI base unit metre divided by the SI base unit kelvin -- QUDT
alternative label: Centimetre Per Kelvin
EMMO 1f1b164d ec6a 4faa 8d5e 88bda62316cc: http://qudt.org/vocab/unit/CentiM-PER-K
EMMO 33ae2d07 5526 4555 a0b4 8f4c031b5652: cm.K-1
EMMO 33ae2d07 5526 4555 a0b4 8f4c031b5652: cm/K
EMMO 7f1dec83 d85e 4e1b b7bd c9442d4f5a64: cm/K
EMMO 967080e5 2f42 4eb2 a3a9 c58143e835f9: 0,01-fold of the SI base unit metre divided by the SI base unit kelvin -- QUDT

KineticEnergy
type: Class
comment: The energy of an object due to its motion.
EMMO 1f1b164d ec6a 4faa 8d5e 88bda62316cc: http://qudt.org/vocab/quantitykind/KineticEnergy
EMMO 8de5d5bf db1c 40ac b698 095ba3b18578: 4-28.2
EMMO 967080e5 2f42 4eb2 a3a9 c58143e835f9: The energy of an object due to its motion.
EMMO fe015383 afb3 44a6 ae86 043628697aa2: https://doi.org/10.1351/goldbook.K03402

Cementing
type: Class

LinkedFlux
type: Class
comment: Magnetic flux the integration area of which is such that magnetic field lines cross it in the same orientation more than once.
EMMO 1f1b164d ec6a 4faa 8d5e 88bda62316cc: https://qudt.org/vocab/quantitykind/MagneticFlux
EMMO 26bf1bef d192 4da6 b0eb d2209698fb54: https://www.wikidata.org/wiki/Q4374882
EMMO 50c298c2 55a2 4068 b3ac 4e948c33181f: https://www.electropedia.org/iev/iev.nsf/display
EMMO 8de5d5bf db1c 40ac b698 095ba3b18578: 6-22.2
EMMO 967080e5 2f42 4eb2 a3a9 c58143e835f9: Magnetic flux the integration area of which is such that magnetic field lines cross it in the same orientation more than once.

PotassiumSymbol
type: Class
subclass of: Restriction
  has value: K
comment: The symbol that stands for the potassium atom.
EMMO 967080e5 2f42 4eb2 a3a9 c58143e835f9: The symbol that stands for the potassium atom.

URL
type: Class
comment: The term "Uniform Resource Locator" (URL) refers to the subset of URIs that, in addition to identifying a resource, provide a means of locating the resource by describing its primary access mechanism (e.g., its network "location").
EMMO 967080e5 2f42 4eb2 a3a9 c58143e835f9: The term "Uniform Resource Locator" (URL) refers to the subset of URIs that, in addition to identifying a resource, provide a means of locating the resource by describing its primary access mechanism (e.g., its network "location").

PerQuarticLengthUnit
type: Class
subclass of: Restriction
  has value: T0 L-4 M0 I0 Θ0 N0 J0
comment: The class of units with physical dimensionality per length to the power of four.
EMMO 967080e5 2f42 4eb2 a3a9 c58143e835f9: The class of units with physical dimensionality per length to the power of four.

NeptuniumAtom
type: Class
subclass of: Restriction
subclass of: Restriction
  has value: 237.04817
subclass of: Restriction
  has value: 93
comment: Atom subclass for neptunium.
EMMO 967080e5 2f42 4eb2 a3a9 c58143e835f9: Atom subclass for neptunium.

NewtonianConstantOfGravity
type: Class
subclass of: Restriction
comment: Physical constant in Newton's law of gravitation and in Einstein's general theory of relativity.
EMMO 1f1b164d ec6a 4faa 8d5e 88bda62316cc: http://qudt.org/vocab/constant/NewtonianConstantOfGravitation
EMMO 967080e5 2f42 4eb2 a3a9 c58143e835f9: Physical constant in Newton's law of gravitation and in Einstein's general theory of relativity.
EMMO fe015383 afb3 44a6 ae86 043628697aa2: https://doi.org/10.1351/goldbook.G02695

MarkupLanguage
type: Class
comment: A grammar for annotating a document in a way that is syntactically distinguishable from the text.
example: HTML
EMMO 967080e5 2f42 4eb2 a3a9 c58143e835f9: A grammar for annotating a document in a way that is syntactically distinguishable from the text.
EMMO c84c6752 6d64 48cc 9500 e54a3c34898d: https://en.wikipedia.org/wiki/Markup_language

MegaVoltAmpere
type: Class
subclass of: Restriction
  some values from: VoltAmpere
subclass of: Restriction
  has value: 1000000.0
subclass of: Restriction
  has value: 0.0
comment: 1,000,000-fold of the product of the SI derived unit volt and the SI base unit ampere -- QUDT
alternative label: Megavolt Ampere
EMMO 1f1b164d ec6a 4faa 8d5e 88bda62316cc: http://qudt.org/vocab/unit/MegaV-A
EMMO 33ae2d07 5526 4555 a0b4 8f4c031b5652: MV.A
EMMO 7f1dec83 d85e 4e1b b7bd c9442d4f5a64: MV⋅A
EMMO 967080e5 2f42 4eb2 a3a9 c58143e835f9: 1,000,000-fold of the product of the SI derived unit volt and the SI base unit ampere -- QUDT

Gel
type: Class
comment: A soft, solid or solid-like colloid consisting of two or more components, one of which is a liquid, present in substantial quantity.
EMMO 967080e5 2f42 4eb2 a3a9 c58143e835f9: A soft, solid or solid-like colloid consisting of two or more components, one of which is a liquid, present in substantial quantity.

EntropyPerAmountUnit
type: Class
subclass of: Restriction
  has value: T-2 L+2 M+1 I0 Θ-1 N-1 J0
comment: The class of units with dimensionality 'EntropyPerAmount'.
EMMO 967080e5 2f42 4eb2 a3a9 c58143e835f9: The class of units with dimensionality 'EntropyPerAmount'.

PascalMetre
type: Class
subclass of: Restriction
  has value: 1.0
subclass of: Restriction
  has value: 0.0
comment: Pascal metre.
EMMO 1f1b164d ec6a 4faa 8d5e 88bda62316cc: http://qudt.org/vocab/unit/PA-M
EMMO 33ae2d07 5526 4555 a0b4 8f4c031b5652: Pa.m
EMMO 7f1dec83 d85e 4e1b b7bd c9442d4f5a64: Pa⋅m
EMMO 967080e5 2f42 4eb2 a3a9 c58143e835f9: Pascal metre.

MoleDegreeCelsius
type: Class
comment: `Mole Degree Celsius` is a C.G.S System unit for 'Temperature Amount Of Substance' expressed as mol-degC. -- QUDT
alternative label: Mole Degree Celsius
EMMO 1f1b164d ec6a 4faa 8d5e 88bda62316cc: http://qudt.org/vocab/unit/MOL-DEG_C
EMMO 33ae2d07 5526 4555 a0b4 8f4c031b5652: mol.Cel
EMMO 7f1dec83 d85e 4e1b b7bd c9442d4f5a64: mol⋅°C
EMMO 967080e5 2f42 4eb2 a3a9 c58143e835f9: `Mole Degree Celsius` is a C.G.S System unit for 'Temperature Amount Of Substance' expressed as mol-degC. -- QUDT

JoulePerGram
type: Class
subclass of: Restriction
  has value: 1000.0
subclass of: Restriction
  has value: 0.0
comment: SI derived unit joule divided by the 0.001-fold of the SI base unit kilogram -- QUDT
alternative label: Joule Per Gram
EMMO 1f1b164d ec6a 4faa 8d5e 88bda62316cc: http://qudt.org/vocab/unit/J-PER-GM
EMMO 33ae2d07 5526 4555 a0b4 8f4c031b5652: J.g-1
EMMO 7f1dec83 d85e 4e1b b7bd c9442d4f5a64: J/g
EMMO 967080e5 2f42 4eb2 a3a9 c58143e835f9: SI derived unit joule divided by the 0.001-fold of the SI base unit kilogram -- QUDT

Radioactivity
type: Class
subclass of: Restriction
comment: Decays per unit time.
alternative label: RadioactiveActivity
EMMO 1f1b164d ec6a 4faa 8d5e 88bda62316cc: http://qudt.org/vocab/quantitykind/SpecificActivity
EMMO 967080e5 2f42 4eb2 a3a9 c58143e835f9: Decays per unit time.
EMMO fe015383 afb3 44a6 ae86 043628697aa2: https://doi.org/10.1351/goldbook.A00114

AtomicScatteringFactor
type: Class
comment: Quotient of radiation amplitude scattered by the atom and radiation amplitude scattered by a single electron.
EMMO 1f1b164d ec6a 4faa 8d5e 88bda62316cc: https://qudt.org/vocab/quantitykind/AtomScatteringFactor
EMMO 26bf1bef d192 4da6 b0eb d2209698fb54: https://www.wikidata.org/wiki/Q837866
EMMO 8de5d5bf db1c 40ac b698 095ba3b18578: 12-5.3
EMMO 967080e5 2f42 4eb2 a3a9 c58143e835f9: Quotient of radiation amplitude scattered by the atom and radiation amplitude scattered by a single electron.
EMMO c84c6752 6d64 48cc 9500 e54a3c34898d: https://en.wikipedia.org/wiki/Atomic_form_factor

NonTemporalRole
type: Class
comment: An holistic spatial part of a whole.
alternative label: HolisticSpatialPart
EMMO 967080e5 2f42 4eb2 a3a9 c58143e835f9: An holistic spatial part of a whole.

OhmSquareMetrePerMetre
type: Class
subclass of: Restriction
  has value: 1.0
subclass of: Restriction
  has value: 0.0
comment: Ohm square metre per metre.
EMMO 1f1b164d ec6a 4faa 8d5e 88bda62316cc: http://qudt.org/vocab/unit/OHM-M2-PER-M
EMMO 33ae2d07 5526 4555 a0b4 8f4c031b5652: Ohm2.m.m-1
EMMO 7f1dec83 d85e 4e1b b7bd c9442d4f5a64: Ω⋅m²/m
EMMO 967080e5 2f42 4eb2 a3a9 c58143e835f9: Ohm square metre per metre.

SquareCentiMetre
type: Class
subclass of: Restriction
  has value: 0.0001
subclass of: Restriction
  has value: 0.0
comment: A unit of area equal to that of a square, of sides 1cm -- QUDT
alternative label: Square Centimetre
EMMO 1f1b164d ec6a 4faa 8d5e 88bda62316cc: http://qudt.org/vocab/unit/CentiM2
EMMO 33ae2d07 5526 4555 a0b4 8f4c031b5652: cm2
EMMO 7f1dec83 d85e 4e1b b7bd c9442d4f5a64: cm²
EMMO 967080e5 2f42 4eb2 a3a9 c58143e835f9: A unit of area equal to that of a square, of sides 1cm -- QUDT

MilliSiemens
type: Class
subclass of: Restriction
  some values from: Siemens
subclass of: Restriction
  has value: 0.001
subclass of: Restriction
  has value: 0.0
comment: 0.001-fold of the SI derived unit siemens -- QUDT
EMMO 1f1b164d ec6a 4faa 8d5e 88bda62316cc: http://qudt.org/vocab/unit/MilliS
EMMO 33ae2d07 5526 4555 a0b4 8f4c031b5652: mS
EMMO 7f1dec83 d85e 4e1b b7bd c9442d4f5a64: mS
EMMO 967080e5 2f42 4eb2 a3a9 c58143e835f9: 0.001-fold of the SI derived unit siemens -- QUDT

Hour
type: Class
subclass of: Restriction
  has value: 3600.0
subclass of: Restriction
  has value: 0.0
subclass of: Restriction
  has value: h
comment: Measure of time defined as 3600 seconds.
comment: The hour (common symbol: h or hr) is a unit of measurement of time. In modern usage, an hour comprises 60 minutes, or 3,600 seconds. It is approximately 1/24 of a mean solar day. An hour in the Universal Coordinated Time (UTC) time standard can include a negative or positive leap second, and may therefore have a duration of 3,599 or 3,601 seconds for adjustment purposes. Although it is not a standard defined by the International System of Units, the hour is a unit accepted for use with SI, represented by the symbol h. -- QUDT
EMMO 0b1cbe60 d380 4787 b92e be26bdacf2c2: HUR
EMMO 1f1b164d ec6a 4faa 8d5e 88bda62316cc: http://qudt.org/vocab/unit/HR
EMMO 33ae2d07 5526 4555 a0b4 8f4c031b5652: h
EMMO 70fe84ff 99b6 4206 a9fc 9a8931836d84: Measure of time defined as 3600 seconds.
EMMO 967080e5 2f42 4eb2 a3a9 c58143e835f9: The hour (common symbol: h or hr) is a unit of measurement of time. In modern usage, an hour comprises 60 minutes, or 3,600 seconds. It is approximately 1/24 of a mean solar day. An hour in the Universal Coordinated Time (UTC) time standard can include a negative or positive leap second, and may therefore have a duration of 3,599 or 3,601 seconds for adjustment purposes. Although it is not a standard defined by the International System of Units, the hour is a unit accepted for use with SI, represented by the symbol h. -- QUDT
EMMO fe015383 afb3 44a6 ae86 043628697aa2: https://doi.org/10.1351/goldbook.H02866

Behaviour
type: Class
subclass of: Restriction
comment: A process which is an holistic temporal part of an object.
example: Accelerating is a behaviour of a car.
EMMO 967080e5 2f42 4eb2 a3a9 c58143e835f9: A process which is an holistic temporal part of an object.

CubicDeciMetrePerMole
type: Class
subclass of: Restriction
  has value: 0.001
subclass of: Restriction
  has value: 0.0
comment: 0,001-fold of the power of the SI base unit metre with the exponent 3 divided by the SI base unit mol -- QUDT
alternative label: Cubic Decimetre Per Mole
EMMO 1f1b164d ec6a 4faa 8d5e 88bda62316cc: http://qudt.org/vocab/unit/DeciM3-PER-MOL
EMMO 33ae2d07 5526 4555 a0b4 8f4c031b5652: dm3.mol-1
EMMO 33ae2d07 5526 4555 a0b4 8f4c031b5652: dm3/mol
EMMO 7f1dec83 d85e 4e1b b7bd c9442d4f5a64: dm³/mol
EMMO 967080e5 2f42 4eb2 a3a9 c58143e835f9: 0,001-fold of the power of the SI base unit metre with the exponent 3 divided by the SI base unit mol -- QUDT

KiloCoulombPerSquareMetre
type: Class
subclass of: Restriction
  some values from: CoulombPerSquareMetre
subclass of: Restriction
  has value: 1000.0
subclass of: Restriction
  has value: 0.0
comment: 1 000-fold of the SI derived unit coulomb divided by the power of the SI base unit metre with the exponent 2 -- QUDT
alternative label: Kilocoulomb Per Square Metre
EMMO 1f1b164d ec6a 4faa 8d5e 88bda62316cc: http://qudt.org/vocab/unit/KiloC-PER-M2
EMMO 33ae2d07 5526 4555 a0b4 8f4c031b5652: kC.m-2
EMMO 7f1dec83 d85e 4e1b b7bd c9442d4f5a64: kC/m²
EMMO 967080e5 2f42 4eb2 a3a9 c58143e835f9: 1 000-fold of the SI derived unit coulomb divided by the power of the SI base unit metre with the exponent 2 -- QUDT

QuarticCoulombMetrePerCubicEnergy
type: Class
comment: "Quartic Coulomb Meter per Cubic Energy" is a unit for 'Quartic Electric Dipole Moment Per Cubic Energy' expressed as C⁴ m⁴ J⁻³. -- QUDT
alternative label: Quartic Coulomb Metre per Cubic Energy
EMMO 1f1b164d ec6a 4faa 8d5e 88bda62316cc: http://qudt.org/vocab/unit/C4-M4-PER-J3
EMMO 33ae2d07 5526 4555 a0b4 8f4c031b5652: C4.m4.J-3
EMMO 33ae2d07 5526 4555 a0b4 8f4c031b5652: C4.m4/J3
EMMO 7f1dec83 d85e 4e1b b7bd c9442d4f5a64: C⁴m⁴/J³
EMMO 967080e5 2f42 4eb2 a3a9 c58143e835f9: "Quartic Coulomb Meter per Cubic Energy" is a unit for 'Quartic Electric Dipole Moment Per Cubic Energy' expressed as C⁴ m⁴ J⁻³. -- QUDT

QuarticElectricDipoleMomentPerCubicEnergyUnit
type: Class
subclass of: Restriction
  has value: T+10 L-2 M-3 I+4 Θ0 N0 J0
comment: The class of units with dimensionality 'QuarticElectricDipoleMomentPerCubicEnergy'.
EMMO 967080e5 2f42 4eb2 a3a9 c58143e835f9: The class of units with dimensionality 'QuarticElectricDipoleMomentPerCubicEnergy'.

SuperconductorEnergyGap
type: Class
comment: Width of the forbidden energy band in a superconductor.
EMMO 1f1b164d ec6a 4faa 8d5e 88bda62316cc: https://qudt.org/vocab/quantitykind/SuperconductorEnergyGap
EMMO 26bf1bef d192 4da6 b0eb d2209698fb54: https://www.wikidata.org/wiki/Q106127898
EMMO 50c298c2 55a2 4068 b3ac 4e948c33181f: https://www.electropedia.org/iev/iev.nsf/display
EMMO 8de5d5bf db1c 40ac b698 095ba3b18578: 12-37
EMMO 967080e5 2f42 4eb2 a3a9 c58143e835f9: Width of the forbidden energy band in a superconductor.

PerMetreNanoMetreSteradian
type: Class
subclass of: Restriction
  has value: 1000000000.0
subclass of: Restriction
  has value: 0.0
comment: Per metre and nanometre and steradian.
alternative label: ReciprocalMetreNanoMetreSteradian
EMMO 1f1b164d ec6a 4faa 8d5e 88bda62316cc: http://qudt.org/vocab/unit/PER-M-NanoM-SR
EMMO 33ae2d07 5526 4555 a0b4 8f4c031b5652: m-1.nm-1.sr-1
EMMO 7f1dec83 d85e 4e1b b7bd c9442d4f5a64: /(m⋅nm⋅sr)
EMMO 967080e5 2f42 4eb2 a3a9 c58143e835f9: Per metre and nanometre and steradian.

ParticleFluenceRate
type: Class
subclass of: Restriction
comment: Differential quotient of fluence Φ with respect to time.
EMMO 1f1b164d ec6a 4faa 8d5e 88bda62316cc: https://qudt.org/vocab/quantitykind/ParticleFluenceRate
EMMO 26bf1bef d192 4da6 b0eb d2209698fb54: https://www.wikidata.org/wiki/Q98497410
EMMO 50c298c2 55a2 4068 b3ac 4e948c33181f: https://www.electropedia.org/iev/iev.nsf/display
EMMO 8de5d5bf db1c 40ac b698 095ba3b18578: 10-44
EMMO 967080e5 2f42 4eb2 a3a9 c58143e835f9: Differential quotient of fluence Φ with respect to time.

SquareVoltPerSquareKelvin
type: Class
subclass of: Restriction
  has value: 1.0
subclass of: Restriction
  has value: 0.0
comment: Square volt per square Kelvin.
EMMO 1f1b164d ec6a 4faa 8d5e 88bda62316cc: http://qudt.org/vocab/unit/V2-PER-K2
EMMO 33ae2d07 5526 4555 a0b4 8f4c031b5652: V2.K-2
EMMO 7f1dec83 d85e 4e1b b7bd c9442d4f5a64: V²/K²
EMMO 967080e5 2f42 4eb2 a3a9 c58143e835f9: Square volt per square Kelvin.

FiberReinforcePlasticManufacturing
type: Class

SurfaceActivityDensity
type: Class
subclass of: Restriction
comment: Quotient of the activity A of a sample and the total area S of the surface of that sample.
EMMO 1f1b164d ec6a 4faa 8d5e 88bda62316cc: https://qudt.org/vocab/quantitykind/SurfaceActivityDensity
EMMO 26bf1bef d192 4da6 b0eb d2209698fb54: https://www.wikidata.org/wiki/Q98103005
EMMO 50c298c2 55a2 4068 b3ac 4e948c33181f: https://www.electropedia.org/iev/iev.nsf/display
EMMO 8de5d5bf db1c 40ac b698 095ba3b18578: 10-30
EMMO 967080e5 2f42 4eb2 a3a9 c58143e835f9: Quotient of the activity A of a sample and the total area S of the surface of that sample.

VectorData
type: Class
comment: The datatype for monodimensional arrays.
EMMO 8a137e9f 579c 4e28 baca e8980eb0c3db: SubClassOf: hasSpatialTile some ScalarData
EMMO 967080e5 2f42 4eb2 a3a9 c58143e835f9: The datatype for monodimensional arrays.

OrdinalQuantity
type: Class
comment: "Ordinal quantities, such as Rockwell C hardness, are usually not considered to be part of a system of quantities because they are related to other quantities through empirical relations only." International vocabulary of metrology (VIM)
comment: "Quantity, defined by a conventional measurement procedure, for which a total ordering relation can be established, according to magnitude, with other quantities of the same kind, but for which no algebraic operations among those quantities exist" International vocabulary of metrology (VIM)
example: Hardness Resilience
EMMO 967080e5 2f42 4eb2 a3a9 c58143e835f9: "Quantity, defined by a conventional measurement procedure, for which a total ordering relation can be established, according to magnitude, with other quantities of the same kind, but for which no algebraic operations among those quantities exist" International vocabulary of metrology (VIM)
EMMO bb49844b 45d7 4f0d 8cae 8e552cbc20d6: ordinal quantity

JoulePerCubicMetre
type: Class
subclass of: Restriction
  has value: 1.0
subclass of: Restriction
  has value: 0.0
comment: `Joule Per Cubic Meter` (J/m³) is a unit in the category of Energy density. It is also known as joules per cubic meter, joule per cubic metre, joules per cubic metre, joule/cubic meter, joule/cubic metre. This unit is commonly used in the SI unit system. It has a dimension of ML⁻¹T⁻² where M is mass, L is length, and T is time. This unit is the standard SI unit in this category. -- QUDT
alternative label: Joule per Cubic Metre
EMMO 1f1b164d ec6a 4faa 8d5e 88bda62316cc: http://qudt.org/vocab/unit/J-PER-M3
EMMO 33ae2d07 5526 4555 a0b4 8f4c031b5652: J.m-3
EMMO 33ae2d07 5526 4555 a0b4 8f4c031b5652: J/m3
EMMO 7f1dec83 d85e 4e1b b7bd c9442d4f5a64: J/m³
EMMO 967080e5 2f42 4eb2 a3a9 c58143e835f9: `Joule Per Cubic Meter` (J/m³) is a unit in the category of Energy density. It is also known as joules per cubic meter, joule per cubic metre, joules per cubic metre, joule/cubic meter, joule/cubic metre. This unit is commonly used in the SI unit system. It has a dimension of ML⁻¹T⁻² where M is mass, L is length, and T is time. This unit is the standard SI unit in this category. -- QUDT

KelvinPerTesla
type: Class
subclass of: Restriction
  has value: 1.0
subclass of: Restriction
  has value: 0.0
comment: `Kelvin per Tesla` is a unit for 'Temperature Per Magnetic Flux Density' expressed as K T⁻¹. -- QUDT
alternative label: Kelvin per Tesla
EMMO 1f1b164d ec6a 4faa 8d5e 88bda62316cc: http://qudt.org/vocab/unit/K-PER-T
EMMO 33ae2d07 5526 4555 a0b4 8f4c031b5652: K.T-1
EMMO 7f1dec83 d85e 4e1b b7bd c9442d4f5a64: K/T
EMMO 967080e5 2f42 4eb2 a3a9 c58143e835f9: `Kelvin per Tesla` is a unit for 'Temperature Per Magnetic Flux Density' expressed as K T⁻¹. -- QUDT

TemperaturePerMagneticFluxDensityUnit
type: Class
subclass of: Restriction
  has value: T+2 L0 M-1 I+1 Θ+1 N0 J0
comment: The class of units with dimensionality 'TemperaturePerMagneticFluxDensity'.
EMMO 967080e5 2f42 4eb2 a3a9 c58143e835f9: The class of units with dimensionality 'TemperaturePerMagneticFluxDensity'.

KilogramPerSquareMetreSquareSecond
type: Class
subclass of: Restriction
  has value: 1.0
subclass of: Restriction
  has value: 0.0
alternative label: Kilogram per Square Metre Square Second
EMMO 1f1b164d ec6a 4faa 8d5e 88bda62316cc: http://qudt.org/vocab/unit/KiloGM-PER-M2-SEC2
EMMO 7f1dec83 d85e 4e1b b7bd c9442d4f5a64: kg/(m²⋅s²)

PerKiloMetre
type: Class
subclass of: Restriction
  has value: 0.001
subclass of: Restriction
  has value: 0.0
comment: Per Kilometer Unit is a denominator unit with dimensions /km. -- QUDT
alternative label: ReciprocalKiloMetre
EMMO 1f1b164d ec6a 4faa 8d5e 88bda62316cc: http://qudt.org/vocab/unit/PER-KiloM
EMMO 33ae2d07 5526 4555 a0b4 8f4c031b5652: /km
EMMO 33ae2d07 5526 4555 a0b4 8f4c031b5652: km-1
EMMO 7f1dec83 d85e 4e1b b7bd c9442d4f5a64: /km
EMMO 967080e5 2f42 4eb2 a3a9 c58143e835f9: Per Kilometer Unit is a denominator unit with dimensions /km. -- QUDT

AngularFrequencyUnit
type: Class
subclass of: Restriction
  has value: T-2 L0 M0 I0 Θ0 N0 J0
comment: The class of units with dimensionality 'AngularFrequency'.
EMMO 967080e5 2f42 4eb2 a3a9 c58143e835f9: The class of units with dimensionality 'AngularFrequency'.

LeadAtom
type: Class
subclass of: Restriction
subclass of: Restriction
  has value: 207.2
subclass of: Restriction
  has value: 82
comment: Atom subclass for lead.
EMMO 967080e5 2f42 4eb2 a3a9 c58143e835f9: Atom subclass for lead.

LinearMassDensity
type: Class
subclass of: Restriction
comment: Mass per length.
alternative label: LinearDensity
alternative label: LineicMass
EMMO 1f1b164d ec6a 4faa 8d5e 88bda62316cc: https://qudt.org/vocab/quantitykind/LinearDensity
EMMO 26bf1bef d192 4da6 b0eb d2209698fb54: https://www.wikidata.org/wiki/Q56298294
EMMO 50c298c2 55a2 4068 b3ac 4e948c33181f: https://www.electropedia.org/iev/iev.nsf/display
EMMO 8de5d5bf db1c 40ac b698 095ba3b18578: 4-6
EMMO 967080e5 2f42 4eb2 a3a9 c58143e835f9: Mass per length.

NihoniumAtom
type: Class
subclass of: Restriction
subclass of: Restriction
  has value: 286.182
subclass of: Restriction
  has value: 113
comment: Atom subclass for nihonium.
EMMO 967080e5 2f42 4eb2 a3a9 c58143e835f9: Atom subclass for nihonium.

WattPerMetreKelvin
type: Class
subclass of: Restriction
  has value: 1.0
subclass of: Restriction
  has value: 0.0
comment: Watt per metre and Kelvin unit.
EMMO 1f1b164d ec6a 4faa 8d5e 88bda62316cc: http://qudt.org/vocab/unit/W-PER-M-K
EMMO 33ae2d07 5526 4555 a0b4 8f4c031b5652: W.m-1.K-1
EMMO 7f1dec83 d85e 4e1b b7bd c9442d4f5a64: W/(m⋅K)
EMMO 967080e5 2f42 4eb2 a3a9 c58143e835f9: Watt per metre and Kelvin unit.
EMMO c84c6752 6d64 48cc 9500 e54a3c34898d: http://en.wikipedia.org/wiki/Thermal_conductivity

ThermalConductivityUnit
type: Class
subclass of: Restriction
  has value: T-3 L+1 M+1 I0 Θ-1 N0 J0
comment: The class of units with dimensionality 'ThermalConductivity'.
EMMO 967080e5 2f42 4eb2 a3a9 c58143e835f9: The class of units with dimensionality 'ThermalConductivity'.

AreaPerTemperatureUnit
type: Class
subclass of: Restriction
  has value: T0 L+2 M0 I0 Θ-1 N0 J0
comment: The class of units with dimensionality 'AreaPerTemperature'.
EMMO 967080e5 2f42 4eb2 a3a9 c58143e835f9: The class of units with dimensionality 'AreaPerTemperature'.

VoltAmpere
type: Class
subclass of: Restriction
  has value: 1.0
subclass of: Restriction
  has value: 0.0
comment: product of the SI derived unit volt and the SI base unit ampere -- QUDT
alternative label: Volt Ampere
EMMO 1f1b164d ec6a 4faa 8d5e 88bda62316cc: http://qudt.org/vocab/unit/V-A
EMMO 33ae2d07 5526 4555 a0b4 8f4c031b5652: V.A
EMMO 7f1dec83 d85e 4e1b b7bd c9442d4f5a64: V⋅A
EMMO 967080e5 2f42 4eb2 a3a9 c58143e835f9: product of the SI derived unit volt and the SI base unit ampere -- QUDT

AffinityOfAChemicalReaction
type: Class
subclass of: Restriction
comment: Describes elements' or compounds' readiness to form bonds.
alternative label: ChemicalAffinity
EMMO 1f1b164d ec6a 4faa 8d5e 88bda62316cc: https://qudt.org/vocab/quantitykind/ChemicalAffinity
EMMO 26bf1bef d192 4da6 b0eb d2209698fb54: https://www.wikidata.org/wiki/Q382783
EMMO 8de5d5bf db1c 40ac b698 095ba3b18578: 9-30
EMMO 967080e5 2f42 4eb2 a3a9 c58143e835f9: Describes elements' or compounds' readiness to form bonds.
EMMO fe015383 afb3 44a6 ae86 043628697aa2: https://doi.org/10.1351/goldbook.A00178

Curve
type: Class
comment: A one-manyfold with two unconnected end points.
EMMO 967080e5 2f42 4eb2 a3a9 c58143e835f9: A one-manyfold with two unconnected end points.

OneManifold
type: Class
comment: A topological space with the property that each point has a neighborhood that is homeomorphic to an open subset of 1-dimensional Euclidean space.
comment: One-dimensional manifolds include lines and circles, but not self-crossing curves. Two-dimensional manifolds are also called surfaces. Examples include the plane, the sphere, and the torus, and also the Klein bottle and real projective plane.
alternative label: 1-manifold
EMMO 967080e5 2f42 4eb2 a3a9 c58143e835f9: A topological space with the property that each point has a neighborhood that is homeomorphic to an open subset of 1-dimensional Euclidean space.
EMMO c7b62dd7 063a 4c2a 8504 42f7264ba83f: One-dimensional manifolds include lines and circles, but not self-crossing curves. Two-dimensional manifolds are also called surfaces. Examples include the plane, the sphere, and the torus, and also the Klein bottle and real projective plane.

CentiCoulomb
type: Class
subclass of: Restriction
  some values from: Coulomb
subclass of: Restriction
  has value: 0.01
subclass of: Restriction
  has value: 0.0
comment: A CentiCoulomb is 10⁻² C. -- QUDT
EMMO 1f1b164d ec6a 4faa 8d5e 88bda62316cc: http://qudt.org/vocab/unit/CentiC
EMMO 33ae2d07 5526 4555 a0b4 8f4c031b5652: cC
EMMO 7f1dec83 d85e 4e1b b7bd c9442d4f5a64: cC
EMMO 967080e5 2f42 4eb2 a3a9 c58143e835f9: A CentiCoulomb is 10⁻² C. -- QUDT

UnitOne
type: Class
comment: "The unit one is the neutral element of any system of units – necessary and present automatically." -- SI Brochure
comment: Represents the number 1, used as an explicit unit to say something has no units.
alternative label: Unitless
example: Refractive index or volume fraction.
example: Typically used for ratios of two units whos dimensions cancels out.
EMMO 1f1b164d ec6a 4faa 8d5e 88bda62316cc: http://qudt.org/vocab/unit/UNITLESS
EMMO 70fe84ff 99b6 4206 a9fc 9a8931836d84: Represents the number 1, used as an explicit unit to say something has no units.
EMMO 967080e5 2f42 4eb2 a3a9 c58143e835f9: "The unit one is the neutral element of any system of units – necessary and present automatically." -- SI Brochure

XenonSymbol
type: Class
subclass of: Restriction
  has value: Xe
comment: The symbol that stands for the xenon atom.
EMMO 967080e5 2f42 4eb2 a3a9 c58143e835f9: The symbol that stands for the xenon atom.

ElectricDipoleMoment
type: Class
subclass of: Restriction
comment: An electric dipole, vector quantity of magnitude equal to the product of the positive charge and the distance between the charges and directed from the negative charge to the positive charge.
EMMO 1f1b164d ec6a 4faa 8d5e 88bda62316cc: http://qudt.org/vocab/quantitykind/ElectricDipoleMoment
EMMO 26bf1bef d192 4da6 b0eb d2209698fb54: https://www.wikidata.org/wiki/Q735135
EMMO 50c298c2 55a2 4068 b3ac 4e948c33181f: https://www.electropedia.org/iev/iev.nsf/display
EMMO 8de5d5bf db1c 40ac b698 095ba3b18578: 6-6
EMMO 967080e5 2f42 4eb2 a3a9 c58143e835f9: An electric dipole, vector quantity of magnitude equal to the product of the positive charge and the distance between the charges and directed from the negative charge to the positive charge.
EMMO fe015383 afb3 44a6 ae86 043628697aa2: https://doi.org/10.1351/goldbook.E01929

CoulombPerSquareMetre
type: Class
subclass of: Restriction
  has value: 1.0
subclass of: Restriction
  has value: 0.0
comment: Coulomb Per Square Meter (C/m²) is a unit in the category of Electric charge surface density. It is also known as coulombs per square meter, coulomb per square metre, coulombs per square metre, coulomb/square meter, coulomb/square metre. This unit is commonly used in the SI unit system. Coulomb Per Square Meter (C/m2) has a dimension of L⁻²TI where L is length, T is time, and I is electric current. This unit is the standard SI unit in this category. -- QUDT
alternative label: Coulomb per Square Metre
EMMO 1f1b164d ec6a 4faa 8d5e 88bda62316cc: http://qudt.org/vocab/unit/C-PER-M2
EMMO 33ae2d07 5526 4555 a0b4 8f4c031b5652: C.m-2
EMMO 33ae2d07 5526 4555 a0b4 8f4c031b5652: C/m2
EMMO 7f1dec83 d85e 4e1b b7bd c9442d4f5a64: C/m²
EMMO 967080e5 2f42 4eb2 a3a9 c58143e835f9: Coulomb Per Square Meter (C/m²) is a unit in the category of Electric charge surface density. It is also known as coulombs per square meter, coulomb per square metre, coulombs per square metre, coulomb/square meter, coulomb/square metre. This unit is commonly used in the SI unit system. Coulomb Per Square Meter (C/m2) has a dimension of L⁻²TI where L is length, T is time, and I is electric current. This unit is the standard SI unit in this category. -- QUDT

MetrePerSquareSecond
type: Class
subclass of: Restriction
  has value: 1.0
subclass of: Restriction
  has value: 0.0
comment: The `meter per Square second` is the unit of acceleration in the International System of Units (SI). As a derived unit it is composed from the SI base units of length, the metre, and the standard unit of time, the second. Its symbol is written in several forms as m/s², or m s⁻². As acceleration, the unit is interpreted physically as change in velocity or speed per time interval, that is, `metre per second per second`. -- QUDT
alternative label: Metre per Square Second
EMMO 1f1b164d ec6a 4faa 8d5e 88bda62316cc: http://qudt.org/vocab/unit/M-PER-SEC2
EMMO 33ae2d07 5526 4555 a0b4 8f4c031b5652: m.s-2
EMMO 33ae2d07 5526 4555 a0b4 8f4c031b5652: m/s2
EMMO 7f1dec83 d85e 4e1b b7bd c9442d4f5a64: m/s²
EMMO 967080e5 2f42 4eb2 a3a9 c58143e835f9: The `meter per Square second` is the unit of acceleration in the International System of Units (SI). As a derived unit it is composed from the SI base units of length, the metre, and the standard unit of time, the second. Its symbol is written in several forms as m/s², or m s⁻². As acceleration, the unit is interpreted physically as change in velocity or speed per time interval, that is, `metre per second per second`. -- QUDT

Expression
type: Class
comment: A well-formed finite combination of mathematical symbols according to some specific rules.
EMMO 967080e5 2f42 4eb2 a3a9 c58143e835f9: A well-formed finite combination of mathematical symbols according to some specific rules.

Gradient
type: Class
subclass of: Restriction
  has value: ∇

FleroviumSymbol
type: Class
subclass of: Restriction
  has value: Fl
comment: The symbol that stands for the flerovium atom.
EMMO 967080e5 2f42 4eb2 a3a9 c58143e835f9: The symbol that stands for the flerovium atom.

JoulePerSquareMetre
type: Class
subclass of: Restriction
  has value: 1.0
subclass of: Restriction
  has value: 0.0
comment: Joule Per Square Meter (J/m²) is a unit in the category of Energy density. It is also known as joules per square meter, joule per square metre, joule/square meter, joule/square metre. This unit is commonly used in the SI unit system. -- QUDT
alternative label: Joule per Square Metre
EMMO 1f1b164d ec6a 4faa 8d5e 88bda62316cc: http://qudt.org/vocab/unit/J-PER-M2
EMMO 33ae2d07 5526 4555 a0b4 8f4c031b5652: J.m-2
EMMO 33ae2d07 5526 4555 a0b4 8f4c031b5652: J/m2
EMMO 7f1dec83 d85e 4e1b b7bd c9442d4f5a64: J/m²
EMMO 967080e5 2f42 4eb2 a3a9 c58143e835f9: Joule Per Square Meter (J/m²) is a unit in the category of Energy density. It is also known as joules per square meter, joule per square metre, joule/square meter, joule/square metre. This unit is commonly used in the SI unit system. -- QUDT

PlutoniumSymbol
type: Class
subclass of: Restriction
  has value: Pu
comment: The symbol that stands for the plutonium atom.
EMMO 967080e5 2f42 4eb2 a3a9 c58143e835f9: The symbol that stands for the plutonium atom.

PhysicalPhenomenon
type: Class
comment: A physical phenomenon is intended as a physical process that starts or ends with an unbonded state, or that includes incoming or aoutgoing particles.
comment: The class of individuals standing for causally non-convex interacting systems.
example: A molecule, including a photon emitted (or captured) as result of a de-excitation (or excitation) process.
example: The formation of an hydrogen atom from a proton and electron.
EMMO 31252f35 c767 4b97 a877 1235076c3e13: A physical phenomenon is intended as a physical process that starts or ends with an unbonded state, or that includes incoming or aoutgoing particles.
EMMO 967080e5 2f42 4eb2 a3a9 c58143e835f9: The class of individuals standing for causally non-convex interacting systems.

PhysicalObject
type: Class
comment: It is natural to define entities made or more than one smaller parts as object according to some unity criteria. One of the most general one applicable to causal interacting systems is to ask that all the quantum parts of the system are part of elementaries whose paths start and end within the entitiy. We call this causal convexity. In other words, causal convexity excludes all quantums that leave the system (no more interacting), or that are not yet part of it (not yet interacting). So, a photon leaving a body is not part of a convex system, while a real photon that is the carrier of clasical electromagnetic interaction between two molecular parts of the body, is part of the convex body. A physical phenomenon is defined as a causally non-convex interacting system, complement of causally convex interacting system.
comment: The class of individuals standing for causally convex interacting systems.
EMMO 31252f35 c767 4b97 a877 1235076c3e13: It is natural to define entities made or more than one smaller parts as object according to some unity criteria. One of the most general one applicable to causal interacting systems is to ask that all the quantum parts of the system are part of elementaries whose paths start and end within the entitiy. We call this causal convexity. In other words, causal convexity excludes all quantums that leave the system (no more interacting), or that are not yet part of it (not yet interacting). So, a photon leaving a body is not part of a convex system, while a real photon that is the carrier of clasical electromagnetic interaction between two molecular parts of the body, is part of the convex body. A physical phenomenon is defined as a causally non-convex interacting system, complement of causally convex interacting system.
EMMO 8a137e9f 579c 4e28 baca e8980eb0c3db: DisjointUnionOf: CompositePhysicalObject, BondedObject
EMMO 967080e5 2f42 4eb2 a3a9 c58143e835f9: The class of individuals standing for causally convex interacting systems.

RelativeMassDensity
type: Class
comment: Mass density ρ of a substance divided by the mass density ρ0 of a reference substance, under conditions that should be specified for both substances.
alternative label: RelativeDensity
EMMO 26bf1bef d192 4da6 b0eb d2209698fb54: https://www.wikidata.org/wiki/Q11027905
EMMO 50c298c2 55a2 4068 b3ac 4e948c33181f: https://www.electropedia.org/iev/iev.nsf/display
EMMO 8de5d5bf db1c 40ac b698 095ba3b18578: 4-4
EMMO 967080e5 2f42 4eb2 a3a9 c58143e835f9: Mass density ρ of a substance divided by the mass density ρ0 of a reference substance, under conditions that should be specified for both substances.
EMMO fe015383 afb3 44a6 ae86 043628697aa2: https://doi.org/10.1351/goldbook.R05262

ActivePower
type: Class
comment: Average power over a period.
EMMO 1f1b164d ec6a 4faa 8d5e 88bda62316cc: https://qudt.org/vocab/quantitykind/ActivePower
EMMO 26bf1bef d192 4da6 b0eb d2209698fb54: https://www.wikidata.org/wiki/Q20820042
EMMO 50c298c2 55a2 4068 b3ac 4e948c33181f: https://www.electropedia.org/iev/iev.nsf/display
EMMO 8de5d5bf db1c 40ac b698 095ba3b18578: 6-56
EMMO 967080e5 2f42 4eb2 a3a9 c58143e835f9: Average power over a period.

UnsignedLongData
type: Class
comment: A data representing 64-bit non-negative integer number, 0...18446744073709551615.
EMMO 8a137e9f 579c 4e28 baca e8980eb0c3db: EquivalentTo: hasDataValue some xsd:unsignedLong
EMMO 967080e5 2f42 4eb2 a3a9 c58143e835f9: A data representing 64-bit non-negative integer number, 0...18446744073709551615.

MilliSecond
type: Class
subclass of: Restriction
  some values from: Second
subclass of: Restriction
  has value: 0.001
subclass of: Restriction
  has value: 0.0
comment: "Millisecond" is an Imperial unit for 'Time' expressed as ms. -- QUDT
alternative label: millisecond
EMMO 1f1b164d ec6a 4faa 8d5e 88bda62316cc: http://qudt.org/vocab/unit/MilliSEC
EMMO 33ae2d07 5526 4555 a0b4 8f4c031b5652: ms
EMMO 7f1dec83 d85e 4e1b b7bd c9442d4f5a64: ms
EMMO 967080e5 2f42 4eb2 a3a9 c58143e835f9: "Millisecond" is an Imperial unit for 'Time' expressed as ms. -- QUDT
EMMO c84c6752 6d64 48cc 9500 e54a3c34898d: http://en.wikipedia.org/wiki/Millisecond

Visual
type: Class
comment: A 'Perceptual' which stands for a real world object whose spatiotemporal pattern makes it identifiable by an observer through an optical perception employing the visible part of the electromagnetic spectrum.
example: A cloud. A picture. A colour gradient on a wall. A stain. A mail.
EMMO 967080e5 2f42 4eb2 a3a9 c58143e835f9: A 'Perceptual' which stands for a real world object whose spatiotemporal pattern makes it identifiable by an observer through an optical perception employing the visible part of the electromagnetic spectrum.

GravitySintering
type: Class
see also: ISO 3252:2019 Powder metallurgy loose-powder sintering, gravity sintering: sintering of uncompacted powder
alternative label: Loose-powderSintering
alternative label: PressurelessSintering

PetaJoule
type: Class
subclass of: Restriction
  some values from: Joule
subclass of: Restriction
  has value: 1000000000000000.0
subclass of: Restriction
  has value: 0.0
comment: 1,000,000,000,000,000-fold of the derived SI unit joule -- QUDT
EMMO 1f1b164d ec6a 4faa 8d5e 88bda62316cc: http://qudt.org/vocab/unit/PetaJ
EMMO 33ae2d07 5526 4555 a0b4 8f4c031b5652: PJ
EMMO 7f1dec83 d85e 4e1b b7bd c9442d4f5a64: PJ
EMMO 967080e5 2f42 4eb2 a3a9 c58143e835f9: 1,000,000,000,000,000-fold of the derived SI unit joule -- QUDT

SquareMetreSecondPerRadian
type: Class
subclass of: Restriction
  has value: 1.0
subclass of: Restriction
  has value: 0.0
comment: Square metre seconds per radian.
EMMO 1f1b164d ec6a 4faa 8d5e 88bda62316cc: http://qudt.org/vocab/unit/M2-SEC-PER-RAD
EMMO 33ae2d07 5526 4555 a0b4 8f4c031b5652: m2.s.rad-1
EMMO 7f1dec83 d85e 4e1b b7bd c9442d4f5a64: m²⋅s/rad
EMMO 967080e5 2f42 4eb2 a3a9 c58143e835f9: Square metre seconds per radian.

AreaTimeUnit
type: Class
subclass of: Restriction
  has value: T+1 L+2 M0 I0 Θ0 N0 J0
comment: The class of units with dimensionality 'AreaTime'.
EMMO 967080e5 2f42 4eb2 a3a9 c58143e835f9: The class of units with dimensionality 'AreaTime'.

Ampere
type: Class
subclass of: Restriction
  has value: A
comment: The ampere, symbol A, is the SI unit of electric current. It is defined by taking the fixed numerical value of the elementary charge e to be 1.602176634×10−19 when expressed in the unit C, which is equal to A s, where the second is defined in terms of ∆νCs.
EMMO 0b1cbe60 d380 4787 b92e be26bdacf2c2: AMP
EMMO 1f1b164d ec6a 4faa 8d5e 88bda62316cc: http://qudt.org/vocab/unit/A
EMMO 33ae2d07 5526 4555 a0b4 8f4c031b5652: A
EMMO 6dd685dd 1895 46e4 b227 be9f7d643c25: http://dbpedia.org/resource/Ampere
EMMO 70fe84ff 99b6 4206 a9fc 9a8931836d84: The ampere, symbol A, is the SI unit of electric current. It is defined by taking the fixed numerical value of the elementary charge e to be 1.602176634×10−19 when expressed in the unit C, which is equal to A s, where the second is defined in terms of ∆νCs.
EMMO c84c6752 6d64 48cc 9500 e54a3c34898d: http://en.wikipedia.org/wiki/Ampere
EMMO fe015383 afb3 44a6 ae86 043628697aa2: https://doi.org/10.1351/goldbook.A00300

ReactorTimeConstant
type: Class
comment: Duration required for the neutron fluence rate in a reactor to change by the factor e when the fluence rate is rising or falling exponentially.
EMMO 1f1b164d ec6a 4faa 8d5e 88bda62316cc: https://qudt.org/vocab/quantitykind/ReactorTimeConstant
EMMO 26bf1bef d192 4da6 b0eb d2209698fb54: https://www.wikidata.org/wiki/Q99518950
EMMO 50c298c2 55a2 4068 b3ac 4e948c33181f: https://www.electropedia.org/iev/iev.nsf/display
EMMO 8de5d5bf db1c 40ac b698 095ba3b18578: 10-79
EMMO 967080e5 2f42 4eb2 a3a9 c58143e835f9: Duration required for the neutron fluence rate in a reactor to change by the factor e when the fluence rate is rising or falling exponentially.

ZincSymbol
type: Class
subclass of: Restriction
  has value: Zn
comment: The symbol that stands for the zinc atom.
EMMO 967080e5 2f42 4eb2 a3a9 c58143e835f9: The symbol that stands for the zinc atom.

BismuthSymbol
type: Class
subclass of: Restriction
  has value: Bi
comment: The symbol that stands for the bismuth atom.
EMMO 967080e5 2f42 4eb2 a3a9 c58143e835f9: The symbol that stands for the bismuth atom.

IRI
type: Class
comment: An Internationalized Resource Identifier (IRI) is a compact sequence of characters that identifies an abstract or physical resource. It is similar to URI, but greatly extends the allowed character set from ASCII to the Universal Character Set (Unicode/ISO 10646)..
comment: IRIs are commonly used as identifiers for ontological entities, although the extended unicode character set is rarely used.
example: https://en.wiktionary.org/wiki/Ῥόδος
EMMO 967080e5 2f42 4eb2 a3a9 c58143e835f9: An Internationalized Resource Identifier (IRI) is a compact sequence of characters that identifies an abstract or physical resource. It is similar to URI, but greatly extends the allowed character set from ASCII to the Universal Character Set (Unicode/ISO 10646)..
EMMO c7b62dd7 063a 4c2a 8504 42f7264ba83f: IRIs are commonly used as identifiers for ontological entities, although the extended unicode character set is rarely used.
EMMO c84c6752 6d64 48cc 9500 e54a3c34898d: https://en.wikipedia.org/wiki/Internationalized_Resource_Identifier

MatterByStructure
type: Class

MassRatioOfWaterToDryMatter
type: Class
comment: Ratio of the mass of water to the mass of dry matter in a given volume of matter.
comment: The mass concentration of water at saturation is denoted usat.
EMMO 26bf1bef d192 4da6 b0eb d2209698fb54: https://www.wikidata.org/wiki/Q76378860
EMMO 50c298c2 55a2 4068 b3ac 4e948c33181f: https://www.electropedia.org/iev/iev.nsf/display
EMMO 8de5d5bf db1c 40ac b698 095ba3b18578: 5-29
EMMO 967080e5 2f42 4eb2 a3a9 c58143e835f9: Ratio of the mass of water to the mass of dry matter in a given volume of matter.

MicroMolePerSquareMetrePerSecond
type: Class
subclass of: Restriction
  some values from: MolePerSquareMetrePerSecond
subclass of: Restriction
  has value: 1e-06
subclass of: Restriction
  has value: 0.0
comment: One part per 10**6 (million) of the SI unit of quantity of matter (the mole) per SI unit area per SI unit of time. This term is based on the number of photons in a certain waveband incident per unit time (s) on a unit area (m2) divided by the Avogadro constant (6.022 x 1023 mol-1). It is used commonly to describe PAR in the 400-700 nm waveband. Definition Source: Thimijan, Richard W., and Royal D. Heins. 1982. Photometric, Radiometric, and Quantum Light Units of Measure: A Review of Procedures for Interconversion. HortScience 18:818-822. -- QUDT
alternative label: Micromoles per square metre per second
EMMO 1f1b164d ec6a 4faa 8d5e 88bda62316cc: http://qudt.org/vocab/unit/MicroMOL-PER-M2-SEC
EMMO 33ae2d07 5526 4555 a0b4 8f4c031b5652: umol.m-2.s-1
EMMO 33ae2d07 5526 4555 a0b4 8f4c031b5652: umol/m2/s
EMMO 7f1dec83 d85e 4e1b b7bd c9442d4f5a64: µmol/(m²⋅s)
EMMO 967080e5 2f42 4eb2 a3a9 c58143e835f9: One part per 10**6 (million) of the SI unit of quantity of matter (the mole) per SI unit area per SI unit of time. This term is based on the number of photons in a certain waveband incident per unit time (s) on a unit area (m2) divided by the Avogadro constant (6.022 x 1023 mol-1). It is used commonly to describe PAR in the 400-700 nm waveband. Definition Source: Thimijan, Richard W., and Royal D. Heins. 1982. Photometric, Radiometric, and Quantum Light Units of Measure: A Review of Procedures for Interconversion. HortScience 18:818-822. -- QUDT

SilverSymbol
type: Class
subclass of: Restriction
  has value: Ag
comment: The symbol that stands for the silver atom.
EMMO 967080e5 2f42 4eb2 a3a9 c58143e835f9: The symbol that stands for the silver atom.

EndTask
type: Class
comment: The final task of a workflow.
comment: There may be more than one end task, if they run in parallel leading to more than one output.
EMMO 967080e5 2f42 4eb2 a3a9 c58143e835f9: The final task of a workflow.
EMMO c7b62dd7 063a 4c2a 8504 42f7264ba83f: There may be more than one end task, if they run in parallel leading to more than one output.

MegaBecquerel
type: Class
subclass of: Restriction
  some values from: Becquerel
subclass of: Restriction
  has value: 1000000.0
subclass of: Restriction
  has value: 0.0
comment: 1 000 000-fold of the derived unit becquerel -- QUDT
EMMO 1f1b164d ec6a 4faa 8d5e 88bda62316cc: http://qudt.org/vocab/unit/MegaBQ
EMMO 33ae2d07 5526 4555 a0b4 8f4c031b5652: MBq
EMMO 7f1dec83 d85e 4e1b b7bd c9442d4f5a64: MBq
EMMO 967080e5 2f42 4eb2 a3a9 c58143e835f9: 1 000 000-fold of the derived unit becquerel -- QUDT

Shape4x3Matrix
type: Class
comment: A real matrix with shape 4x3.
EMMO 967080e5 2f42 4eb2 a3a9 c58143e835f9: A real matrix with shape 4x3.

PicoHenry
type: Class
subclass of: Restriction
  some values from: Henry
subclass of: Restriction
  has value: 1e-12
subclass of: Restriction
  has value: 0.0
comment: 0.000000000001-fold of the SI derived unit henry -- QUDT
EMMO 1f1b164d ec6a 4faa 8d5e 88bda62316cc: http://qudt.org/vocab/unit/PicoH
EMMO 33ae2d07 5526 4555 a0b4 8f4c031b5652: pH
EMMO 7f1dec83 d85e 4e1b b7bd c9442d4f5a64: pH
EMMO 967080e5 2f42 4eb2 a3a9 c58143e835f9: 0.000000000001-fold of the SI derived unit henry -- QUDT

MicroMole
type: Class
subclass of: Restriction
  has value: 1e-06
subclass of: Restriction
  has value: 0.0
comment: 0.000001-fold of the SI base unit mol -- QUDT
EMMO 1f1b164d ec6a 4faa 8d5e 88bda62316cc: http://qudt.org/vocab/unit/MicroMOL
EMMO 33ae2d07 5526 4555 a0b4 8f4c031b5652: umol
EMMO 7f1dec83 d85e 4e1b b7bd c9442d4f5a64: μmol
EMMO 967080e5 2f42 4eb2 a3a9 c58143e835f9: 0.000001-fold of the SI base unit mol -- QUDT

GigaWatt
type: Class
subclass of: Restriction
  some values from: Watt
subclass of: Restriction
  has value: 1000000000.0
subclass of: Restriction
  has value: 0.0
comment: 1 000 000 000-fold of the SI derived unit watt -- QUDT
EMMO 1f1b164d ec6a 4faa 8d5e 88bda62316cc: http://qudt.org/vocab/unit/GigaW
EMMO 33ae2d07 5526 4555 a0b4 8f4c031b5652: GW
EMMO 7f1dec83 d85e 4e1b b7bd c9442d4f5a64: GW
EMMO 967080e5 2f42 4eb2 a3a9 c58143e835f9: 1 000 000 000-fold of the SI derived unit watt -- QUDT

DisplacementCurrent
type: Class
comment: Scalar quantity equal to the flux of the displacement current density JD through a given directed surface S.
EMMO 1f1b164d ec6a 4faa 8d5e 88bda62316cc: https://qudt.org/vocab/quantitykind/DisplacementCurrent
EMMO 26bf1bef d192 4da6 b0eb d2209698fb54: https://www.wikidata.org/wiki/Q853178
EMMO 50c298c2 55a2 4068 b3ac 4e948c33181f: https://www.electropedia.org/iev/iev.nsf/display
EMMO 8de5d5bf db1c 40ac b698 095ba3b18578: 6-19.1
EMMO 967080e5 2f42 4eb2 a3a9 c58143e835f9: Scalar quantity equal to the flux of the displacement current density JD through a given directed surface S.

SpatialTiling
type: Class
subclass of: Restriction
comment: A well formed tessellation with tiles that all spatial.
EMMO 967080e5 2f42 4eb2 a3a9 c58143e835f9: A well formed tessellation with tiles that all spatial.

Factory
type: Class
comment: A building or group of buildings where goods are manufactured or assembled.
alternative label: IndustrialPlant
EMMO 967080e5 2f42 4eb2 a3a9 c58143e835f9: A building or group of buildings where goods are manufactured or assembled.

KelvinSecond
type: Class
subclass of: Restriction
  has value: 1.0
subclass of: Restriction
  has value: 0.0
comment: Kelvin second.
EMMO 1f1b164d ec6a 4faa 8d5e 88bda62316cc: http://qudt.org/vocab/unit/K-SEC
EMMO 33ae2d07 5526 4555 a0b4 8f4c031b5652: K.s
EMMO 7f1dec83 d85e 4e1b b7bd c9442d4f5a64: K⋅s
EMMO 967080e5 2f42 4eb2 a3a9 c58143e835f9: Kelvin second.

TemperatureTimeUnit
type: Class
subclass of: Restriction
  has value: T+1 L0 M0 I0 Θ+1 N0 J0
comment: The class of units with dimensionality 'TemperatureTime'.
EMMO 967080e5 2f42 4eb2 a3a9 c58143e835f9: The class of units with dimensionality 'TemperatureTime'.

WattPerSquareMetreSteradian
type: Class
subclass of: Restriction
  has value: 1.0
subclass of: Restriction
  has value: 0.0
comment: `Watt per steradian per square metre` is the SI unit of radiance (W·sr⁻¹·m⁻²), while that of spectral radiance in frequency is the watt per steradian per square metre per hertz (W·sr⁻¹·m⁻²·Hz⁻¹) and that of spectral radiance in wavelength is the watt per steradian per square metre, per metre (W·sr⁻¹·m⁻³), commonly the watt per steradian per square metre per nanometre (W·sr⁻¹·m⁻²·nm⁻¹). It has a dimension of ML⁻⁴T⁻³ where M is mass, L is length, and T is time. This unit is the standard SI unit in this category. -- QUDT
alternative label: Watt per Square Metre Steradian
EMMO 1f1b164d ec6a 4faa 8d5e 88bda62316cc: http://qudt.org/vocab/unit/W-PER-M2-SR
EMMO 33ae2d07 5526 4555 a0b4 8f4c031b5652: W.m-2.sr-1
EMMO 7f1dec83 d85e 4e1b b7bd c9442d4f5a64: W/(m²⋅sr)
EMMO 967080e5 2f42 4eb2 a3a9 c58143e835f9: `Watt per steradian per square metre` is the SI unit of radiance (W·sr⁻¹·m⁻²), while that of spectral radiance in frequency is the watt per steradian per square metre per hertz (W·sr⁻¹·m⁻²·Hz⁻¹) and that of spectral radiance in wavelength is the watt per steradian per square metre, per metre (W·sr⁻¹·m⁻³), commonly the watt per steradian per square metre per nanometre (W·sr⁻¹·m⁻²·nm⁻¹). It has a dimension of ML⁻⁴T⁻³ where M is mass, L is length, and T is time. This unit is the standard SI unit in this category. -- QUDT
EMMO c84c6752 6d64 48cc 9500 e54a3c34898d: https://en.wikipedia.org/wiki/Radiance

LinkedModelsSimulation
type: Class
comment: A chain of linked physics based model simulations, where equations are solved sequentially.
EMMO 967080e5 2f42 4eb2 a3a9 c58143e835f9: A chain of linked physics based model simulations, where equations are solved sequentially.

MultiSimulation
type: Class
comment: A physics based simulation with multiple physics based models.
EMMO 967080e5 2f42 4eb2 a3a9 c58143e835f9: A physics based simulation with multiple physics based models.

DeciNewton
type: Class
subclass of: Restriction
  some values from: Newton
subclass of: Restriction
  has value: 0.1
subclass of: Restriction
  has value: 0.0
EMMO 1f1b164d ec6a 4faa 8d5e 88bda62316cc: http://qudt.org/vocab/unit/DeciN
EMMO 7f1dec83 d85e 4e1b b7bd c9442d4f5a64: dN

LondonPenetrationDepth
type: Class
comment: Distance a magnetic field penetrates the plane surface of a semi-finite superconductor.
EMMO 1f1b164d ec6a 4faa 8d5e 88bda62316cc: https://qudt.org/vocab/quantitykind/LondonPenetrationDepth
EMMO 26bf1bef d192 4da6 b0eb d2209698fb54: https://www.wikidata.org/wiki/Q3277853
EMMO 50c298c2 55a2 4068 b3ac 4e948c33181f: https://www.electropedia.org/iev/iev.nsf/display
EMMO 8de5d5bf db1c 40ac b698 095ba3b18578: 12-38.1
EMMO 967080e5 2f42 4eb2 a3a9 c58143e835f9: Distance a magnetic field penetrates the plane surface of a semi-finite superconductor.

LarmonAngularFrequency
type: Class
comment: Angular frequency of the electron angular momentum vector precession about the axis of an external magnetic field.
EMMO 8de5d5bf db1c 40ac b698 095ba3b18578: 10-15.1
EMMO 967080e5 2f42 4eb2 a3a9 c58143e835f9: Angular frequency of the electron angular momentum vector precession about the axis of an external magnetic field.

SharedAgency
type: Class
comment: Shared agency occurs when two or more individuals do something together.
EMMO 967080e5 2f42 4eb2 a3a9 c58143e835f9: Shared agency occurs when two or more individuals do something together.

KilogramPerSquareCentiMetre
type: Class
subclass of: Restriction
  has value: 10000.0
subclass of: Restriction
  has value: 0.0
comment: SI base unit kilogram divided by the 0.0001-fold of the power of the SI base unit metre by exponent 2 -- QUDT
alternative label: Kilogram Per Square Centimetre
EMMO 1f1b164d ec6a 4faa 8d5e 88bda62316cc: http://qudt.org/vocab/unit/KiloGM-PER-CentiM2
EMMO 33ae2d07 5526 4555 a0b4 8f4c031b5652: kg.cm-2
EMMO 7f1dec83 d85e 4e1b b7bd c9442d4f5a64: kg/cm²
EMMO 967080e5 2f42 4eb2 a3a9 c58143e835f9: SI base unit kilogram divided by the 0.0001-fold of the power of the SI base unit metre by exponent 2 -- QUDT

SpeedOfLightInVacuum
type: Class
comment: The speed of light in vacuum. Defines the base unit metre in the SI system.
EMMO 1f1b164d ec6a 4faa 8d5e 88bda62316cc: http://qudt.org/vocab/constant/SpeedOfLight_Vacuum
EMMO 8de5d5bf db1c 40ac b698 095ba3b18578: 6-35.2
EMMO 967080e5 2f42 4eb2 a3a9 c58143e835f9: The speed of light in vacuum. Defines the base unit metre in the SI system.
EMMO fe015383 afb3 44a6 ae86 043628697aa2: https://doi.org/10.1351/goldbook.S05854

CoherenceLength
type: Class
comment: Distance in a superconductor over which the effect of a perturbation is appreciable at zero thermodynamic temperature
EMMO 26bf1bef d192 4da6 b0eb d2209698fb54: https://www.wikidata.org/wiki/Q1778793
EMMO 8de5d5bf db1c 40ac b698 095ba3b18578: 12-38.2
EMMO 967080e5 2f42 4eb2 a3a9 c58143e835f9: Distance in a superconductor over which the effect of a perturbation is appreciable at zero thermodynamic temperature

NewtonPerSquareMilliMetre
type: Class
subclass of: Restriction
  has value: 1000000.0
subclass of: Restriction
  has value: 0.0
comment: SI derived unit newton divided by the 0.000001-fold of the power of the SI base unit metre with the exponent 2 -- QUDT
alternative label: Newton Per Square Millimetre
EMMO 1f1b164d ec6a 4faa 8d5e 88bda62316cc: http://qudt.org/vocab/unit/N-PER-MilliM2
EMMO 33ae2d07 5526 4555 a0b4 8f4c031b5652: N.mm-2
EMMO 7f1dec83 d85e 4e1b b7bd c9442d4f5a64: N/mm²
EMMO 967080e5 2f42 4eb2 a3a9 c58143e835f9: SI derived unit newton divided by the 0.000001-fold of the power of the SI base unit metre with the exponent 2 -- QUDT

CarbonAtom
type: Class
subclass of: Restriction
subclass of: Restriction
  has value: 12.011
subclass of: Restriction
  has value: 6
comment: Atom subclass for carbon.
EMMO 967080e5 2f42 4eb2 a3a9 c58143e835f9: Atom subclass for carbon.

Susceptance
type: Class
comment: Imaginary part of the admittance.
EMMO 1f1b164d ec6a 4faa 8d5e 88bda62316cc: https://qudt.org/vocab/quantitykind/Susceptance
EMMO 26bf1bef d192 4da6 b0eb d2209698fb54: https://www.wikidata.org/wiki/Q509598
EMMO 50c298c2 55a2 4068 b3ac 4e948c33181f: https://www.electropedia.org/iev/iev.nsf/display
EMMO 8de5d5bf db1c 40ac b698 095ba3b18578: 6-52.3
EMMO 967080e5 2f42 4eb2 a3a9 c58143e835f9: Imaginary part of the admittance.

Verifying
type: Class
comment: A semiosis where an interpretant, already present in the internal representational space of the interpreter, is resolved by the interpreter by identifying the referent, i.e. the entity for which the sign stands for according to the interpreter understanding.
EMMO 967080e5 2f42 4eb2 a3a9 c58143e835f9: A semiosis where an interpretant, already present in the internal representational space of the interpreter, is resolved by the interpreter by identifying the referent, i.e. the entity for which the sign stands for according to the interpreter understanding.

SpecificHeatCapacityAtSaturatedVaporPressure
type: Class
comment: Specific heat capacity at saturated vaport pressure.
EMMO 1f1b164d ec6a 4faa 8d5e 88bda62316cc: https://qudt.org/vocab/quantitykind/SpecificHeatCapacityAtSaturation
EMMO 26bf1bef d192 4da6 b0eb d2209698fb54: https://www.wikidata.org/wiki/Q75775005
EMMO 8de5d5bf db1c 40ac b698 095ba3b18578: 5-16.4
EMMO 967080e5 2f42 4eb2 a3a9 c58143e835f9: Specific heat capacity at saturated vaport pressure.

Constant
type: Class
comment: A variable that stand for a numerical constant, even if it is unknown.
EMMO 967080e5 2f42 4eb2 a3a9 c58143e835f9: A variable that stand for a numerical constant, even if it is unknown.

MeanLinearRange
type: Class
comment: Mean total rectified path length travelled by a particle in the course of slowing down to rest in a given material averaged over a group of particles having the same initial energy.
EMMO 1f1b164d ec6a 4faa 8d5e 88bda62316cc: https://qudt.org/vocab/quantitykind/MeanLinearRange
EMMO 26bf1bef d192 4da6 b0eb d2209698fb54: https://www.wikidata.org/wiki/Q98681589
EMMO 8de5d5bf db1c 40ac b698 095ba3b18578: 10-56
EMMO 967080e5 2f42 4eb2 a3a9 c58143e835f9: Mean total rectified path length travelled by a particle in the course of slowing down to rest in a given material averaged over a group of particles having the same initial energy.
EMMO fe015383 afb3 44a6 ae86 043628697aa2: https://doi.org/10.1351/goldbook.M03782

CubicDeciMetrePerSecond
type: Class
subclass of: Restriction
  has value: 0.001
subclass of: Restriction
  has value: 0.0
comment: 0,001-fold of the power of the SI base unit metre with the exponent 3 divided by the unit for time second -- QUDT
alternative label: Cubic Decimetre Per Second
EMMO 1f1b164d ec6a 4faa 8d5e 88bda62316cc: http://qudt.org/vocab/unit/DeciM3-PER-SEC
EMMO 33ae2d07 5526 4555 a0b4 8f4c031b5652: dm3.s-1
EMMO 33ae2d07 5526 4555 a0b4 8f4c031b5652: dm3/s
EMMO 7f1dec83 d85e 4e1b b7bd c9442d4f5a64: dm³/s
EMMO 967080e5 2f42 4eb2 a3a9 c58143e835f9: 0,001-fold of the power of the SI base unit metre with the exponent 3 divided by the unit for time second -- QUDT

PolymericMaterial
type: Class

MilliSiemensPerCentiMetre
type: Class
subclass of: Restriction
  some values from: SiemensPerCentiMetre
subclass of: Restriction
  has value: 0.1
subclass of: Restriction
  has value: 0.0
comment: 0.001-fold of the SI derived unit Siemens divided by the 0.01-fold of the SI base unit metre -- QUDT
alternative label: Millisiemens Per Centimetre
EMMO 1f1b164d ec6a 4faa 8d5e 88bda62316cc: http://qudt.org/vocab/unit/MilliS-PER-CentiM
EMMO 33ae2d07 5526 4555 a0b4 8f4c031b5652: mS.cm-1
EMMO 33ae2d07 5526 4555 a0b4 8f4c031b5652: mS/cm
EMMO 7f1dec83 d85e 4e1b b7bd c9442d4f5a64: mS/cm
EMMO 967080e5 2f42 4eb2 a3a9 c58143e835f9: 0.001-fold of the SI derived unit Siemens divided by the 0.01-fold of the SI base unit metre -- QUDT

CaliforniumSymbol
type: Class
subclass of: Restriction
  has value: Cf
comment: The symbol that stands for the californium atom.
EMMO 967080e5 2f42 4eb2 a3a9 c58143e835f9: The symbol that stands for the californium atom.

CaesiumAtom
type: Class
subclass of: Restriction
subclass of: Restriction
  has value: 132.90545196
subclass of: Restriction
  has value: 55
comment: Atom subclass for caesium.
EMMO 967080e5 2f42 4eb2 a3a9 c58143e835f9: Atom subclass for caesium.

ManufacturedMaterial
type: Class
equivalent class: Class
subclass of: Restriction
comment: A material that is obtained through a manufacturing process.
alternative label: EngineeredMaterial
alternative label: ProcessedMaterial
EMMO 967080e5 2f42 4eb2 a3a9 c58143e835f9: A material that is obtained through a manufacturing process.

NumberOfElements
type: Class
subclass of: Restriction
comment: Number of direct parts of a Reductionistic.
comment: Using direct parthood EMMO creates a well-defined broadcasting between granularity levels. This also make it possible to count the direct parts of each granularity level.
EMMO 967080e5 2f42 4eb2 a3a9 c58143e835f9: Number of direct parts of a Reductionistic.

Interaction
type: Class
comment: A causal interaction is a fundamental causal system that can be represented as a complete bipartite directed graph K(m,n), when m,n>1
EMMO 31252f35 c767 4b97 a877 1235076c3e13: A causal interaction is a fundamental causal system that can be represented as a complete bipartite directed graph K(m,n), when m,n>1

SurfaceTension
type: Class
subclass of: Restriction
alternative label: 4-26
EMMO 1f1b164d ec6a 4faa 8d5e 88bda62316cc: https://qudt.org/vocab/quantitykind/SurfaceTension
EMMO 26bf1bef d192 4da6 b0eb d2209698fb54: https://www.wikidata.org/wiki/Q170749
EMMO 50c298c2 55a2 4068 b3ac 4e948c33181f: https://www.electropedia.org/iev/iev.nsf/display
EMMO fe015383 afb3 44a6 ae86 043628697aa2: https://doi.org/10.1351/goldbook.S06192

OxygenSymbol
type: Class
subclass of: Restriction
  has value: O
comment: The symbol that stands for the oxygen atom.
EMMO 967080e5 2f42 4eb2 a3a9 c58143e835f9: The symbol that stands for the oxygen atom.

BecquerelPerCubicMetre
type: Class
subclass of: Restriction
  has value: 1.0
subclass of: Restriction
  has value: 0.0
comment: The SI derived unit of unit in the category of Radioactivity concentration. -- QUDT
alternative label: Becquerel per Cubic Metre
EMMO 1f1b164d ec6a 4faa 8d5e 88bda62316cc: http://qudt.org/vocab/unit/BQ-PER-M3
EMMO 33ae2d07 5526 4555 a0b4 8f4c031b5652: Bq.m-3
EMMO 33ae2d07 5526 4555 a0b4 8f4c031b5652: Bq/m3
EMMO 7f1dec83 d85e 4e1b b7bd c9442d4f5a64: Bq/m³
EMMO 967080e5 2f42 4eb2 a3a9 c58143e835f9: The SI derived unit of unit in the category of Radioactivity concentration. -- QUDT

PicoGramPerGram
type: Class
subclass of: Restriction
  some values from: GramPerGram
subclass of: Restriction
  has value: 1e-12
subclass of: Restriction
  has value: 0.0
comment: One part per 10**12 (trillion) by mass of the measurand in the matrix. -- QUDT
alternative label: Picograms per gram
EMMO 1f1b164d ec6a 4faa 8d5e 88bda62316cc: http://qudt.org/vocab/unit/PicoGM-PER-GM
EMMO 33ae2d07 5526 4555 a0b4 8f4c031b5652: pg.g-1
EMMO 7f1dec83 d85e 4e1b b7bd c9442d4f5a64: pg/g
EMMO 967080e5 2f42 4eb2 a3a9 c58143e835f9: One part per 10**12 (trillion) by mass of the measurand in the matrix. -- QUDT

SlowingDownDensity
type: Class
subclass of: Restriction
comment: Number of slowed-down particles per time and volume.
EMMO 1f1b164d ec6a 4faa 8d5e 88bda62316cc: https://qudt.org/vocab/quantitykind/Slowing-DownDensity
EMMO 26bf1bef d192 4da6 b0eb d2209698fb54: https://www.wikidata.org/wiki/Q98915830
EMMO 8de5d5bf db1c 40ac b698 095ba3b18578: 10-67
EMMO 967080e5 2f42 4eb2 a3a9 c58143e835f9: Number of slowed-down particles per time and volume.

KiloPascal
type: Class
subclass of: Restriction
  some values from: Pascal
subclass of: Restriction
  has value: 1000.0
subclass of: Restriction
  has value: 0.0
comment: Kilopascal is a unit of pressure. 1 kPa is approximately the pressure exerted by a 10-g mass resting on a 1-cm2 area. 101.3 kPa = 1 atm. There are 1,000 pascals in 1 kilopascal. -- QUDT
EMMO 1f1b164d ec6a 4faa 8d5e 88bda62316cc: http://qudt.org/vocab/unit/KiloPA
EMMO 33ae2d07 5526 4555 a0b4 8f4c031b5652: kPa
EMMO 7f1dec83 d85e 4e1b b7bd c9442d4f5a64: kPa
EMMO 967080e5 2f42 4eb2 a3a9 c58143e835f9: Kilopascal is a unit of pressure. 1 kPa is approximately the pressure exerted by a 10-g mass resting on a 1-cm2 area. 101.3 kPa = 1 atm. There are 1,000 pascals in 1 kilopascal. -- QUDT

CuriumSymbol
type: Class
subclass of: Restriction
  has value: Cm
comment: The symbol that stands for the curium atom.
EMMO 967080e5 2f42 4eb2 a3a9 c58143e835f9: The symbol that stands for the curium atom.

RichardsonConstant
type: Class
subclass of: Restriction
comment: Parameter in the expression for the thermionic emission current density J for a metal in terms of the thermodynamic temperature T and work function.
EMMO 1f1b164d ec6a 4faa 8d5e 88bda62316cc: https://qudt.org/vocab/quantitykind/RichardsonConstant
EMMO 26bf1bef d192 4da6 b0eb d2209698fb54: https://www.wikidata.org/wiki/Q105883079
EMMO 50c298c2 55a2 4068 b3ac 4e948c33181f: https://www.electropedia.org/iev/iev.nsf/display
EMMO 8de5d5bf db1c 40ac b698 095ba3b18578: 12-26
EMMO 967080e5 2f42 4eb2 a3a9 c58143e835f9: Parameter in the expression for the thermionic emission current density J for a metal in terms of the thermodynamic temperature T and work function.

SolidAngle
type: Class
comment: Ratio of area on a sphere to its radius squared.
EMMO 1f1b164d ec6a 4faa 8d5e 88bda62316cc: http://qudt.org/vocab/quantitykind/SolidAngle
EMMO 8de5d5bf db1c 40ac b698 095ba3b18578: 3-6
EMMO 967080e5 2f42 4eb2 a3a9 c58143e835f9: Ratio of area on a sphere to its radius squared.
EMMO fe015383 afb3 44a6 ae86 043628697aa2: https://doi.org/10.1351/goldbook.S05732

MicroSiemensPerCentiMetre
type: Class
subclass of: Restriction
  has value: 0.0001
subclass of: Restriction
  has value: 0.0
comment: 0.000001-fold of the SI derived unit Siemens divided by the 0.01-fold of the SI base unit metre -- QUDT
alternative label: Microsiemens Per Centimetre
EMMO 1f1b164d ec6a 4faa 8d5e 88bda62316cc: http://qudt.org/vocab/unit/MicroS-PER-CentiM
EMMO 33ae2d07 5526 4555 a0b4 8f4c031b5652: uS.cm-1
EMMO 7f1dec83 d85e 4e1b b7bd c9442d4f5a64: μS/cm
EMMO 967080e5 2f42 4eb2 a3a9 c58143e835f9: 0.000001-fold of the SI derived unit Siemens divided by the 0.01-fold of the SI base unit metre -- QUDT

JSONData
type: Class

RelativeHumidity
type: Class
comment: Ratio of the partial pressure p of water vapour in moist air to its partial pressure psat at saturation, at the same temperature φ = p/psat.
comment: The relative humidity is often expressed in per cent.
EMMO 1f1b164d ec6a 4faa 8d5e 88bda62316cc: https://qudt.org/vocab/quantitykind/RelativeHumidity
EMMO 26bf1bef d192 4da6 b0eb d2209698fb54: https://www.wikidata.org/wiki/Q2499617
EMMO 50c298c2 55a2 4068 b3ac 4e948c33181f: https://www.electropedia.org/iev/iev.nsf/display
EMMO 8de5d5bf db1c 40ac b698 095ba3b18578: 5-33
EMMO 967080e5 2f42 4eb2 a3a9 c58143e835f9: Ratio of the partial pressure p of water vapour in moist air to its partial pressure psat at saturation, at the same temperature φ = p/psat.
EMMO c84c6752 6d64 48cc 9500 e54a3c34898d: https://en.wikipedia.org/wiki/Humidity#Relative_humidity

JoulePerSquareTesla
type: Class
subclass of: Restriction
  has value: 1.0
subclass of: Restriction
  has value: 0.0
comment: A measure of the diamagnetic energy, for a Bohr-radius spread around a magnetic axis, per square Tesla. -- QUDT
alternative label: Joule per Square Tesla
EMMO 1f1b164d ec6a 4faa 8d5e 88bda62316cc: http://qudt.org/vocab/unit/J-PER-T2
EMMO 33ae2d07 5526 4555 a0b4 8f4c031b5652: J.T-2
EMMO 7f1dec83 d85e 4e1b b7bd c9442d4f5a64: J/T²
EMMO 967080e5 2f42 4eb2 a3a9 c58143e835f9: A measure of the diamagnetic energy, for a Bohr-radius spread around a magnetic axis, per square Tesla. -- QUDT

ThermoelectricVoltage
type: Class
comment: Voltage between substances a and b caused by the thermoelectric effect.
EMMO 26bf1bef d192 4da6 b0eb d2209698fb54: https://www.wikidata.org/wiki/Q105761637
EMMO 8de5d5bf db1c 40ac b698 095ba3b18578: 12-20
EMMO 967080e5 2f42 4eb2 a3a9 c58143e835f9: Voltage between substances a and b caused by the thermoelectric effect.

StandardAbsoluteActivityOfMixture
type: Class
comment: For a substance in a mixture, the absolute activity of the pure substance at the same temperature but at standard pressure.
alternative label: StandardAbsoluteActivity
EMMO 1f1b164d ec6a 4faa 8d5e 88bda62316cc: https://qudt.org/vocab/quantitykind/StandardAbsoluteActivity
EMMO 26bf1bef d192 4da6 b0eb d2209698fb54: https://www.wikidata.org/wiki/Q89406159
EMMO 8de5d5bf db1c 40ac b698 095ba3b18578: 9-23
EMMO 967080e5 2f42 4eb2 a3a9 c58143e835f9: For a substance in a mixture, the absolute activity of the pure substance at the same temperature but at standard pressure.

MegaWatt
type: Class
subclass of: Restriction
  some values from: Watt
subclass of: Restriction
  has value: 1000000.0
subclass of: Restriction
  has value: 0.0
comment: Unit for power; 1 000 000 watt.
EMMO 1f1b164d ec6a 4faa 8d5e 88bda62316cc: http://qudt.org/vocab/unit/MegaW
EMMO 33ae2d07 5526 4555 a0b4 8f4c031b5652: MW
EMMO 7f1dec83 d85e 4e1b b7bd c9442d4f5a64: MW
EMMO 967080e5 2f42 4eb2 a3a9 c58143e835f9: Unit for power; 1 000 000 watt.

MegaAmpere
type: Class
subclass of: Restriction
  some values from: Ampere
subclass of: Restriction
  has value: 1000000.0
subclass of: Restriction
  has value: 0.0
comment: 1 000 000-fold of the SI base unit ampere -- QUDT
EMMO 1f1b164d ec6a 4faa 8d5e 88bda62316cc: http://qudt.org/vocab/unit/MegaA
EMMO 33ae2d07 5526 4555 a0b4 8f4c031b5652: MA
EMMO 7f1dec83 d85e 4e1b b7bd c9442d4f5a64: MA
EMMO 967080e5 2f42 4eb2 a3a9 c58143e835f9: 1 000 000-fold of the SI base unit ampere -- QUDT

JoulePerMoleKelvin
type: Class
subclass of: Restriction
  has value: 1.0
subclass of: Restriction
  has value: 0.0
comment: Energy needed to heat one mole of substance by 1 Kelvin, under standard conditions (not standard temperature and pressure STP). The standard molar entropy is usually given the symbol S, and has units of joules per mole kelvin ( J· mol⁻¹ K⁻¹). Unlike standard enthalpies of formation, the value of S is an absolute. That is, an element in its standard state has a nonzero value of S at room temperature. -- QUDT
alternative label: Joule per Mole Kelvin
EMMO 1f1b164d ec6a 4faa 8d5e 88bda62316cc: http://qudt.org/vocab/unit/J-PER-MOL-K
EMMO 33ae2d07 5526 4555 a0b4 8f4c031b5652: J.mol-1.K-1
EMMO 7f1dec83 d85e 4e1b b7bd c9442d4f5a64: J/(mol⋅K)
EMMO 967080e5 2f42 4eb2 a3a9 c58143e835f9: Energy needed to heat one mole of substance by 1 Kelvin, under standard conditions (not standard temperature and pressure STP). The standard molar entropy is usually given the symbol S, and has units of joules per mole kelvin ( J· mol⁻¹ K⁻¹). Unlike standard enthalpies of formation, the value of S is an absolute. That is, an element in its standard state has a nonzero value of S at room temperature. -- QUDT

Cleaning
type: Class
comment: Process for removing unwanted residual or waste material from a given product or material

Enthalpy
type: Class
comment: Measurement of energy in a thermodynamic system.
EMMO 1f1b164d ec6a 4faa 8d5e 88bda62316cc: http://qudt.org/vocab/quantitykind/Enthalpy
EMMO 8de5d5bf db1c 40ac b698 095ba3b18578: 5.20-3
EMMO 967080e5 2f42 4eb2 a3a9 c58143e835f9: Measurement of energy in a thermodynamic system.
EMMO fe015383 afb3 44a6 ae86 043628697aa2: https://doi.org/10.1351/goldbook.E02141

MilliCoulombPerKilogram
type: Class
subclass of: Restriction
  some values from: CoulombPerKilogram
subclass of: Restriction
  has value: 0.001
subclass of: Restriction
  has value: 0.0
comment: 0.001-fold of the SI derived unit coulomb divided by the SI base unit kilogram -- QUDT
alternative label: Millicoulomb Per Kilogram
EMMO 1f1b164d ec6a 4faa 8d5e 88bda62316cc: http://qudt.org/vocab/unit/MilliC-PER-KiloGM
EMMO 33ae2d07 5526 4555 a0b4 8f4c031b5652: mC.kg-1
EMMO 7f1dec83 d85e 4e1b b7bd c9442d4f5a64: mC/kg
EMMO 967080e5 2f42 4eb2 a3a9 c58143e835f9: 0.001-fold of the SI derived unit coulomb divided by the SI base unit kilogram -- QUDT

CoulombPerMetre
type: Class
subclass of: Restriction
  has value: 1.0
subclass of: Restriction
  has value: 0.0
comment: "Coulomb per Meter" is a unit for 'Electric Charge Line Density' expressed as C/m. -- QUDT
alternative label: Coulomb per Metre
EMMO 1f1b164d ec6a 4faa 8d5e 88bda62316cc: http://qudt.org/vocab/unit/C-PER-M
EMMO 33ae2d07 5526 4555 a0b4 8f4c031b5652: C.m-1
EMMO 33ae2d07 5526 4555 a0b4 8f4c031b5652: C/m
EMMO 7f1dec83 d85e 4e1b b7bd c9442d4f5a64: C/m
EMMO 967080e5 2f42 4eb2 a3a9 c58143e835f9: "Coulomb per Meter" is a unit for 'Electric Charge Line Density' expressed as C/m. -- QUDT

Observer
type: Class
subclass of: Restriction
comment: A characteriser that declares a property for an object through the specific interaction required by the property definition.
EMMO 967080e5 2f42 4eb2 a3a9 c58143e835f9: A characteriser that declares a property for an object through the specific interaction required by the property definition.

KelvinSquareMetrePerKilogramPerSecond
type: Class
subclass of: Restriction
  has value: 1.0
subclass of: Restriction
  has value: 0.0
comment: Kelvin square metres per kilogram and second.
EMMO 1f1b164d ec6a 4faa 8d5e 88bda62316cc: http://qudt.org/vocab/unit/K-M2-PER-KiloGM-SEC
EMMO 33ae2d07 5526 4555 a0b4 8f4c031b5652: K.m2.kg-1.s-1
EMMO 7f1dec83 d85e 4e1b b7bd c9442d4f5a64: K⋅m²/(kg⋅s)
EMMO 967080e5 2f42 4eb2 a3a9 c58143e835f9: Kelvin square metres per kilogram and second.

TemperatureAreaPerMassTimeUnit
type: Class
subclass of: Restriction
  has value: T-1 L+2 M-1 I0 Θ+1 N0 J0
comment: The class of units with dimensionality 'TemperatureAreaPerMassTime'.
EMMO 967080e5 2f42 4eb2 a3a9 c58143e835f9: The class of units with dimensionality 'TemperatureAreaPerMassTime'.

NanoTesla
type: Class
subclass of: Restriction
  some values from: Tesla
subclass of: Restriction
  has value: 1e-09
subclass of: Restriction
  has value: 0.0
comment: 0.000000001-fold of the SI derived unit tesla -- QUDT
EMMO 1f1b164d ec6a 4faa 8d5e 88bda62316cc: http://qudt.org/vocab/unit/NanoT
EMMO 33ae2d07 5526 4555 a0b4 8f4c031b5652: nT
EMMO 7f1dec83 d85e 4e1b b7bd c9442d4f5a64: nT
EMMO 967080e5 2f42 4eb2 a3a9 c58143e835f9: 0.000000001-fold of the SI derived unit tesla -- QUDT

CeriumSymbol
type: Class
subclass of: Restriction
  has value: Ce
comment: The symbol that stands for the cerium atom.
EMMO 967080e5 2f42 4eb2 a3a9 c58143e835f9: The symbol that stands for the cerium atom.

DebyeTemperature
type: Class
EMMO 1f1b164d ec6a 4faa 8d5e 88bda62316cc: https://qudt.org/vocab/quantitykind/DebyeTemperature
EMMO 26bf1bef d192 4da6 b0eb d2209698fb54: https://www.wikidata.org/wiki/Q3517821
EMMO 8de5d5bf db1c 40ac b698 095ba3b18578: 12-11

ThermodynamicTemperature
type: Class
subclass of: Restriction
comment: Thermodynamic temperature is the absolute measure of temperature. It is defined by the third law of thermodynamics in which the theoretically lowest temperature is the null or zero point.
alternative label: Temperature
EMMO 1f1b164d ec6a 4faa 8d5e 88bda62316cc: http://qudt.org/vocab/quantitykind/ThermodynamicTemperature
EMMO 8de5d5bf db1c 40ac b698 095ba3b18578: 5-1
EMMO 967080e5 2f42 4eb2 a3a9 c58143e835f9: Thermodynamic temperature is the absolute measure of temperature. It is defined by the third law of thermodynamics in which the theoretically lowest temperature is the null or zero point.
EMMO fe015383 afb3 44a6 ae86 043628697aa2: https://doi.org/10.1351/goldbook.T06321

AntiMatter
type: Class
comment: Antimatter is matter that is composed only of the antiparticles of those that constitute ordinary matter.
comment: This branch is not expanded due to the limited use of such entities.
EMMO 967080e5 2f42 4eb2 a3a9 c58143e835f9: Antimatter is matter that is composed only of the antiparticles of those that constitute ordinary matter.
EMMO c7b62dd7 063a 4c2a 8504 42f7264ba83f: This branch is not expanded due to the limited use of such entities.

HalfValueThickness
type: Class
comment: Thickness of the attenuating layer that reduces the quantity of interest of a unidirectional beam of infinitesimal width to half of its initial value.
EMMO 1f1b164d ec6a 4faa 8d5e 88bda62316cc: https://qudt.org/vocab/quantitykind/Half-ValueThickness
EMMO 26bf1bef d192 4da6 b0eb d2209698fb54: https://www.wikidata.org/wiki/Q127526
EMMO 50c298c2 55a2 4068 b3ac 4e948c33181f: https://www.electropedia.org/iev/iev.nsf/display
EMMO 8de5d5bf db1c 40ac b698 095ba3b18578: 10-53
EMMO 967080e5 2f42 4eb2 a3a9 c58143e835f9: Thickness of the attenuating layer that reduces the quantity of interest of a unidirectional beam of infinitesimal width to half of its initial value.

PhysicalConstant
type: Class
comment: Physical constants are categorised into "exact" and measured constants. With "exact" constants, we refer to physical constants that have an exact numerical value after the revision of the SI system that was enforsed May 2019.
EMMO 8a137e9f 579c 4e28 baca e8980eb0c3db: DisjointUnionOf: MeasuredConstant, ExactConstant
EMMO 967080e5 2f42 4eb2 a3a9 c58143e835f9: Physical constants are categorised into "exact" and measured constants. With "exact" constants, we refer to physical constants that have an exact numerical value after the revision of the SI system that was enforsed May 2019.
EMMO c84c6752 6d64 48cc 9500 e54a3c34898d: https://en.wikipedia.org/wiki/List_of_physical_constants

MultiParticlePath
type: Class
comment: A chausal path whose quantum parts belongs to at least two different standard model fundamental types.
comment: An multi-particle path is a causal path of quantum entities of different type, following the causal connection between an initial quantum up to the final one, regardless on the fact that causality is passing through elementary particles of different types. For example, a path starting from an elementary photon, then through the electron with which it scatter, and then trough a positron with which the electron collides.
EMMO 31252f35 c767 4b97 a877 1235076c3e13: An multi-particle path is a causal path of quantum entities of different type, following the causal connection between an initial quantum up to the final one, regardless on the fact that causality is passing through elementary particles of different types. For example, a path starting from an elementary photon, then through the electron with which it scatter, and then trough a positron with which the electron collides.
EMMO 967080e5 2f42 4eb2 a3a9 c58143e835f9: A chausal path whose quantum parts belongs to at least two different standard model fundamental types.

CubicCoulombMetrePerSquareJoule
type: Class
subclass of: Restriction
  has value: 1.0
subclass of: Restriction
  has value: 0.0
comment: "Cubic Coulomb Meter per Square Joule" is a unit for 'Cubic Electric Dipole Moment Per Square Energy' expressed as C³ m³ J⁻². -- QUDT
alternative label: Cubic Coulomb Metre per Square Joule
EMMO 1f1b164d ec6a 4faa 8d5e 88bda62316cc: http://qudt.org/vocab/unit/C3-M-PER-J2
EMMO 33ae2d07 5526 4555 a0b4 8f4c031b5652: C3.m.J-2
EMMO 33ae2d07 5526 4555 a0b4 8f4c031b5652: C3.m/J2
EMMO 7f1dec83 d85e 4e1b b7bd c9442d4f5a64: C³⋅m/J²
EMMO 967080e5 2f42 4eb2 a3a9 c58143e835f9: "Cubic Coulomb Meter per Square Joule" is a unit for 'Cubic Electric Dipole Moment Per Square Energy' expressed as C³ m³ J⁻². -- QUDT

CubicElectricChargeLengthPerSquareEnergyUnit
type: Class
subclass of: Restriction
  has value: T+7 L-3 M-2 I+3 Θ0 N0 J0
comment: The class of units with dimensionality 'CubicElectricChargeLengthPerSquareEnergy'.
EMMO 967080e5 2f42 4eb2 a3a9 c58143e835f9: The class of units with dimensionality 'CubicElectricChargeLengthPerSquareEnergy'.

SiliconAtom
type: Class
subclass of: Restriction
subclass of: Restriction
  has value: 28.085
subclass of: Restriction
  has value: 14
comment: Atom subclass for silicon.
EMMO 967080e5 2f42 4eb2 a3a9 c58143e835f9: Atom subclass for silicon.

Gathering
type: Class
comment: A mixed tiling in which a tile is the next of spatially connected tiles.
EMMO 967080e5 2f42 4eb2 a3a9 c58143e835f9: A mixed tiling in which a tile is the next of spatially connected tiles.

InChI
type: Class
comment: The International Chemical Identifier (InChI) textual identifier proposed by IUPAC to provide a standard encoding for databases of molecular information.
EMMO 967080e5 2f42 4eb2 a3a9 c58143e835f9: The International Chemical Identifier (InChI) textual identifier proposed by IUPAC to provide a standard encoding for databases of molecular information.

SerialTask
type: Class
comment: A task that is a temporal tile of a workflow when there are no other activities taking place concurrently (i.e., no parallelism).
EMMO 967080e5 2f42 4eb2 a3a9 c58143e835f9: A task that is a temporal tile of a workflow when there are no other activities taking place concurrently (i.e., no parallelism).

NumericalData
type: Class
comment: Data that can be decoded under a quantitative schema and also associated with a graphical number symbols.
EMMO 967080e5 2f42 4eb2 a3a9 c58143e835f9: Data that can be decoded under a quantitative schema and also associated with a graphical number symbols.

DataByNumerical
type: Class

DrawForming
type: Class
comment: Draw forming by drawing a workpiece through a tool opening that is narrowed in the drawing direction.

Hectare
type: Class
subclass of: Restriction
  has value: 10000.0
subclass of: Restriction
  has value: 0.0
subclass of: Restriction
  has value: ha
comment: A non-SI metric unit of area defined as the square with 100-metre sides.
comment: The customary metric unit of land area, equal to 100 ares. One hectare is a square hectometer, that is, the area of a square 100 meters on each side: exactly 10 000 square meters or approximately 107 639.1 square feet, 11 959.9 square yards, or 2.471 054 acres. -- QUDT
EMMO 0b1cbe60 d380 4787 b92e be26bdacf2c2: HAR
EMMO 1f1b164d ec6a 4faa 8d5e 88bda62316cc: http://qudt.org/vocab/unit/HA
EMMO 33ae2d07 5526 4555 a0b4 8f4c031b5652: har
EMMO 6dd685dd 1895 46e4 b227 be9f7d643c25: http://dbpedia.org/page/Hectare
EMMO 70fe84ff 99b6 4206 a9fc 9a8931836d84: A non-SI metric unit of area defined as the square with 100-metre sides.
EMMO 967080e5 2f42 4eb2 a3a9 c58143e835f9: The customary metric unit of land area, equal to 100 ares. One hectare is a square hectometer, that is, the area of a square 100 meters on each side: exactly 10 000 square meters or approximately 107 639.1 square feet, 11 959.9 square yards, or 2.471 054 acres. -- QUDT
EMMO c84c6752 6d64 48cc 9500 e54a3c34898d: https://en.wikipedia.org/wiki/Hectare

MassNumber
type: Class
subclass of: Restriction
comment: Number of nucleons in an atomic nucleus.
alternative label: AtomicMassNumber
alternative label: NucleonNumber
EMMO 1f1b164d ec6a 4faa 8d5e 88bda62316cc: http://qudt.org/vocab/quantitykind/MassNumber
EMMO 967080e5 2f42 4eb2 a3a9 c58143e835f9: Number of nucleons in an atomic nucleus.

FermiTemperature
type: Class
comment: in the free electron model, the Fermi energy divided by the Boltzmann constant
EMMO 1f1b164d ec6a 4faa 8d5e 88bda62316cc: https://qudt.org/vocab/quantitykind/FermiTemperature
EMMO 26bf1bef d192 4da6 b0eb d2209698fb54: https://www.wikidata.org/wiki/Q105942324
EMMO 8de5d5bf db1c 40ac b698 095ba3b18578: 12-28
EMMO 967080e5 2f42 4eb2 a3a9 c58143e835f9: in the free electron model, the Fermi energy divided by the Boltzmann constant

MetreKelvin
type: Class
subclass of: Restriction
  has value: 1.0
subclass of: Restriction
  has value: 0.0
comment: `Meter Kelvin` is a unit for 'Length Temperature' expressed as m K. -- QUDT
alternative label: Metre Kelvin
EMMO 1f1b164d ec6a 4faa 8d5e 88bda62316cc: http://qudt.org/vocab/unit/M-K
EMMO 33ae2d07 5526 4555 a0b4 8f4c031b5652: m.K
EMMO 7f1dec83 d85e 4e1b b7bd c9442d4f5a64: m⋅K
EMMO 967080e5 2f42 4eb2 a3a9 c58143e835f9: `Meter Kelvin` is a unit for 'Length Temperature' expressed as m K. -- QUDT

KilogramPerMilliMetre
type: Class
subclass of: Restriction
  has value: 1000.0
subclass of: Restriction
  has value: 0.0
comment: SI base unit kilogram divided by the 0.001-fold of the SI base unit metre -- QUDT
alternative label: Kilogram Per Millimetre
EMMO 1f1b164d ec6a 4faa 8d5e 88bda62316cc: http://qudt.org/vocab/unit/KiloGM-PER-MilliM
EMMO 33ae2d07 5526 4555 a0b4 8f4c031b5652: kg.mm-1
EMMO 7f1dec83 d85e 4e1b b7bd c9442d4f5a64: kg/mm
EMMO 967080e5 2f42 4eb2 a3a9 c58143e835f9: SI base unit kilogram divided by the 0.001-fold of the SI base unit metre -- QUDT

SparkErosion
type: Class
comment: A manufacturing process in which metallic material is anodically dissolved under the influence of an electric current and an electrolyte solution. The current flow can be caused either by connection to an external current source or due to local element formation on the workpiece (etching).
alternative label: elektrochemisches Abtragen

Vergence
type: Class
subclass of: Restriction
comment: In geometrical optics, vergence describes the curvature of optical wavefronts.
EMMO 1f1b164d ec6a 4faa 8d5e 88bda62316cc: http://qudt.org/vocab/quantitykind/Curvature
EMMO 967080e5 2f42 4eb2 a3a9 c58143e835f9: In geometrical optics, vergence describes the curvature of optical wavefronts.

Unknown
type: Class
comment: The dependent variable for which an equation has been written.
example: Velocity, for the Navier-Stokes equation.
EMMO 967080e5 2f42 4eb2 a3a9 c58143e835f9: The dependent variable for which an equation has been written.

DecaCoulomb
type: Class
subclass of: Restriction
  some values from: Coulomb
subclass of: Restriction
  has value: 10.0
subclass of: Restriction
  has value: 0.0
comment: A DecaCoulomb is 10 C. -- QUDT
EMMO 1f1b164d ec6a 4faa 8d5e 88bda62316cc: http://qudt.org/vocab/unit/DecaC
EMMO 33ae2d07 5526 4555 a0b4 8f4c031b5652: daC
EMMO 7f1dec83 d85e 4e1b b7bd c9442d4f5a64: daC
EMMO 967080e5 2f42 4eb2 a3a9 c58143e835f9: A DecaCoulomb is 10 C. -- QUDT

DateTimeStampData
type: Class
comment: A data that represents instants of time, marked with a particular time zone offset.
EMMO 8a137e9f 579c 4e28 baca e8980eb0c3db: EquivalentTo: hasDataValue some xsd:dateTimeStamp
EMMO 967080e5 2f42 4eb2 a3a9 c58143e835f9: A data that represents instants of time, marked with a particular time zone offset.

DateTimeData
type: Class
comment: A data that represents instants of time, optionally marked with a particular time zone offset.
EMMO 8a137e9f 579c 4e28 baca e8980eb0c3db: EquivalentTo: hasDataValue some xsd:dateTime
EMMO 967080e5 2f42 4eb2 a3a9 c58143e835f9: A data that represents instants of time, optionally marked with a particular time zone offset.

OxidationNumber
type: Class
comment: Charge number that an atom within a molecule would have if all the ligands were removed along with the electron pairs that were shared.
alternative label: OxidationState
EMMO 26bf1bef d192 4da6 b0eb d2209698fb54: https://www.wikidata.org/wiki/Q484152
EMMO 50c298c2 55a2 4068 b3ac 4e948c33181f: https://www.electropedia.org/iev/iev.nsf/display
EMMO 6dd685dd 1895 46e4 b227 be9f7d643c25: https://dbpedia.org/page/Oxidation_state
EMMO 967080e5 2f42 4eb2 a3a9 c58143e835f9: Charge number that an atom within a molecule would have if all the ligands were removed along with the electron pairs that were shared.
EMMO c84c6752 6d64 48cc 9500 e54a3c34898d: https://en.wikipedia.org/wiki/Oxidation_state
EMMO fe015383 afb3 44a6 ae86 043628697aa2: https://doi.org/10.1351/goldbook.O04363

ChargeNumber
type: Class
comment: For a particle, electric charge q divided by elementary charge e.
comment: The charge number of a particle may be presented as a superscript to the symbol of that particle, e.g. H+, He++, Al3+, Cl−, S=, N3−.
comment: The charge number of an electrically charged particle can be positive or negative. The charge number of an electrically neutral particle is zero.
alternative label: IonizationNumber
EMMO 1f1b164d ec6a 4faa 8d5e 88bda62316cc: https://qudt.org/vocab/quantitykind/ChargeNumber
EMMO 26bf1bef d192 4da6 b0eb d2209698fb54: https://www.wikidata.org/wiki/Q1800063
EMMO 50c298c2 55a2 4068 b3ac 4e948c33181f: https://www.electropedia.org/iev/iev.nsf/display
EMMO 6dd685dd 1895 46e4 b227 be9f7d643c25: https://dbpedia.org/page/Charge_number
EMMO 8de5d5bf db1c 40ac b698 095ba3b18578: 10-5.2
EMMO 967080e5 2f42 4eb2 a3a9 c58143e835f9: For a particle, electric charge q divided by elementary charge e.
EMMO c84c6752 6d64 48cc 9500 e54a3c34898d: https://en.wikipedia.org/wiki/Charge_number
EMMO fe015383 afb3 44a6 ae86 043628697aa2: https://doi.org/10.1351/goldbook.C00993

NanoMetre
type: Class
subclass of: Restriction
  some values from: Metre
subclass of: Restriction
  has value: 1e-09
subclass of: Restriction
  has value: 0.0
comment: 0.000000001-fold of the SI base unit metre -- QUDT
EMMO 1f1b164d ec6a 4faa 8d5e 88bda62316cc: http://qudt.org/vocab/unit/NanoM
EMMO 33ae2d07 5526 4555 a0b4 8f4c031b5652: nm
EMMO 7f1dec83 d85e 4e1b b7bd c9442d4f5a64: nM
EMMO 967080e5 2f42 4eb2 a3a9 c58143e835f9: 0.000000001-fold of the SI base unit metre -- QUDT

MilliGramPerSquareCentiMetre
type: Class
subclass of: Restriction
  some values from: GramPerSquareCentiMetre
subclass of: Restriction
  has value: 0.01
subclass of: Restriction
  has value: 0.0
comment: 0.000001-fold of the SI base unit kilogram divided by the 0.0001-fold of the power of the SI base unit metre with the exponent 2 -- QUDT
alternative label: Milligram Per Square Centimetre
EMMO 1f1b164d ec6a 4faa 8d5e 88bda62316cc: http://qudt.org/vocab/unit/MilliGM-PER-CentiM2
EMMO 33ae2d07 5526 4555 a0b4 8f4c031b5652: mg.cm-2
EMMO 7f1dec83 d85e 4e1b b7bd c9442d4f5a64: mg/cm²
EMMO 967080e5 2f42 4eb2 a3a9 c58143e835f9: 0.000001-fold of the SI base unit kilogram divided by the 0.0001-fold of the power of the SI base unit metre with the exponent 2 -- QUDT

Widening
type: Class
comment: Widening is tensile forming to increase the circumference of a hollow body. A distinction is made between: Widening, bulging.
alternative label: Weiten

Vapor
type: Class
comment: A liquid aerosol composed of water droplets in air or another gas.
EMMO 967080e5 2f42 4eb2 a3a9 c58143e835f9: A liquid aerosol composed of water droplets in air or another gas.

TantalumAtom
type: Class
subclass of: Restriction
subclass of: Restriction
  has value: 180.94788
subclass of: Restriction
  has value: 73
comment: Atom subclass for tantalum.
EMMO 967080e5 2f42 4eb2 a3a9 c58143e835f9: Atom subclass for tantalum.

AngularMeasure
type: Class
comment: The abstract notion of angle.
EMMO 1f1b164d ec6a 4faa 8d5e 88bda62316cc: https://qudt.org/vocab/quantitykind/Angle
EMMO 26bf1bef d192 4da6 b0eb d2209698fb54: https://www.wikidata.org/wiki/Q1357788
EMMO 50c298c2 55a2 4068 b3ac 4e948c33181f: https://www.electropedia.org/iev/iev.nsf/display
EMMO 8de5d5bf db1c 40ac b698 095ba3b18578: 3-5
EMMO 967080e5 2f42 4eb2 a3a9 c58143e835f9: The abstract notion of angle.
EMMO fe015383 afb3 44a6 ae86 043628697aa2: https://doi.org/10.1351/goldbook.A00346

FemtoJoule
type: Class
subclass of: Restriction
  some values from: Joule
subclass of: Restriction
  has value: 1e-15
subclass of: Restriction
  has value: 0.0
comment: 0,000 000 000 000 001-fold of the derived SI unit joule -- QUDT
EMMO 1f1b164d ec6a 4faa 8d5e 88bda62316cc: http://qudt.org/vocab/unit/FemtoJ
EMMO 33ae2d07 5526 4555 a0b4 8f4c031b5652: fJ
EMMO 7f1dec83 d85e 4e1b b7bd c9442d4f5a64: fJ
EMMO 967080e5 2f42 4eb2 a3a9 c58143e835f9: 0,000 000 000 000 001-fold of the derived SI unit joule -- QUDT

DecimalData
type: Class
comment: A data representing an arbitrary precision decimal number.
EMMO 8a137e9f 579c 4e28 baca e8980eb0c3db: EquivalentTo: hasDataValue some xsd:decimal
EMMO 967080e5 2f42 4eb2 a3a9 c58143e835f9: A data representing an arbitrary precision decimal number.

AbsoluteHumidity
type: Class
comment: Mass of the contained water vapour per volume.
alternative label: MassConcentrationOfWaterVapour
EMMO 1f1b164d ec6a 4faa 8d5e 88bda62316cc: https://qudt.org/vocab/quantitykind/AbsoluteHumidity
EMMO 1f1b164d ec6a 4faa 8d5e 88bda62316cc: https://qudt.org/vocab/quantitykind/MassConcentrationOfWaterVapour
EMMO 26bf1bef d192 4da6 b0eb d2209698fb54: https://www.wikidata.org/wiki/Q76378808
EMMO 50c298c2 55a2 4068 b3ac 4e948c33181f: https://www.electropedia.org/iev/iev.nsf/display
EMMO 8de5d5bf db1c 40ac b698 095ba3b18578: 5-28
EMMO 967080e5 2f42 4eb2 a3a9 c58143e835f9: Mass of the contained water vapour per volume.

Modeller
type: Class
comment: A estimator that uses modelling to declare a property of an object (i.e. infer a property from other properties).
EMMO 967080e5 2f42 4eb2 a3a9 c58143e835f9: A estimator that uses modelling to declare a property of an object (i.e. infer a property from other properties).

Circle
type: Class
comment: Self-connected one-manyfold.
EMMO 967080e5 2f42 4eb2 a3a9 c58143e835f9: Self-connected one-manyfold.

MicrocanonicalPartitionFunction
type: Class
comment: Number of all quantum states consistent with given energy, volume, and external fields.
EMMO 1f1b164d ec6a 4faa 8d5e 88bda62316cc: https://qudt.org/vocab/quantitykind/MicroCanonicalPartitionFunction
EMMO 26bf1bef d192 4da6 b0eb d2209698fb54: https://www.wikidata.org/wiki/Q96106546
EMMO 8de5d5bf db1c 40ac b698 095ba3b18578: 9-35.1
EMMO 967080e5 2f42 4eb2 a3a9 c58143e835f9: Number of all quantum states consistent with given energy, volume, and external fields.

JoulePerMole
type: Class
subclass of: Restriction
  has value: 1.0
subclass of: Restriction
  has value: 0.0
comment: The joule per mole (symbol: J· mol⁻¹) is an SI derived unit of energy per amount of material. Energy is measured in joules, and the amount of material is measured in moles. Physical quantities measured in J· mol⁻¹) usually describe quantities of energy transferred during phase transformations or chemical reactions. Division by the number of moles facilitates comparison between processes involving different quantities of material and between similar processes involving different types of materials. The meaning of such a quantity is always context-dependent and, particularly for chemical reactions, is dependent on the (possibly arbitrary) definition of a 'mole' for a particular process. -- QUDT
alternative label: Joule per Mole
EMMO 1f1b164d ec6a 4faa 8d5e 88bda62316cc: http://qudt.org/vocab/unit/J-PER-MOL
EMMO 33ae2d07 5526 4555 a0b4 8f4c031b5652: J.mol-1
EMMO 7f1dec83 d85e 4e1b b7bd c9442d4f5a64: J/mol
EMMO 967080e5 2f42 4eb2 a3a9 c58143e835f9: The joule per mole (symbol: J· mol⁻¹) is an SI derived unit of energy per amount of material. Energy is measured in joules, and the amount of material is measured in moles. Physical quantities measured in J· mol⁻¹) usually describe quantities of energy transferred during phase transformations or chemical reactions. Division by the number of moles facilitates comparison between processes involving different quantities of material and between similar processes involving different types of materials. The meaning of such a quantity is always context-dependent and, particularly for chemical reactions, is dependent on the (possibly arbitrary) definition of a 'mole' for a particular process. -- QUDT

Spin
type: Class
comment: Vector quantity expressing the internal angular momentum of a particle or a particle system.
EMMO 1f1b164d ec6a 4faa 8d5e 88bda62316cc: https://qudt.org/vocab/quantitykind/Spin
EMMO 26bf1bef d192 4da6 b0eb d2209698fb54: https://www.wikidata.org/wiki/Q133673
EMMO 50c298c2 55a2 4068 b3ac 4e948c33181f: https://www.electropedia.org/iev/iev.nsf/display
EMMO 8de5d5bf db1c 40ac b698 095ba3b18578: 10-10
EMMO 967080e5 2f42 4eb2 a3a9 c58143e835f9: Vector quantity expressing the internal angular momentum of a particle or a particle system.

MilliAmperePerMilliMetre
type: Class
subclass of: Restriction
  some values from: AmperePerMilliMetre
subclass of: Restriction
  has value: 1.0
subclass of: Restriction
  has value: 0.0
comment: 0.001-fold of the SI base unit ampere divided by the 0.001-fold of the SI base unit metre -- QUDT
alternative label: Milliampere Per Millimetre
EMMO 1f1b164d ec6a 4faa 8d5e 88bda62316cc: http://qudt.org/vocab/unit/MilliA-PER-MilliM
EMMO 33ae2d07 5526 4555 a0b4 8f4c031b5652: mA.mm-1
EMMO 7f1dec83 d85e 4e1b b7bd c9442d4f5a64: mA/mm
EMMO 967080e5 2f42 4eb2 a3a9 c58143e835f9: 0.001-fold of the SI base unit ampere divided by the 0.001-fold of the SI base unit metre -- QUDT

FaradPerKiloMetre
type: Class
subclass of: Restriction
  has value: 0.001
subclass of: Restriction
  has value: 0.0
comment: SI derived unit farad divided by the 1 000-fold of the SI base unit metre -- QUDT
alternative label: Farad Per Kilometre
EMMO 1f1b164d ec6a 4faa 8d5e 88bda62316cc: http://qudt.org/vocab/unit/FARAD-PER-KiloM
EMMO 33ae2d07 5526 4555 a0b4 8f4c031b5652: F.km-1
EMMO 33ae2d07 5526 4555 a0b4 8f4c031b5652: F/km
EMMO 7f1dec83 d85e 4e1b b7bd c9442d4f5a64: F/km
EMMO 967080e5 2f42 4eb2 a3a9 c58143e835f9: SI derived unit farad divided by the 1 000-fold of the SI base unit metre -- QUDT

CopperSymbol
type: Class
subclass of: Restriction
  has value: Cu
comment: The symbol that stands for the copper atom.
EMMO 967080e5 2f42 4eb2 a3a9 c58143e835f9: The symbol that stands for the copper atom.

CentiMetrePerSecond
type: Class
subclass of: Restriction
  some values from: MetrePerSecond
subclass of: Restriction
  has value: 0.01
subclass of: Restriction
  has value: 0.0
comment: "Centimeter per Second" is a C.G.S System unit for 'Linear Velocity' expressed as cm/s. -- QUDT
alternative label: centimetre per second
EMMO 1f1b164d ec6a 4faa 8d5e 88bda62316cc: http://qudt.org/vocab/unit/CentiM-PER-SEC
EMMO 33ae2d07 5526 4555 a0b4 8f4c031b5652: cm.s-1
EMMO 33ae2d07 5526 4555 a0b4 8f4c031b5652: cm/s
EMMO 7f1dec83 d85e 4e1b b7bd c9442d4f5a64: cm/s
EMMO 967080e5 2f42 4eb2 a3a9 c58143e835f9: "Centimeter per Second" is a C.G.S System unit for 'Linear Velocity' expressed as cm/s. -- QUDT

MicroTesla
type: Class
subclass of: Restriction
  some values from: Tesla
subclass of: Restriction
  has value: 1e-06
subclass of: Restriction
  has value: 0.0
comment: 0.000001-fold of the SI derived unit tesla -- QUDT
EMMO 1f1b164d ec6a 4faa 8d5e 88bda62316cc: http://qudt.org/vocab/unit/MicroT
EMMO 33ae2d07 5526 4555 a0b4 8f4c031b5652: uT
EMMO 7f1dec83 d85e 4e1b b7bd c9442d4f5a64: µT
EMMO 967080e5 2f42 4eb2 a3a9 c58143e835f9: 0.000001-fold of the SI derived unit tesla -- QUDT

ActiveEnergy
type: Class
comment: The integral over a time interval of the instantaneous power.
EMMO 1f1b164d ec6a 4faa 8d5e 88bda62316cc: https://qudt.org/vocab/quantitykind/ActiveEnergy
EMMO 26bf1bef d192 4da6 b0eb d2209698fb54: https://www.wikidata.org/wiki/Q79813678
EMMO 50c298c2 55a2 4068 b3ac 4e948c33181f: https://www.electropedia.org/iev/iev.nsf/display
EMMO 8de5d5bf db1c 40ac b698 095ba3b18578: 6-62
EMMO 967080e5 2f42 4eb2 a3a9 c58143e835f9: The integral over a time interval of the instantaneous power.

LatentHeatOfPhaseTransition
type: Class
comment: Energy to be added to or removed from a system under constant temperature and pressure to undergo a complete phase transition.
EMMO 26bf1bef d192 4da6 b0eb d2209698fb54: https://www.wikidata.org/wiki/Q106553458
EMMO 8de5d5bf db1c 40ac b698 095ba3b18578: 9-16
EMMO 967080e5 2f42 4eb2 a3a9 c58143e835f9: Energy to be added to or removed from a system under constant temperature and pressure to undergo a complete phase transition.

LatentHeat
type: Class
comment: Heat released or absorbed energy during a constant-temperature process.
EMMO 26bf1bef d192 4da6 b0eb d2209698fb54: https://www.wikidata.org/wiki/Q207721
EMMO 8de5d5bf db1c 40ac b698 095ba3b18578: 5-6.2
EMMO 967080e5 2f42 4eb2 a3a9 c58143e835f9: Heat released or absorbed energy during a constant-temperature process.

MilliGramPerGram
type: Class
subclass of: Restriction
  some values from: GramPerGram
subclass of: Restriction
  has value: 0.001
subclass of: Restriction
  has value: 0.0
comment: 0.000001-fold of the SI base unit kilogram divided by the 0.001-fold of the SI base unit kilogram -- QUDT
alternative label: Milligram Per Gram
EMMO 1f1b164d ec6a 4faa 8d5e 88bda62316cc: http://qudt.org/vocab/unit/MilliGM-PER-GM
EMMO 33ae2d07 5526 4555 a0b4 8f4c031b5652: mg.g-1
EMMO 33ae2d07 5526 4555 a0b4 8f4c031b5652: mg/g
EMMO 7f1dec83 d85e 4e1b b7bd c9442d4f5a64: mg/gm
EMMO 967080e5 2f42 4eb2 a3a9 c58143e835f9: 0.000001-fold of the SI base unit kilogram divided by the 0.001-fold of the SI base unit kilogram -- QUDT

CodedBySubjectivity
type: Class
comment: A coded classified by whether it is determined subjectively or objectively.
EMMO 967080e5 2f42 4eb2 a3a9 c58143e835f9: A coded classified by whether it is determined subjectively or objectively.

ScandiumSymbol
type: Class
subclass of: Restriction
  has value: Sc
comment: The symbol that stands for the scandium atom.
EMMO 967080e5 2f42 4eb2 a3a9 c58143e835f9: The symbol that stands for the scandium atom.

DewPointTemperature
type: Class
comment: The corresponding Celsius temperature is denoted td and is also called dew point.
comment: Thermodynamic temperature at which vapour in air reaches saturation.
EMMO 26bf1bef d192 4da6 b0eb d2209698fb54: https://www.wikidata.org/wiki/Q178828
EMMO 50c298c2 55a2 4068 b3ac 4e948c33181f: https://www.electropedia.org/iev/iev.nsf/display
EMMO 8de5d5bf db1c 40ac b698 095ba3b18578: 5-36
EMMO 967080e5 2f42 4eb2 a3a9 c58143e835f9: Thermodynamic temperature at which vapour in air reaches saturation.
EMMO fe015383 afb3 44a6 ae86 043628697aa2: https://doi.org/10.1351/goldbook.D01652

RollingResistanceFactor
type: Class
comment: Quotient of tangential and normal component of the force applied to a body which is rolling at constant speed over a surface.
EMMO 26bf1bef d192 4da6 b0eb d2209698fb54: https://www.wikidata.org/wiki/Q91738044
EMMO 8de5d5bf db1c 40ac b698 095ba3b18578: 4-23.3
EMMO 967080e5 2f42 4eb2 a3a9 c58143e835f9: Quotient of tangential and normal component of the force applied to a body which is rolling at constant speed over a surface.

Newton
type: Class
subclass of: Restriction
  has value: N
comment: SI unit for force.
comment: The "Newton" is the SI unit of force. A force of one newton will accelerate a mass of one kilogram at the rate of one meter per second per second. The newton is named for Isaac Newton (1642-1727), the British mathematician, physicist, and natural philosopher. He was the first person to understand clearly the relationship between force (F), mass (m), and acceleration (a) expressed by the formula F = m·a. -- QUDT
EMMO 0b1cbe60 d380 4787 b92e be26bdacf2c2: NEW
EMMO 1f1b164d ec6a 4faa 8d5e 88bda62316cc: http://qudt.org/vocab/unit/N
EMMO 33ae2d07 5526 4555 a0b4 8f4c031b5652: N
EMMO 6dd685dd 1895 46e4 b227 be9f7d643c25: http://dbpedia.org/resource/Newton
EMMO 967080e5 2f42 4eb2 a3a9 c58143e835f9: SI unit for force.
EMMO c7b62dd7 063a 4c2a 8504 42f7264ba83f: The "Newton" is the SI unit of force. A force of one newton will accelerate a mass of one kilogram at the rate of one meter per second per second. The newton is named for Isaac Newton (1642-1727), the British mathematician, physicist, and natural philosopher. He was the first person to understand clearly the relationship between force (F), mass (m), and acceleration (a) expressed by the formula F = m·a. -- QUDT
EMMO c84c6752 6d64 48cc 9500 e54a3c34898d: http://en.wikipedia.org/wiki/Newton
EMMO fe015383 afb3 44a6 ae86 043628697aa2: https://doi.org/10.1351/goldbook.N04135

CASRN
type: Class
comment: Chemical Abstact Service registry number for a chemical substance from the American Chemical Society
example: Water is 7732-18-5
EMMO 967080e5 2f42 4eb2 a3a9 c58143e835f9: Chemical Abstact Service registry number for a chemical substance from the American Chemical Society

CouplingFactor
type: Class
comment: Ratio of the absolute value of the mutual permeance related to two circuit elements to the geometric average of their self-permeances.
alternative label: InductiveCouplingFactor
EMMO 26bf1bef d192 4da6 b0eb d2209698fb54: https://www.wikidata.org/wiki/Q78101715
EMMO 50c298c2 55a2 4068 b3ac 4e948c33181f: https://www.electropedia.org/iev/iev.nsf/display
EMMO 8de5d5bf db1c 40ac b698 095ba3b18578: 6-42.1
EMMO 967080e5 2f42 4eb2 a3a9 c58143e835f9: Ratio of the absolute value of the mutual permeance related to two circuit elements to the geometric average of their self-permeances.

NitrogenAtom
type: Class
subclass of: Restriction
subclass of: Restriction
  has value: 14.007
subclass of: Restriction
  has value: 7
comment: Atom subclass for nitrogen.
EMMO 967080e5 2f42 4eb2 a3a9 c58143e835f9: Atom subclass for nitrogen.

RollingResistance
type: Class
comment: Force resisting the motion when a body (such as a ball, tire, or wheel) rolls on a surface.
alternative label: RollingDrag
alternative label: RollingFrictionForce
EMMO 26bf1bef d192 4da6 b0eb d2209698fb54: https://www.wikidata.org/wiki/Q914921
EMMO 8de5d5bf db1c 40ac b698 095ba3b18578: 4-9.5
EMMO 967080e5 2f42 4eb2 a3a9 c58143e835f9: Force resisting the motion when a body (such as a ball, tire, or wheel) rolls on a surface.

ComptonWavelength
type: Class
comment: Quotient of the Planck constant and the product of the mass of the particle and the speed of light in vacuum.
EMMO 1f1b164d ec6a 4faa 8d5e 88bda62316cc: https://qudt.org/vocab/constant/ComptonWavelength
EMMO 26bf1bef d192 4da6 b0eb d2209698fb54: https://www.wikidata.org/wiki/Q1145377
EMMO 8de5d5bf db1c 40ac b698 095ba3b18578: 10-20
EMMO 967080e5 2f42 4eb2 a3a9 c58143e835f9: Quotient of the Planck constant and the product of the mass of the particle and the speed of light in vacuum.
EMMO c84c6752 6d64 48cc 9500 e54a3c34898d: https://en.wikipedia.org/wiki/Compton_wavelength

SquarePressureTimeUnit
type: Class
subclass of: Restriction
  has value: T-3 L-2 M+2 I0 Θ0 N0 J0
comment: The class of units with dimensionality 'SquarePressureTime'.
EMMO 967080e5 2f42 4eb2 a3a9 c58143e835f9: The class of units with dimensionality 'SquarePressureTime'.

CurieTemperature
type: Class
comment: Critical thermodynamic temperature of a ferromagnet.
EMMO 1f1b164d ec6a 4faa 8d5e 88bda62316cc: https://qudt.org/vocab/quantitykind/CurieTemperature
EMMO 26bf1bef d192 4da6 b0eb d2209698fb54: https://www.wikidata.org/wiki/Q191073
EMMO 50c298c2 55a2 4068 b3ac 4e948c33181f: https://www.electropedia.org/iev/iev.nsf/display
EMMO 8de5d5bf db1c 40ac b698 095ba3b18578: 12-35.1
EMMO 967080e5 2f42 4eb2 a3a9 c58143e835f9: Critical thermodynamic temperature of a ferromagnet.

MentalAgent
type: Class

KilogramSquareCentiMetre
type: Class
subclass of: Restriction
  has value: 0.0001
subclass of: Restriction
  has value: 0.0
comment: product of the SI base unit kilogram and the 0 0001fold of the power of the SI base unit metre with the exponent 2 -- QUDT
alternative label: Kilogram Square Centimetre
EMMO 1f1b164d ec6a 4faa 8d5e 88bda62316cc: http://qudt.org/vocab/unit/KiloGM-CentiM2
EMMO 33ae2d07 5526 4555 a0b4 8f4c031b5652: kg.cm2
EMMO 7f1dec83 d85e 4e1b b7bd c9442d4f5a64: kg⋅cm²
EMMO 967080e5 2f42 4eb2 a3a9 c58143e835f9: product of the SI base unit kilogram and the 0 0001fold of the power of the SI base unit metre with the exponent 2 -- QUDT

ChemicalMaterial
type: Class

ThermodynamicCriticalMagneticFluxDensity
type: Class
comment: The magnetic flux density for disappearance of superconductivity in a type I superconductor.
EMMO 1f1b164d ec6a 4faa 8d5e 88bda62316cc: https://qudt.org/vocab/quantitykind/ThermodynamicCriticalMagneticFluxDensity
EMMO 26bf1bef d192 4da6 b0eb d2209698fb54: https://www.wikidata.org/wiki/Q106103200
EMMO 8de5d5bf db1c 40ac b698 095ba3b18578: 12-36.1
EMMO 967080e5 2f42 4eb2 a3a9 c58143e835f9: The magnetic flux density for disappearance of superconductivity in a type I superconductor.

MagneticFluxDensity
type: Class
subclass of: Restriction
comment: Often denoted B.
comment: Strength of the magnetic field.
alternative label: MagneticInduction
EMMO 1f1b164d ec6a 4faa 8d5e 88bda62316cc: http://qudt.org/vocab/quantitykind/MagneticFluxDensity
EMMO 26bf1bef d192 4da6 b0eb d2209698fb54: https://www.wikidata.org/wiki/Q30204
EMMO 50c298c2 55a2 4068 b3ac 4e948c33181f: https://www.electropedia.org/iev/iev.nsf/display
EMMO 8de5d5bf db1c 40ac b698 095ba3b18578: 6-21
EMMO 967080e5 2f42 4eb2 a3a9 c58143e835f9: Strength of the magnetic field.
EMMO fe015383 afb3 44a6 ae86 043628697aa2: https://doi.org/10.1351/goldbook.M03686

UpperCriticalMagneticFluxDensity
type: Class
comment: For type II superconductors, the threshold magnetic flux density for disappearance of bulk superconductivity.
EMMO 1f1b164d ec6a 4faa 8d5e 88bda62316cc: https://qudt.org/vocab/quantitykind/UpperCriticalMagneticFluxDensity
EMMO 26bf1bef d192 4da6 b0eb d2209698fb54: https://www.wikidata.org/wiki/Q106127634
EMMO 8de5d5bf db1c 40ac b698 095ba3b18578: 12-36.3
EMMO 967080e5 2f42 4eb2 a3a9 c58143e835f9: For type II superconductors, the threshold magnetic flux density for disappearance of bulk superconductivity.

LowerCriticalMagneticFluxDensity
type: Class
comment: For type II superconductors, the threshold magnetic flux density for magnetic flux entering the superconductor.
EMMO 1f1b164d ec6a 4faa 8d5e 88bda62316cc: https://qudt.org/vocab/quantitykind/LowerCriticalMagneticFluxDensity
EMMO 26bf1bef d192 4da6 b0eb d2209698fb54: https://www.wikidata.org/wiki/Q106127355
EMMO 8de5d5bf db1c 40ac b698 095ba3b18578: 12-36.2
EMMO 967080e5 2f42 4eb2 a3a9 c58143e835f9: For type II superconductors, the threshold magnetic flux density for magnetic flux entering the superconductor.

Torque
type: Class
subclass of: Restriction
comment: Even though torque has the same physical dimension as energy, it is not of the same kind and can not be measured with energy units like joule or electron volt.
comment: The effectiveness of a force to produce rotation about an axis, measured by the product of the force and the perpendicular distance from the line of action of the force to the axis.
EMMO 1f1b164d ec6a 4faa 8d5e 88bda62316cc: http://qudt.org/vocab/quantitykind/Torque
EMMO 8de5d5bf db1c 40ac b698 095ba3b18578: 4-12.2
EMMO 967080e5 2f42 4eb2 a3a9 c58143e835f9: The effectiveness of a force to produce rotation about an axis, measured by the product of the force and the perpendicular distance from the line of action of the force to the axis.
EMMO fe015383 afb3 44a6 ae86 043628697aa2: https://doi.org/10.1351/goldbook.T06400

SolidAerosol
type: Class
comment: An aerosol composed of fine solid particles in air or another gas.
EMMO 967080e5 2f42 4eb2 a3a9 c58143e835f9: An aerosol composed of fine solid particles in air or another gas.

FemtoGramPerKilogram
type: Class
subclass of: Restriction
  some values from: GramPerKilogram
subclass of: Restriction
  has value: 1e-18
subclass of: Restriction
  has value: 0.0
comment: One part per 10**18 by mass of the measurand in the matrix. -- QUDT
alternative label: Femtograms per kilogram
EMMO 1f1b164d ec6a 4faa 8d5e 88bda62316cc: http://qudt.org/vocab/unit/FemtoGM-PER-KiloGM
EMMO 33ae2d07 5526 4555 a0b4 8f4c031b5652: fg.kg-1
EMMO 7f1dec83 d85e 4e1b b7bd c9442d4f5a64: fg/kg
EMMO 967080e5 2f42 4eb2 a3a9 c58143e835f9: One part per 10**18 by mass of the measurand in the matrix. -- QUDT

ElectrolyticConductivity
type: Class
comment: Electric conductivity of an electrolyte.
EMMO 1f1b164d ec6a 4faa 8d5e 88bda62316cc: https://qudt.org/vocab/quantitykind/ElectrolyticConductivity
EMMO 26bf1bef d192 4da6 b0eb d2209698fb54: https://www.wikidata.org/wiki/Q907564
EMMO 50c298c2 55a2 4068 b3ac 4e948c33181f: https://www.electropedia.org/iev/iev.nsf/display
EMMO 8de5d5bf db1c 40ac b698 095ba3b18578: 9-44
EMMO 967080e5 2f42 4eb2 a3a9 c58143e835f9: Electric conductivity of an electrolyte.

PerCentiMetre
type: Class
subclass of: Restriction
  has value: 100.0
subclass of: Restriction
  has value: 0.0
comment: reciprocal of the 0.01-fold of the SI base unit metre -- QUDT
alternative label: ReciprocalCentimetre
EMMO 1f1b164d ec6a 4faa 8d5e 88bda62316cc: http://qudt.org/vocab/unit/PER-CentiM
EMMO 33ae2d07 5526 4555 a0b4 8f4c031b5652: /cm
EMMO 33ae2d07 5526 4555 a0b4 8f4c031b5652: cm-1
EMMO 7f1dec83 d85e 4e1b b7bd c9442d4f5a64: /cm
EMMO 967080e5 2f42 4eb2 a3a9 c58143e835f9: reciprocal of the 0.01-fold of the SI base unit metre -- QUDT

ChemicallyDefinedMaterial
type: Class

KiloJoulePerKelvin
type: Class
subclass of: Restriction
  some values from: JoulePerKelvin
subclass of: Restriction
  has value: 1000.0
subclass of: Restriction
  has value: 0.0
comment: 1 000-fold of the SI derived unit joule divided by the SI base unit kelvin -- QUDT
alternative label: Kilojoule Per Kelvin
EMMO 1f1b164d ec6a 4faa 8d5e 88bda62316cc: http://qudt.org/vocab/unit/KiloJ-PER-K
EMMO 33ae2d07 5526 4555 a0b4 8f4c031b5652: kJ.K-1
EMMO 33ae2d07 5526 4555 a0b4 8f4c031b5652: kJ/K
EMMO 7f1dec83 d85e 4e1b b7bd c9442d4f5a64: kJ/K
EMMO 967080e5 2f42 4eb2 a3a9 c58143e835f9: 1 000-fold of the SI derived unit joule divided by the SI base unit kelvin -- QUDT

NonConvergent
type: Class
comment: The superclass for all classes of entities that have a proper parts of the same type φ of the whole, and so that for every two distinct φ proper parts one is not part of the other.
EMMO 967080e5 2f42 4eb2 a3a9 c58143e835f9: The superclass for all classes of entities that have a proper parts of the same type φ of the whole, and so that for every two distinct φ proper parts one is not part of the other.

PicoWatt
type: Class
subclass of: Restriction
  some values from: Watt
subclass of: Restriction
  has value: 1e-12
subclass of: Restriction
  has value: 0.0
comment: 0.000000000001-fold of the SI derived unit watt -- QUDT
EMMO 1f1b164d ec6a 4faa 8d5e 88bda62316cc: http://qudt.org/vocab/unit/PicoW
EMMO 33ae2d07 5526 4555 a0b4 8f4c031b5652: pW
EMMO 7f1dec83 d85e 4e1b b7bd c9442d4f5a64: pW
EMMO 967080e5 2f42 4eb2 a3a9 c58143e835f9: 0.000000000001-fold of the SI derived unit watt -- QUDT

NewtonSecondPerRadian
type: Class
subclass of: Restriction
  has value: 1.0
subclass of: Restriction
  has value: 0.0
comment: Newton seconds measured per radian -- QUDT
alternative label: Newton seconds per radian
EMMO 1f1b164d ec6a 4faa 8d5e 88bda62316cc: http://qudt.org/vocab/unit/N-SEC-PER-RAD
EMMO 7f1dec83 d85e 4e1b b7bd c9442d4f5a64: N⋅s/rad
EMMO 967080e5 2f42 4eb2 a3a9 c58143e835f9: Newton seconds measured per radian -- QUDT

MicroHenryPerKiloOhm
type: Class
subclass of: Restriction
  some values from: HenryPerKiloOhm
subclass of: Restriction
  has value: 1e-09
subclass of: Restriction
  has value: 0.0
comment: 0.000001-fold of the SI derived unit henry divided by the 1,000-fold of the SI derived unit ohm -- QUDT
alternative label: Microhenry Per Kiloohm
EMMO 1f1b164d ec6a 4faa 8d5e 88bda62316cc: http://qudt.org/vocab/unit/MicroH-PER-KiloOHM
EMMO 33ae2d07 5526 4555 a0b4 8f4c031b5652: uH.kOhm-1
EMMO 7f1dec83 d85e 4e1b b7bd c9442d4f5a64: µH/kΩ
EMMO 967080e5 2f42 4eb2 a3a9 c58143e835f9: 0.000001-fold of the SI derived unit henry divided by the 1,000-fold of the SI derived unit ohm -- QUDT

AlgebraicEquation
type: Class
subclass of: Restriction
comment: An 'equation' that has parts two 'polynomial'-s
example: 2 * a - b = c

CubicDecaMetre
type: Class
subclass of: Restriction
  has value: 1000.0
subclass of: Restriction
  has value: 0.0
comment: 1 000-fold of the power of the SI base unit metre by exponent 3 -- QUDT
alternative label: Cubic Decametre
EMMO 1f1b164d ec6a 4faa 8d5e 88bda62316cc: http://qudt.org/vocab/unit/DecaM3
EMMO 33ae2d07 5526 4555 a0b4 8f4c031b5652: dam3
EMMO 7f1dec83 d85e 4e1b b7bd c9442d4f5a64: dam³
EMMO 967080e5 2f42 4eb2 a3a9 c58143e835f9: 1 000-fold of the power of the SI base unit metre by exponent 3 -- QUDT

KilogramPerMetrePerSquareSecond
type: Class
subclass of: Restriction
  has value: 1.0
subclass of: Restriction
  has value: 0.0
comment: The SI unit of pressure. The pascal is the standard pressure unit in the MKS metric system, equal to one newton per square meter or one "kilogram per meter per second per second." The unit is named for Blaise Pascal (1623-1662), French philosopher and mathematician, who was the first person to use a barometer to measure differences in altitude. -- QUDT
alternative label: Kilograms per metre per square second
EMMO 1f1b164d ec6a 4faa 8d5e 88bda62316cc: http://qudt.org/vocab/unit/KiloGM-PER-M-SEC2
EMMO 33ae2d07 5526 4555 a0b4 8f4c031b5652: kg.m-1.s-2
EMMO 7f1dec83 d85e 4e1b b7bd c9442d4f5a64: kg/(m⋅s²)
EMMO 967080e5 2f42 4eb2 a3a9 c58143e835f9: The SI unit of pressure. The pascal is the standard pressure unit in the MKS metric system, equal to one newton per square meter or one "kilogram per meter per second per second." The unit is named for Blaise Pascal (1623-1662), French philosopher and mathematician, who was the first person to use a barometer to measure differences in altitude. -- QUDT

ConfigurationLanguage
type: Class
comment: A construction language used to write configuration files.
example: .ini files
example: Files in the standard .config directory on Unix systems.
EMMO 967080e5 2f42 4eb2 a3a9 c58143e835f9: A construction language used to write configuration files.
EMMO c84c6752 6d64 48cc 9500 e54a3c34898d: https://en.wikipedia.org/wiki/Configuration_file#Configuration_languages

HectoMetre
type: Class
subclass of: Restriction
  some values from: Metre
subclass of: Restriction
  has value: 100.0
subclass of: Restriction
  has value: 0.0
comment: 100-fold of the SI base unit metre -- QUDT
EMMO 1f1b164d ec6a 4faa 8d5e 88bda62316cc: http://qudt.org/vocab/unit/HectoM
EMMO 33ae2d07 5526 4555 a0b4 8f4c031b5652: hm
EMMO 7f1dec83 d85e 4e1b b7bd c9442d4f5a64: hm
EMMO 967080e5 2f42 4eb2 a3a9 c58143e835f9: 100-fold of the SI base unit metre -- QUDT

MegaNewton
type: Class
subclass of: Restriction
  some values from: Newton
subclass of: Restriction
  has value: 1000000.0
subclass of: Restriction
  has value: 0.0
comment: 1,000,000-fold of the SI derived unit newton -- QUDT
EMMO 1f1b164d ec6a 4faa 8d5e 88bda62316cc: http://qudt.org/vocab/unit/MegaN
EMMO 33ae2d07 5526 4555 a0b4 8f4c031b5652: MN
EMMO 7f1dec83 d85e 4e1b b7bd c9442d4f5a64: MN
EMMO 967080e5 2f42 4eb2 a3a9 c58143e835f9: 1,000,000-fold of the SI derived unit newton -- QUDT

ApplicationProgram
type: Class
comment: A program aimed to provide a specific high level function to the user, usually hiding lower level procedures.
alternative label: App
alternative label: Application
example: Word processors, graphic image processing programs, database management systems, numerical simulation software and games.
EMMO 967080e5 2f42 4eb2 a3a9 c58143e835f9: A program aimed to provide a specific high level function to the user, usually hiding lower level procedures.

MilliGramPerSquareMetre
type: Class
subclass of: Restriction
  some values from: GramPerSquareMetre
subclass of: Restriction
  has value: 1e-06
subclass of: Restriction
  has value: 0.0
comment: 0.000001-fold of the SI base unit kilogram divided by the power of the SI base unit metre with the exponent 2 -- QUDT
alternative label: Milligram Per Square Metre
EMMO 1f1b164d ec6a 4faa 8d5e 88bda62316cc: http://qudt.org/vocab/unit/MilliGM-PER-M2
EMMO 33ae2d07 5526 4555 a0b4 8f4c031b5652: mg.m-2
EMMO 33ae2d07 5526 4555 a0b4 8f4c031b5652: mg/m2
EMMO 7f1dec83 d85e 4e1b b7bd c9442d4f5a64: mg/m²
EMMO 967080e5 2f42 4eb2 a3a9 c58143e835f9: 0.000001-fold of the SI base unit kilogram divided by the power of the SI base unit metre with the exponent 2 -- QUDT

Coupled
type: Class
equivalent class: Class

ReactiveMaterial
type: Class
comment: A material that takes active part in a chemical reaction.
EMMO 967080e5 2f42 4eb2 a3a9 c58143e835f9: A material that takes active part in a chemical reaction.

BerkeliumSymbol
type: Class
subclass of: Restriction
  has value: Bk
comment: The symbol that stands for the berkelium atom.
EMMO 967080e5 2f42 4eb2 a3a9 c58143e835f9: The symbol that stands for the berkelium atom.

MoscoviumSymbol
type: Class
subclass of: Restriction
  has value: Mc
comment: The symbol that stands for the moscovium atom.
EMMO 967080e5 2f42 4eb2 a3a9 c58143e835f9: The symbol that stands for the moscovium atom.

MicroCoulombPerCubicMetre
type: Class
subclass of: Restriction
  has value: 1e-06
subclass of: Restriction
  has value: 0.0
comment: 0.000001-fold of the SI derived unit coulomb divided by the power of the SI base unit metre with the exponent 3 -- QUDT
alternative label: Microcoulomb Per Cubic Metre
EMMO 1f1b164d ec6a 4faa 8d5e 88bda62316cc: http://qudt.org/vocab/unit/MicroC-PER-M3
EMMO 33ae2d07 5526 4555 a0b4 8f4c031b5652: uC.m-3
EMMO 7f1dec83 d85e 4e1b b7bd c9442d4f5a64: μC/m³
EMMO 967080e5 2f42 4eb2 a3a9 c58143e835f9: 0.000001-fold of the SI derived unit coulomb divided by the power of the SI base unit metre with the exponent 3 -- QUDT

SurfaceDensityOfElectricCharge
type: Class
comment: The derivative of the electric charge of a system with respect to the area.
alternative label: AreicElectricCharge
alternative label: SurfaceChargeDensity
EMMO 26bf1bef d192 4da6 b0eb d2209698fb54: https://www.wikidata.org/wiki/Q12799324
EMMO 50c298c2 55a2 4068 b3ac 4e948c33181f: https://www.electropedia.org/iev/iev.nsf/display
EMMO 8de5d5bf db1c 40ac b698 095ba3b18578: 6-4
EMMO 967080e5 2f42 4eb2 a3a9 c58143e835f9: The derivative of the electric charge of a system with respect to the area.
EMMO fe015383 afb3 44a6 ae86 043628697aa2: https://doi.org/10.1351/goldbook.S06159

DisplacementCurrentDensity
type: Class
comment: Vector quantity equal to the time derivative of the electric flux density.
EMMO 1f1b164d ec6a 4faa 8d5e 88bda62316cc: https://qudt.org/vocab/quantitykind/DisplacementCurrentDensity
EMMO 26bf1bef d192 4da6 b0eb d2209698fb54: https://www.wikidata.org/wiki/Q77614612
EMMO 50c298c2 55a2 4068 b3ac 4e948c33181f: https://www.electropedia.org/iev/iev.nsf/display
EMMO 8de5d5bf db1c 40ac b698 095ba3b18578: 6-18
EMMO 967080e5 2f42 4eb2 a3a9 c58143e835f9: Vector quantity equal to the time derivative of the electric flux density.

AluminiumAtom
type: Class
subclass of: Restriction
subclass of: Restriction
  has value: 26.9815385
subclass of: Restriction
  has value: 13
comment: Atom subclass for aluminium.
EMMO 967080e5 2f42 4eb2 a3a9 c58143e835f9: Atom subclass for aluminium.

VolumicTotalCrossSection
type: Class
subclass of: Restriction
comment: Product of the number density na of the atoms and the cross section σ_tot for a given type of atoms.
alternative label: MacroscopicTotalCrossSection
EMMO 1f1b164d ec6a 4faa 8d5e 88bda62316cc: https://qudt.org/vocab/quantitykind/MacroscopicTotalCrossSection
EMMO 26bf1bef d192 4da6 b0eb d2209698fb54: https://www.wikidata.org/wiki/Q98280548
EMMO 8de5d5bf db1c 40ac b698 095ba3b18578: 10-42.2
EMMO 967080e5 2f42 4eb2 a3a9 c58143e835f9: Product of the number density na of the atoms and the cross section σ_tot for a given type of atoms.

Equals
type: Class
subclass of: Restriction
  has value: =
comment: The equals symbol.
EMMO 967080e5 2f42 4eb2 a3a9 c58143e835f9: The equals symbol.

SecondPerMetre
type: Class
subclass of: Restriction
  has value: 1.0
subclass of: Restriction
  has value: 0.0
comment: Second per metre.
EMMO 1f1b164d ec6a 4faa 8d5e 88bda62316cc: http://qudt.org/vocab/unit/SEC-PER-M
EMMO 33ae2d07 5526 4555 a0b4 8f4c031b5652: s.m-1
EMMO 7f1dec83 d85e 4e1b b7bd c9442d4f5a64: s/m
EMMO 967080e5 2f42 4eb2 a3a9 c58143e835f9: Second per metre.

KiloBecquerel
type: Class
subclass of: Restriction
  some values from: Becquerel
subclass of: Restriction
  has value: 1000.0
subclass of: Restriction
  has value: 0.0
comment: 1 000-fold of the SI derived unit becquerel -- QUDT
EMMO 1f1b164d ec6a 4faa 8d5e 88bda62316cc: http://qudt.org/vocab/unit/KiloBQ
EMMO 33ae2d07 5526 4555 a0b4 8f4c031b5652: kBq
EMMO 7f1dec83 d85e 4e1b b7bd c9442d4f5a64: kBq
EMMO 967080e5 2f42 4eb2 a3a9 c58143e835f9: 1 000-fold of the SI derived unit becquerel -- QUDT

VolumetricNumberDensity
type: Class
comment: Count per volume.
EMMO 967080e5 2f42 4eb2 a3a9 c58143e835f9: Count per volume.

MilliGray
type: Class
subclass of: Restriction
  some values from: Gray
subclass of: Restriction
  has value: 0.001
subclass of: Restriction
  has value: 0.0
comment: 0.001-fold of the SI derived unit gray -- QUDT
EMMO 1f1b164d ec6a 4faa 8d5e 88bda62316cc: http://qudt.org/vocab/unit/MilliGRAY
EMMO 33ae2d07 5526 4555 a0b4 8f4c031b5652: mGy
EMMO 7f1dec83 d85e 4e1b b7bd c9442d4f5a64: mGy
EMMO 967080e5 2f42 4eb2 a3a9 c58143e835f9: 0.001-fold of the SI derived unit gray -- QUDT

NuclearQuadrupoleMoment
type: Class
subclass of: Restriction
comment: z component of the diagonalized tensor of nuclear quadrupole moment, in the quantum state with the nuclear spin in the field direction (z).
EMMO 1f1b164d ec6a 4faa 8d5e 88bda62316cc: https://qudt.org/vocab/quantitykind/NuclearQuadrupoleMoment
EMMO 26bf1bef d192 4da6 b0eb d2209698fb54: https://www.wikidata.org/wiki/Q97921226
EMMO 8de5d5bf db1c 40ac b698 095ba3b18578: 10-18
EMMO 967080e5 2f42 4eb2 a3a9 c58143e835f9: z component of the diagonalized tensor of nuclear quadrupole moment, in the quantum state with the nuclear spin in the field direction (z).

LumenPerWatt
type: Class
subclass of: Restriction
  has value: 1.0
subclass of: Restriction
  has value: 0.0
comment: A measurement of luminous efficacy, which is the light output in lumens using one watt of electricity. -- QUDT
alternative label: Lumen per Watt
EMMO 1f1b164d ec6a 4faa 8d5e 88bda62316cc: http://qudt.org/vocab/unit/LM-PER-W
EMMO 33ae2d07 5526 4555 a0b4 8f4c031b5652: lm.W-1
EMMO 7f1dec83 d85e 4e1b b7bd c9442d4f5a64: lm/W
EMMO 967080e5 2f42 4eb2 a3a9 c58143e835f9: A measurement of luminous efficacy, which is the light output in lumens using one watt of electricity. -- QUDT

SubProcess
type: Class
subclass of: Restriction
comment: A process which is an holistic spatial part of a process.
comment: In the EMMO the relation of participation to a process falls under mereotopology. Since topological connection means causality, then the only way for a real world object to participate to a process is to be a part of it.
example: Breathing is a subprocess of living for a human being.
EMMO 967080e5 2f42 4eb2 a3a9 c58143e835f9: A process which is an holistic spatial part of a process.
EMMO c7b62dd7 063a 4c2a 8504 42f7264ba83f: In the EMMO the relation of participation to a process falls under mereotopology. Since topological connection means causality, then the only way for a real world object to participate to a process is to be a part of it.

BariumAtom
type: Class
subclass of: Restriction
subclass of: Restriction
  has value: 137.327
subclass of: Restriction
  has value: 56
comment: Atom subclass for barium.
EMMO 967080e5 2f42 4eb2 a3a9 c58143e835f9: Atom subclass for barium.

MetrePerKelvin
type: Class
subclass of: Restriction
  has value: 1.0
subclass of: Restriction
  has value: 0.0
comment: Metre per Kelvin.
EMMO 1f1b164d ec6a 4faa 8d5e 88bda62316cc: http://qudt.org/vocab/unit/M-PER-K
EMMO 33ae2d07 5526 4555 a0b4 8f4c031b5652: m/K
EMMO 7f1dec83 d85e 4e1b b7bd c9442d4f5a64: m/k
EMMO 967080e5 2f42 4eb2 a3a9 c58143e835f9: Metre per Kelvin.

PlatinumSymbol
type: Class
subclass of: Restriction
  has value: Pt
comment: The symbol that stands for the platinum atom.
EMMO 967080e5 2f42 4eb2 a3a9 c58143e835f9: The symbol that stands for the platinum atom.

Naming
type: Class
subclass of: Restriction
comment: A declaration that provides a sign for an object that is independent from any assignment rule.
example: A unique id attached to an entity.
EMMO 967080e5 2f42 4eb2 a3a9 c58143e835f9: A declaration that provides a sign for an object that is independent from any assignment rule.

UnifiedAtomicMassConstant
type: Class
subclass of: Restriction
comment: 1/12 of the mass of an atom of the nuclide 12C in the ground state at rest.
EMMO 26bf1bef d192 4da6 b0eb d2209698fb54: https://www.wikidata.org/wiki/Q4817337
EMMO 50c298c2 55a2 4068 b3ac 4e948c33181f: https://www.electropedia.org/iev/iev.nsf/display
EMMO 8de5d5bf db1c 40ac b698 095ba3b18578: 10-4.3
EMMO 967080e5 2f42 4eb2 a3a9 c58143e835f9: 1/12 of the mass of an atom of the nuclide 12C in the ground state at rest.
EMMO fe015383 afb3 44a6 ae86 043628697aa2: https://doi.org/10.1351/goldbook.A00497

GigaPascal
type: Class
subclass of: Restriction
  some values from: Pascal
subclass of: Restriction
  has value: 1000000000.0
subclass of: Restriction
  has value: 0.0
comment: 1 000 000 000-fold of the SI derived unit pascal -- QUDT
EMMO 1f1b164d ec6a 4faa 8d5e 88bda62316cc: http://qudt.org/vocab/unit/GigaPA
EMMO 33ae2d07 5526 4555 a0b4 8f4c031b5652: GPa
EMMO 7f1dec83 d85e 4e1b b7bd c9442d4f5a64: GPa
EMMO 967080e5 2f42 4eb2 a3a9 c58143e835f9: 1 000 000 000-fold of the SI derived unit pascal -- QUDT

Lumen
type: Class
subclass of: Restriction
  has value: lm
comment: SI unit for luminous flux.
comment: The SI unit for measuring the flux of light being produced by a light source or received by a surface. The intensity of a light source is measured in candelas. One lumen represents the total flux of light emitted, equal to the intensity in candelas multiplied by the solid angle in steradians into which the light is emitted. A full sphere has a solid angle of 4·π steradians. A light source that uniformly radiates one candela in all directions has a total luminous flux of 1 cd·4π sr = 4π cd·sr ≈ 12.57 lumens. "Lumen" is a Latin word for light. -- QUDT
EMMO 0b1cbe60 d380 4787 b92e be26bdacf2c2: LUM
EMMO 1f1b164d ec6a 4faa 8d5e 88bda62316cc: http://qudt.org/vocab/unit/LM
EMMO 33ae2d07 5526 4555 a0b4 8f4c031b5652: lm
EMMO 6dd685dd 1895 46e4 b227 be9f7d643c25: http://dbpedia.org/resource/Lumen
EMMO 967080e5 2f42 4eb2 a3a9 c58143e835f9: SI unit for luminous flux.
EMMO c7b62dd7 063a 4c2a 8504 42f7264ba83f: The SI unit for measuring the flux of light being produced by a light source or received by a surface. The intensity of a light source is measured in candelas. One lumen represents the total flux of light emitted, equal to the intensity in candelas multiplied by the solid angle in steradians into which the light is emitted. A full sphere has a solid angle of 4·π steradians. A light source that uniformly radiates one candela in all directions has a total luminous flux of 1 cd·4π sr = 4π cd·sr ≈ 12.57 lumens. "Lumen" is a Latin word for light. -- QUDT
EMMO c84c6752 6d64 48cc 9500 e54a3c34898d: https://en.wikipedia.org/wiki/Lumen_(unit)
EMMO fe015383 afb3 44a6 ae86 043628697aa2: https://doi.org/10.1351/goldbook.L03639

MeanFreePathOfElectrons
type: Class
comment: Average distance that electrons travel between two successive interactions.
EMMO 1f1b164d ec6a 4faa 8d5e 88bda62316cc: https://qudt.org/vocab/quantitykind/ElectronMeanFreePath
EMMO 26bf1bef d192 4da6 b0eb d2209698fb54: https://www.wikidata.org/wiki/Q105672307
EMMO 8de5d5bf db1c 40ac b698 095ba3b18578: 12-15.2
EMMO 967080e5 2f42 4eb2 a3a9 c58143e835f9: Average distance that electrons travel between two successive interactions.

Neutron
type: Class
comment: An uncharged subatomic particle found in the atomic nucleus.
EMMO 967080e5 2f42 4eb2 a3a9 c58143e835f9: An uncharged subatomic particle found in the atomic nucleus.
EMMO c84c6752 6d64 48cc 9500 e54a3c34898d: https://en.wikipedia.org/wiki/Neutron

CentiGram
type: Class
subclass of: Restriction
  some values from: Gram
subclass of: Restriction
  has value: 1e-05
subclass of: Restriction
  has value: 0.0
comment: 0,000 01-fold of the SI base unit kilogram -- QUDT
EMMO 1f1b164d ec6a 4faa 8d5e 88bda62316cc: http://qudt.org/vocab/unit/CentiGM
EMMO 33ae2d07 5526 4555 a0b4 8f4c031b5652: cg
EMMO 7f1dec83 d85e 4e1b b7bd c9442d4f5a64: cg
EMMO 967080e5 2f42 4eb2 a3a9 c58143e835f9: 0,000 01-fold of the SI base unit kilogram -- QUDT

NanoMeterPerMilliMeterMegaPascal
type: Class
subclass of: Restriction
  has value: 1e-12
subclass of: Restriction
  has value: 0.0
alternative label: Nanometer Per Millimeter Megapascal
EMMO 1f1b164d ec6a 4faa 8d5e 88bda62316cc: http://qudt.org/vocab/unit/NanoM-PER-MilliM-MegaPA
EMMO 33ae2d07 5526 4555 a0b4 8f4c031b5652: nm.mm-1.MPa-1
EMMO 7f1dec83 d85e 4e1b b7bd c9442d4f5a64: nm/(mm⋅MPa)

TinSymbol
type: Class
subclass of: Restriction
  has value: Sn
comment: The symbol that stands for the tin atom.
EMMO 967080e5 2f42 4eb2 a3a9 c58143e835f9: The symbol that stands for the tin atom.

SquareMetrePerSecond
type: Class
subclass of: Restriction
  has value: 1.0
subclass of: Restriction
  has value: 0.0
comment: Square Metres per second is the SI derived unit of angular momentum, defined by distance or displacement in metres multiplied by distance again in metres and divided by time in seconds. The unit is written in symbols as m2/s or m2u00b7s-1 or m2s-1. It may be better understood when phrased as "metres per second times metres", i.e. the momentum of an object with respect to a position. -- QUDT
alternative label: Square Metre per Second
EMMO 1f1b164d ec6a 4faa 8d5e 88bda62316cc: http://qudt.org/vocab/unit/M2-PER-SEC
EMMO 33ae2d07 5526 4555 a0b4 8f4c031b5652: m2.s-1
EMMO 33ae2d07 5526 4555 a0b4 8f4c031b5652: m2/s
EMMO 7f1dec83 d85e 4e1b b7bd c9442d4f5a64: m²/s
EMMO 967080e5 2f42 4eb2 a3a9 c58143e835f9: Square Metres per second is the SI derived unit of angular momentum, defined by distance or displacement in metres multiplied by distance again in metres and divided by time in seconds. The unit is written in symbols as m2/s or m2u00b7s-1 or m2s-1. It may be better understood when phrased as "metres per second times metres", i.e. the momentum of an object with respect to a position. -- QUDT

DataExchangeLanguage
type: Class
comment: A computer language that is domain-independent and can be used for expressing data from any kind of discipline.
example: JSON, YAML, XML
EMMO 967080e5 2f42 4eb2 a3a9 c58143e835f9: A computer language that is domain-independent and can be used for expressing data from any kind of discipline.
EMMO c84c6752 6d64 48cc 9500 e54a3c34898d: https://en.wikipedia.org/wiki/Data_exchange#Data_exchange_languages

PascalPerMetre
type: Class
subclass of: Restriction
  has value: 1.0
subclass of: Restriction
  has value: 0.0
comment: SI derived unit pascal divided by the SI base unit metre -- QUDT
alternative label: Pascal Per Metre
EMMO 1f1b164d ec6a 4faa 8d5e 88bda62316cc: http://qudt.org/vocab/unit/PA-PER-M
EMMO 33ae2d07 5526 4555 a0b4 8f4c031b5652: Pa.m-1
EMMO 33ae2d07 5526 4555 a0b4 8f4c031b5652: Pa/m
EMMO 7f1dec83 d85e 4e1b b7bd c9442d4f5a64: Pa/m
EMMO 967080e5 2f42 4eb2 a3a9 c58143e835f9: SI derived unit pascal divided by the SI base unit metre -- QUDT

ChemicalComposition
type: Class
equivalent class: Class
comment: A language construct that provides information about the consitutents of a substance and their fractions or amounts.
EMMO 967080e5 2f42 4eb2 a3a9 c58143e835f9: A language construct that provides information about the consitutents of a substance and their fractions or amounts.

ChemicalSymbolicConstruct
type: Class
equivalent class: Class

Service
type: Class
alternative label: IntangibleProduct
EMMO 3aa37f92 8dc5 4ee4 8438 e41e6ae20c62: https://www.iso.org/obp/ui/#iso:std:iso:9000:ed-4:v1:en:term:3.7.7

HenryPerOhm
type: Class
subclass of: Restriction
  has value: 1.0
subclass of: Restriction
  has value: 0.0
comment: SI derived unit henry divided by the SI derived unit ohm -- QUDT
alternative label: Henry Per Ohm
EMMO 1f1b164d ec6a 4faa 8d5e 88bda62316cc: http://qudt.org/vocab/unit/H-PER-OHM
EMMO 33ae2d07 5526 4555 a0b4 8f4c031b5652: H.Ohm-1
EMMO 7f1dec83 d85e 4e1b b7bd c9442d4f5a64: H/Ω
EMMO 967080e5 2f42 4eb2 a3a9 c58143e835f9: SI derived unit henry divided by the SI derived unit ohm -- QUDT

Welding
type: Class
comment: Joining process by softening the surfaces to be joined, either by heat or with a solvent (swelling welding, solvent welding), and pressing the softened surfaces together.
alternative label: Schweißen

WaveVector
type: Class
comment: Vector k in the expression ω t−k⋅r+ϑ0 of the phase of a sinusoidal wave.
EMMO 26bf1bef d192 4da6 b0eb d2209698fb54: https://www.wikidata.org/wiki/Q657009
EMMO 50c298c2 55a2 4068 b3ac 4e948c33181f: https://www.electropedia.org/iev/iev.nsf/display
EMMO 8de5d5bf db1c 40ac b698 095ba3b18578: 3-21
EMMO 967080e5 2f42 4eb2 a3a9 c58143e835f9: Vector k in the expression ω t−k⋅r+ϑ0 of the phase of a sinusoidal wave.
EMMO c84c6752 6d64 48cc 9500 e54a3c34898d: https://en.wikipedia.org/wiki/Wave_vector

ElectronCharge
type: Class
comment: The charge of an electron.
comment: The negative of ElementaryCharge.
EMMO 70fe84ff 99b6 4206 a9fc 9a8931836d84: The charge of an electron.
EMMO 967080e5 2f42 4eb2 a3a9 c58143e835f9: The negative of ElementaryCharge.
EMMO fe015383 afb3 44a6 ae86 043628697aa2: https://doi.org/10.1351/goldbook.E01982

UnsignedIntData
type: Class
comment: A data representing 32-bit non-negative integer number, 0...4294967295.
EMMO 8a137e9f 579c 4e28 baca e8980eb0c3db: EquivalentTo: hasDataValue some xsd:unsignedInt
EMMO 967080e5 2f42 4eb2 a3a9 c58143e835f9: A data representing 32-bit non-negative integer number, 0...4294967295.

Drilling
type: Class
comment: machining with a circular cutting movement in which the axis of rotation of the tool and the axis of the internal surface to be produced are identical and the feed movement is in the direction of this axis. The axis of rotation of the cutting movement maintains its position relative to the workpiece independently of the feed movement (axis of rotation workpiece-bound).
alternative label: Bohren

DebyeWallerFactor
type: Class
comment: Factor by which the intensity of a diffraction line is reduced because of the lattice vibrations.
EMMO 1f1b164d ec6a 4faa 8d5e 88bda62316cc: https://qudt.org/vocab/quantitykind/Debye-WallerFactor
EMMO 26bf1bef d192 4da6 b0eb d2209698fb54: https://www.wikidata.org/wiki/Q902587
EMMO 8de5d5bf db1c 40ac b698 095ba3b18578: 12-8
EMMO 967080e5 2f42 4eb2 a3a9 c58143e835f9: Factor by which the intensity of a diffraction line is reduced because of the lattice vibrations.

FermiumSymbol
type: Class
subclass of: Restriction
  has value: Fm
comment: The symbol that stands for the fermium atom.
EMMO 967080e5 2f42 4eb2 a3a9 c58143e835f9: The symbol that stands for the fermium atom.

QuarticMetre
type: Class
comment: A unit associated with area moments of inertia. -- QUDT
alternative label: Quartic Metre
EMMO 1f1b164d ec6a 4faa 8d5e 88bda62316cc: http://qudt.org/vocab/unit/M4
EMMO 33ae2d07 5526 4555 a0b4 8f4c031b5652: m4
EMMO 7f1dec83 d85e 4e1b b7bd c9442d4f5a64: m⁴
EMMO 967080e5 2f42 4eb2 a3a9 c58143e835f9: A unit associated with area moments of inertia. -- QUDT

ExchangeIntegral
type: Class
comment: constituent of the interaction energy between the spins of adjacent electrons in matter arising from the overlap of electron state functions
EMMO 1f1b164d ec6a 4faa 8d5e 88bda62316cc: https://qudt.org/vocab/quantitykind/ExchangeIntegral
EMMO 26bf1bef d192 4da6 b0eb d2209698fb54: https://www.wikidata.org/wiki/Q10882959
EMMO 8de5d5bf db1c 40ac b698 095ba3b18578: 12-34
EMMO 967080e5 2f42 4eb2 a3a9 c58143e835f9: constituent of the interaction energy between the spins of adjacent electrons in matter arising from the overlap of electron state functions

NonPositiveIntegerData
type: Class
comment: A data representing an integer number <= 0.
EMMO 8a137e9f 579c 4e28 baca e8980eb0c3db: EquivalentTo: hasDataValue some xsd:nonPositiveInteger
EMMO 967080e5 2f42 4eb2 a3a9 c58143e835f9: A data representing an integer number <= 0.

CubicMicroMetrePerCubicMetre
type: Class
subclass of: Restriction
  has value: 1e-18
subclass of: Restriction
  has value: 0.0
comment: Cubic micrometre per cubic metre unit.
EMMO 1f1b164d ec6a 4faa 8d5e 88bda62316cc: http://qudt.org/vocab/unit/MicroM3-PER-M3
EMMO 33ae2d07 5526 4555 a0b4 8f4c031b5652: um3.m-3
EMMO 7f1dec83 d85e 4e1b b7bd c9442d4f5a64: µm³/m³
EMMO 967080e5 2f42 4eb2 a3a9 c58143e835f9: Cubic micrometre per cubic metre unit.

WattPerSquareMetreKelvin
type: Class
subclass of: Restriction
  has value: 1.0
subclass of: Restriction
  has value: 0.0
comment: `Watt Per Square Meter Per Kelvin `(W m⁻² K⁻¹) is a unit in the category of Thermal heat transfer coefficient. It is also known as watt/square meter-kelvin. This unit is commonly used in the SI unit system. Watt Per Square Meter Per Kelvin (W m⁻² K⁻¹) has a dimension of MT⁻¹Q⁻¹ where M is mass, T is time, and Q is temperature. This unit is the standard SI unit in this category. -- QUDT
alternative label: Watt per Square Metre Kelvin
EMMO 1f1b164d ec6a 4faa 8d5e 88bda62316cc: http://qudt.org/vocab/unit/W-PER-M2-K
EMMO 33ae2d07 5526 4555 a0b4 8f4c031b5652: W.m-2.K-1
EMMO 7f1dec83 d85e 4e1b b7bd c9442d4f5a64: W/(m²⋅K)
EMMO 967080e5 2f42 4eb2 a3a9 c58143e835f9: `Watt Per Square Meter Per Kelvin `(W m⁻² K⁻¹) is a unit in the category of Thermal heat transfer coefficient. It is also known as watt/square meter-kelvin. This unit is commonly used in the SI unit system. Watt Per Square Meter Per Kelvin (W m⁻² K⁻¹) has a dimension of MT⁻¹Q⁻¹ where M is mass, T is time, and Q is temperature. This unit is the standard SI unit in this category. -- QUDT

ThermalTransmittanceUnit
type: Class
subclass of: Restriction
  has value: T-3 L0 M+1 I0 Θ-1 N0 J0
comment: The class of units with dimensionality 'ThermalTransmittance'.
EMMO 967080e5 2f42 4eb2 a3a9 c58143e835f9: The class of units with dimensionality 'ThermalTransmittance'.

CoefficientOfHeatTransfer
type: Class
subclass of: Restriction
comment: At a point on the surface separating two media with different thermodynamic temperatures, magnitude of the density of heat flow rate φ divided by the absolute value of temperature difference ΔT.
alternative label: ThermalTransmittance
EMMO 1f1b164d ec6a 4faa 8d5e 88bda62316cc: https://qudt.org/vocab/quantitykind/CoefficientOfHeatTransfer
EMMO 26bf1bef d192 4da6 b0eb d2209698fb54: https://www.wikidata.org/wiki/Q634340
EMMO 50c298c2 55a2 4068 b3ac 4e948c33181f: https://www.electropedia.org/iev/iev.nsf/display
EMMO 8de5d5bf db1c 40ac b698 095ba3b18578: 5-10.1
EMMO 967080e5 2f42 4eb2 a3a9 c58143e835f9: At a point on the surface separating two media with different thermodynamic temperatures, magnitude of the density of heat flow rate φ divided by the absolute value of temperature difference ΔT.

NeodymiumSymbol
type: Class
subclass of: Restriction
  has value: Nd
comment: The symbol that stands for the neodymium atom.
EMMO 967080e5 2f42 4eb2 a3a9 c58143e835f9: The symbol that stands for the neodymium atom.

ElectricCurrentPhasor
type: Class
EMMO 1f1b164d ec6a 4faa 8d5e 88bda62316cc: https://qudt.org/vocab/quantitykind/ElectricCurrentPhasor
EMMO 26bf1bef d192 4da6 b0eb d2209698fb54: https://www.wikidata.org/wiki/Q78514596
EMMO 8de5d5bf db1c 40ac b698 095ba3b18578: 6-49

ThalliumAtom
type: Class
subclass of: Restriction
subclass of: Restriction
  has value: 204.38
subclass of: Restriction
  has value: 81
comment: Atom subclass for thallium.
EMMO 967080e5 2f42 4eb2 a3a9 c58143e835f9: Atom subclass for thallium.

LinearElectricCurrentDensity
type: Class
subclass of: Restriction
comment: Surface density of electric charge multiplied by velocity
EMMO 1f1b164d ec6a 4faa 8d5e 88bda62316cc: https://qudt.org/vocab/quantitykind/LinearElectricCurrentDensity
EMMO 26bf1bef d192 4da6 b0eb d2209698fb54: https://www.wikidata.org/wiki/Q2356741
EMMO 50c298c2 55a2 4068 b3ac 4e948c33181f: https://www.electropedia.org/iev/iev.nsf/display
EMMO 8de5d5bf db1c 40ac b698 095ba3b18578: 6-9
EMMO 967080e5 2f42 4eb2 a3a9 c58143e835f9: Surface density of electric charge multiplied by velocity

Determiner
type: Class
subclass of: Restriction
comment: An 'interpreter' that perceives another 'entity' (the 'object') through a specific perception mechanism and produces a 'property' (the 'sign') that stands for the result of that particular perception.
EMMO 8a137e9f 579c 4e28 baca e8980eb0c3db: EquivalentTo: Estimator or Observer
EMMO 967080e5 2f42 4eb2 a3a9 c58143e835f9: An 'interpreter' that perceives another 'entity' (the 'object') through a specific perception mechanism and produces a 'property' (the 'sign') that stands for the result of that particular perception.

URI
type: Class
comment: A Uniform Resource Identifier (URI) is a compact sequence of characters that identifies an abstract or physical resource.
comment: URI = scheme ":" ["//" authority] path ["?" query] ["#" fragment]
EMMO 967080e5 2f42 4eb2 a3a9 c58143e835f9: A Uniform Resource Identifier (URI) is a compact sequence of characters that identifies an abstract or physical resource.
EMMO c7b62dd7 063a 4c2a 8504 42f7264ba83f: URI = scheme ":" ["//" authority] path ["?" query] ["#" fragment]

MicroGramPerCubicMetre
type: Class
subclass of: Restriction
  has value: 1e-09
subclass of: Restriction
  has value: 0.0
comment: 0.000000001-fold of the SI base unit kilogram divided by the power of the SI base unit metre with the exponent 3 -- QUDT
alternative label: Microgram Per Cubic Metre
EMMO 1f1b164d ec6a 4faa 8d5e 88bda62316cc: http://qudt.org/vocab/unit/MicroGM-PER-M3
EMMO 33ae2d07 5526 4555 a0b4 8f4c031b5652: ug.m-3
EMMO 33ae2d07 5526 4555 a0b4 8f4c031b5652: ug/m3
EMMO 7f1dec83 d85e 4e1b b7bd c9442d4f5a64: μg/m³
EMMO 967080e5 2f42 4eb2 a3a9 c58143e835f9: 0.000000001-fold of the SI base unit kilogram divided by the power of the SI base unit metre with the exponent 3 -- QUDT

NameData
type: Class

MetrePerSecond
type: Class
subclass of: Restriction
  has value: 1.0
subclass of: Restriction
  has value: 0.0
comment: Metre per second is an SI derived unit of both speed (scalar) and velocity (vector quantity which specifies both magnitude and a specific direction), defined by distance in metres divided by time in seconds. The official SI symbolic abbreviation is mu00b7s-1, or equivalently either m/s. -- QUDT
EMMO 0b1cbe60 d380 4787 b92e be26bdacf2c2: MTS
EMMO 1f1b164d ec6a 4faa 8d5e 88bda62316cc: http://qudt.org/vocab/unit/M-PER-SEC
EMMO 209ba1b3 149f 4ff0 b672 941610eafd72: http://www.ontology-of-units-of-measure.org/resource/om-2/metrePerSecond-Time
EMMO 33ae2d07 5526 4555 a0b4 8f4c031b5652: m.s-1
EMMO 7f1dec83 d85e 4e1b b7bd c9442d4f5a64: m/s
EMMO 967080e5 2f42 4eb2 a3a9 c58143e835f9: Metre per second is an SI derived unit of both speed (scalar) and velocity (vector quantity which specifies both magnitude and a specific direction), defined by distance in metres divided by time in seconds. The official SI symbolic abbreviation is mu00b7s-1, or equivalently either m/s. -- QUDT

KilogramPerSquareMetrePerPascalPerSecond
type: Class
subclass of: Restriction
  has value: 1.0
subclass of: Restriction
  has value: 0.0
alternative label: Kilograms per square metre per Pascal per second
EMMO 1f1b164d ec6a 4faa 8d5e 88bda62316cc: http://qudt.org/vocab/unit/KiloGM-PER-M2-PA-SEC
EMMO 7f1dec83 d85e 4e1b b7bd c9442d4f5a64: kg/(m²⋅s⋅Pa)
EMMO c84c6752 6d64 48cc 9500 e54a3c34898d: https://en.wikipedia.org/wiki/Perm_(unit)

MagneticMoment
type: Class
subclass of: Restriction
comment: A vector quantity equal to the product of the current, the loop area, and the unit vector normal to the loop plane, the direction of which corresponds to the loop orientation
alternative label: MagneticAreaMoment
EMMO 1f1b164d ec6a 4faa 8d5e 88bda62316cc: https://qudt.org/vocab/quantitykind/MagneticMoment
EMMO 26bf1bef d192 4da6 b0eb d2209698fb54: https://www.wikidata.org/wiki/Q242657
EMMO 50c298c2 55a2 4068 b3ac 4e948c33181f: https://www.electropedia.org/iev/iev.nsf/display
EMMO 8de5d5bf db1c 40ac b698 095ba3b18578: 6-23
EMMO 967080e5 2f42 4eb2 a3a9 c58143e835f9: A vector quantity equal to the product of the current, the loop area, and the unit vector normal to the loop plane, the direction of which corresponds to the loop orientation
EMMO fe015383 afb3 44a6 ae86 043628697aa2: https://doi.org/10.1351/goldbook.M03688

ParticleCurrentDensity
type: Class
subclass of: Restriction
comment: Number of particles per time and area crossing a surface.
EMMO 1f1b164d ec6a 4faa 8d5e 88bda62316cc: https://qudt.org/vocab/quantitykind/ParticleCurrent
EMMO 26bf1bef d192 4da6 b0eb d2209698fb54: https://www.wikidata.org/wiki/Q2400689
EMMO 8de5d5bf db1c 40ac b698 095ba3b18578: 10-48
EMMO 967080e5 2f42 4eb2 a3a9 c58143e835f9: Number of particles per time and area crossing a surface.

AstatineAtom
type: Class
subclass of: Restriction
subclass of: Restriction
  has value: 209.98715
subclass of: Restriction
  has value: 85
comment: Atom subclass for astatine.
EMMO 967080e5 2f42 4eb2 a3a9 c58143e835f9: Atom subclass for astatine.

CeriumAtom
type: Class
subclass of: Restriction
subclass of: Restriction
  has value: 140.116
subclass of: Restriction
  has value: 58
comment: Atom subclass for cerium.
EMMO 967080e5 2f42 4eb2 a3a9 c58143e835f9: Atom subclass for cerium.

Path
type: Class
comment: A path is a string of characters used to uniquely identify a location in a directory structure according to a particular convention.
example: /etc/fstab (UNIX-like path) C:\\Users\\John\\Desktop (DOS-like path)
EMMO 967080e5 2f42 4eb2 a3a9 c58143e835f9: A path is a string of characters used to uniquely identify a location in a directory structure according to a particular convention.

NiobiumSymbol
type: Class
subclass of: Restriction
  has value: Nb
comment: The symbol that stands for the niobium atom.
EMMO 967080e5 2f42 4eb2 a3a9 c58143e835f9: The symbol that stands for the niobium atom.

NanoSiemens
type: Class
subclass of: Restriction
  some values from: Siemens
subclass of: Restriction
  has value: 1e-09
subclass of: Restriction
  has value: 0.0
EMMO 1f1b164d ec6a 4faa 8d5e 88bda62316cc: http://qudt.org/vocab/unit/NanoS
EMMO 7f1dec83 d85e 4e1b b7bd c9442d4f5a64: nS

ScalarMagneticPotential
type: Class
subclass of: Restriction
comment: Scalar potential of an irrotational magnetic field strength.
EMMO 26bf1bef d192 4da6 b0eb d2209698fb54: https://www.wikidata.org/wiki/Q17162107
EMMO 50c298c2 55a2 4068 b3ac 4e948c33181f: https://www.electropedia.org/iev/iev.nsf/display
EMMO 8de5d5bf db1c 40ac b698 095ba3b18578: 6-37.1
EMMO 967080e5 2f42 4eb2 a3a9 c58143e835f9: Scalar potential of an irrotational magnetic field strength.

EnergyImparted
type: Class
comment: Sum of energies deposited by ionizing radiation in a given volume.
EMMO 1f1b164d ec6a 4faa 8d5e 88bda62316cc: https://qudt.org/vocab/quantitykind/EnergyImparted
EMMO 26bf1bef d192 4da6 b0eb d2209698fb54: https://www.wikidata.org/wiki/Q99526944
EMMO 50c298c2 55a2 4068 b3ac 4e948c33181f: https://www.electropedia.org/iev/iev.nsf/display
EMMO 8de5d5bf db1c 40ac b698 095ba3b18578: 10-80.1
EMMO 967080e5 2f42 4eb2 a3a9 c58143e835f9: Sum of energies deposited by ionizing radiation in a given volume.

ElectricMobilityUnit
type: Class
subclass of: Restriction
  has value: T+2 L0 M-1 I+1 Θ0 N0 J0
comment: The class of units with dimensionality 'ElectricMobility'.
EMMO 967080e5 2f42 4eb2 a3a9 c58143e835f9: The class of units with dimensionality 'ElectricMobility'.

NewtonMetrePerKilogram
type: Class
subclass of: Restriction
  has value: 1.0
subclass of: Restriction
  has value: 0.0
comment: product of the derived SI unit newton and the SI base unit metre divided by the SI base unit kilogram -- QUDT
alternative label: Newton Metre Per Kilogram
EMMO 1f1b164d ec6a 4faa 8d5e 88bda62316cc: http://qudt.org/vocab/unit/N-M-PER-KiloGM
EMMO 33ae2d07 5526 4555 a0b4 8f4c031b5652: N.m.kg-1
EMMO 7f1dec83 d85e 4e1b b7bd c9442d4f5a64: N⋅m/kg
EMMO 967080e5 2f42 4eb2 a3a9 c58143e835f9: product of the derived SI unit newton and the SI base unit metre divided by the SI base unit kilogram -- QUDT

BecquerelSecondPerCubicMetre
type: Class
subclass of: Restriction
  has value: 1.0
subclass of: Restriction
  has value: 0.0
comment: Becquerels second per cubic metre.
EMMO 1f1b164d ec6a 4faa 8d5e 88bda62316cc: http://qudt.org/vocab/unit/BQ-SEC-PER-M3
EMMO 33ae2d07 5526 4555 a0b4 8f4c031b5652: Bq.s.m-3
EMMO 7f1dec83 d85e 4e1b b7bd c9442d4f5a64: Bq⋅s/m³
EMMO 967080e5 2f42 4eb2 a3a9 c58143e835f9: Becquerels second per cubic metre.

PartialPressure
type: Class
comment: Hypothetical pressure of gas if it alone occupied the volume of the mixture at the same temperature.
EMMO 1f1b164d ec6a 4faa 8d5e 88bda62316cc: https://qudt.org/vocab/quantitykind/PartialPressure
EMMO 26bf1bef d192 4da6 b0eb d2209698fb54: https://www.wikidata.org/wiki/Q27165
EMMO 8de5d5bf db1c 40ac b698 095ba3b18578: 9-19
EMMO 967080e5 2f42 4eb2 a3a9 c58143e835f9: Hypothetical pressure of gas if it alone occupied the volume of the mixture at the same temperature.
EMMO fe015383 afb3 44a6 ae86 043628697aa2: https://doi.org/10.1351/goldbook.P04420

TotalCurrent
type: Class
comment: Sum of electric current and displacement current
EMMO 1f1b164d ec6a 4faa 8d5e 88bda62316cc: https://qudt.org/vocab/quantitykind/TotalCurrent
EMMO 26bf1bef d192 4da6 b0eb d2209698fb54: https://www.wikidata.org/wiki/Q77679732
EMMO 50c298c2 55a2 4068 b3ac 4e948c33181f: https://www.electropedia.org/iev/iev.nsf/display
EMMO 8de5d5bf db1c 40ac b698 095ba3b18578: 6-19.2
EMMO 967080e5 2f42 4eb2 a3a9 c58143e835f9: Sum of electric current and displacement current

SquareDegreeCelsiusPerSecond
type: Class
comment: Square degree Celsius per second.
EMMO 1f1b164d ec6a 4faa 8d5e 88bda62316cc: http://qudt.org/vocab/unit/DEG_C2-PER-SEC
EMMO 33ae2d07 5526 4555 a0b4 8f4c031b5652: K2.s-1
EMMO 7f1dec83 d85e 4e1b b7bd c9442d4f5a64: °C²⋅s
EMMO 967080e5 2f42 4eb2 a3a9 c58143e835f9: Square degree Celsius per second.

SquareTemperaturePerTimeUnit
type: Class
subclass of: Restriction
  has value: T-1 L0 M0 I0 Θ+2 N0 J0
comment: The class of units with dimensionality 'SquareTemperaturePerTime'.
EMMO 967080e5 2f42 4eb2 a3a9 c58143e835f9: The class of units with dimensionality 'SquareTemperaturePerTime'.

SolidGasSuspension
type: Class
comment: A coarse dispersion of gas in a solid continuum phase.
EMMO 967080e5 2f42 4eb2 a3a9 c58143e835f9: A coarse dispersion of gas in a solid continuum phase.

CyclotronAngularFrequency
type: Class
comment: Quotient of the product of the electric charge of a particle and the magnitude of the magnetic flux density of the magnetic field, and the particle mass.
EMMO 1f1b164d ec6a 4faa 8d5e 88bda62316cc: https://qudt.org/vocab/quantitykind/CyclotronAngularFrequency
EMMO 26bf1bef d192 4da6 b0eb d2209698fb54: https://www.wikidata.org/wiki/Q97708211
EMMO 8de5d5bf db1c 40ac b698 095ba3b18578: 10-16
EMMO 967080e5 2f42 4eb2 a3a9 c58143e835f9: Quotient of the product of the electric charge of a particle and the magnitude of the magnetic flux density of the magnetic field, and the particle mass.

MicroGramPerSquareCentiMetre
type: Class
subclass of: Restriction
  some values from: GramPerSquareCentiMetre
subclass of: Restriction
  has value: 0.01
subclass of: Restriction
  has value: 0.0
comment: A unit of mass per area, equivalent to 0.01 grammes per square metre -- QUDT
alternative label: Microgram per square centimetre
EMMO 1f1b164d ec6a 4faa 8d5e 88bda62316cc: http://qudt.org/vocab/unit/MicroG-PER-CentiM2
EMMO 7f1dec83 d85e 4e1b b7bd c9442d4f5a64: µg/cm²
EMMO 967080e5 2f42 4eb2 a3a9 c58143e835f9: A unit of mass per area, equivalent to 0.01 grammes per square metre -- QUDT

SurfaceCoefficientOfHeatTransfer
type: Class
comment: Coefficient of heat transfer when heat exchange takes place between a body at thermodynamic temperature Ts and its surroundings that are at a reference temperature Tr.
EMMO 1f1b164d ec6a 4faa 8d5e 88bda62316cc: https://qudt.org/vocab/quantitykind/SurfaceCoefficientOfHeatTransfer
EMMO 26bf1bef d192 4da6 b0eb d2209698fb54: https://www.wikidata.org/wiki/Q74770365
EMMO 50c298c2 55a2 4068 b3ac 4e948c33181f: https://www.electropedia.org/iev/iev.nsf/display
EMMO 8de5d5bf db1c 40ac b698 095ba3b18578: 5-10.2
EMMO 967080e5 2f42 4eb2 a3a9 c58143e835f9: Coefficient of heat transfer when heat exchange takes place between a body at thermodynamic temperature Ts and its surroundings that are at a reference temperature Tr.

PerSecondSquareMetreSteradian
type: Class
subclass of: Restriction
  has value: 1.0
subclass of: Restriction
  has value: 0.0
comment: Per Second Square Meter Steradian is a denominator unit with dimensions /sec-m²-sr. -- QUDT
alternative label: ReciprocalSecondSquareMetreSteradian
EMMO 1f1b164d ec6a 4faa 8d5e 88bda62316cc: http://qudt.org/vocab/unit/PER-SEC-M2-SR
EMMO 33ae2d07 5526 4555 a0b4 8f4c031b5652: /(s.m2.sr)
EMMO 33ae2d07 5526 4555 a0b4 8f4c031b5652: s-1.m-2.sr-1
EMMO 7f1dec83 d85e 4e1b b7bd c9442d4f5a64: /s⋅m²⋅sr
EMMO 967080e5 2f42 4eb2 a3a9 c58143e835f9: Per Second Square Meter Steradian is a denominator unit with dimensions /sec-m²-sr. -- QUDT

MegaVoltPerMetre
type: Class
subclass of: Restriction
  some values from: VoltPerMetre
subclass of: Restriction
  has value: 1000000.0
subclass of: Restriction
  has value: 0.0
comment: 1,000,000-fold of the SI derived unit volt divided by the SI base unit metre -- QUDT
alternative label: Megavolt Per Metre
EMMO 1f1b164d ec6a 4faa 8d5e 88bda62316cc: http://qudt.org/vocab/unit/MegaV-PER-M
EMMO 33ae2d07 5526 4555 a0b4 8f4c031b5652: MV.m-1
EMMO 7f1dec83 d85e 4e1b b7bd c9442d4f5a64: MV/m
EMMO 967080e5 2f42 4eb2 a3a9 c58143e835f9: 1,000,000-fold of the SI derived unit volt divided by the SI base unit metre -- QUDT

NewtonMetrePerMetre
type: Class
subclass of: Restriction
  has value: 1.0
subclass of: Restriction
  has value: 0.0
comment: This is the SI unit for the rolling resistance, which is equivalent to drag force in newton -- QUDT
alternative label: Newton metre per metre
EMMO 1f1b164d ec6a 4faa 8d5e 88bda62316cc: http://qudt.org/vocab/unit/N-M-PER-M
EMMO 7f1dec83 d85e 4e1b b7bd c9442d4f5a64: N⋅m/m
EMMO 967080e5 2f42 4eb2 a3a9 c58143e835f9: This is the SI unit for the rolling resistance, which is equivalent to drag force in newton -- QUDT

Uncoded
type: Class
subclass of: Restriction
comment: A conventional that provides no possibility to infer the characteristics of the object to which it refers.
example: A random generated id for a product.
EMMO 967080e5 2f42 4eb2 a3a9 c58143e835f9: A conventional that provides no possibility to infer the characteristics of the object to which it refers.

AmorphousMaterial
type: Class
alternative label: NonCrystallineMaterial

MaterialByStructure
type: Class

FormingFromGas
type: Class

FORTRAN
type: Class

DarmastadtiumAtom
type: Class
subclass of: Restriction
subclass of: Restriction
  has value: 281.165
subclass of: Restriction
  has value: 110
comment: Atom subclass for darmastadtium.
EMMO 967080e5 2f42 4eb2 a3a9 c58143e835f9: Atom subclass for darmastadtium.

PhaseCoefficient
type: Class
comment: Change of phase angle with the length along the path travelled by a plane wave.
comment: The imaginary part of the propagation coefficient.
alternative label: PhaseChangeCoefficient
EMMO 1f1b164d ec6a 4faa 8d5e 88bda62316cc: https://qudt.org/vocab/quantitykind/PhaseCoefficient
EMMO 26bf1bef d192 4da6 b0eb d2209698fb54: https://www.wikidata.org/wiki/Q32745742
EMMO 50c298c2 55a2 4068 b3ac 4e948c33181f: https://www.electropedia.org/iev/iev.nsf/display
EMMO 8de5d5bf db1c 40ac b698 095ba3b18578: 3-26.2
EMMO 967080e5 2f42 4eb2 a3a9 c58143e835f9: Change of phase angle with the length along the path travelled by a plane wave.
EMMO c7b62dd7 063a 4c2a 8504 42f7264ba83f: The imaginary part of the propagation coefficient.
EMMO c84c6752 6d64 48cc 9500 e54a3c34898d: https://en.wikipedia.org/wiki/Propagation_constant#Phase_constant

PhosphorusSymbol
type: Class
subclass of: Restriction
  has value: P
comment: The symbol that stands for the phosphorus atom.
EMMO 967080e5 2f42 4eb2 a3a9 c58143e835f9: The symbol that stands for the phosphorus atom.

ElectricCurrentPerTemperatureUnit
type: Class
subclass of: Restriction
  has value: T0 L0 M0 I+1 Θ-1 N0 J0
comment: The class of units with dimensionality 'ElectricCurrentPerTemperature'.
EMMO 967080e5 2f42 4eb2 a3a9 c58143e835f9: The class of units with dimensionality 'ElectricCurrentPerTemperature'.

MolePerSquareMetrePerSecondPerMetrePerSteradian
type: Class
subclass of: Restriction
  has value: 1.0
subclass of: Restriction
  has value: 0.0
comment: Moles per square metre per second per metre per steradian.
EMMO 1f1b164d ec6a 4faa 8d5e 88bda62316cc: http://qudt.org/vocab/unit/MOL-PER-M2-SEC-M-SR
EMMO 33ae2d07 5526 4555 a0b4 8f4c031b5652: mol.m-2.s-1.m-1.sr-1
EMMO 7f1dec83 d85e 4e1b b7bd c9442d4f5a64: mol/(m²⋅s⋅m⋅sr)
EMMO 967080e5 2f42 4eb2 a3a9 c58143e835f9: Moles per square metre per second per metre per steradian.

GramMilliMetre
type: Class
subclass of: Restriction
  has value: 1e-06
subclass of: Restriction
  has value: 0.0
comment: unit of the imbalance as product of the 0.001-fold of the SI base unit kilogram and the 0.001-fold of the SI base unit metre -- QUDT
alternative label: Gram Millimetre
EMMO 1f1b164d ec6a 4faa 8d5e 88bda62316cc: http://qudt.org/vocab/unit/GM-MilliM
EMMO 33ae2d07 5526 4555 a0b4 8f4c031b5652: g.mm
EMMO 7f1dec83 d85e 4e1b b7bd c9442d4f5a64: g·mm
EMMO 967080e5 2f42 4eb2 a3a9 c58143e835f9: unit of the imbalance as product of the 0.001-fold of the SI base unit kilogram and the 0.001-fold of the SI base unit metre -- QUDT

LengthMassUnit
type: Class
subclass of: Restriction
  has value: T0 L+1 M+1 I0 Θ0 N0 J0
comment: The class of units with dimensionality 'LengthMass'.
EMMO 967080e5 2f42 4eb2 a3a9 c58143e835f9: The class of units with dimensionality 'LengthMass'.

PicoSecond
type: Class
subclass of: Restriction
  some values from: Second
subclass of: Restriction
  has value: 1e-12
subclass of: Restriction
  has value: 0.0
comment: 0.000000000001-fold of the SI base unit second -- QUDT
EMMO 1f1b164d ec6a 4faa 8d5e 88bda62316cc: http://qudt.org/vocab/unit/PicoSEC
EMMO 33ae2d07 5526 4555 a0b4 8f4c031b5652: ps
EMMO 7f1dec83 d85e 4e1b b7bd c9442d4f5a64: ps
EMMO 967080e5 2f42 4eb2 a3a9 c58143e835f9: 0.000000000001-fold of the SI base unit second -- QUDT

PicoLitre
type: Class
subclass of: Restriction
  some values from: Litre
subclass of: Restriction
  has value: 1e-15
subclass of: Restriction
  has value: 0.0
comment: 0.000000000001-fold of the unit litre -- QUDT
EMMO 1f1b164d ec6a 4faa 8d5e 88bda62316cc: http://qudt.org/vocab/unit/PicoL
EMMO 33ae2d07 5526 4555 a0b4 8f4c031b5652: pL
EMMO 7f1dec83 d85e 4e1b b7bd c9442d4f5a64: pL
EMMO 967080e5 2f42 4eb2 a3a9 c58143e835f9: 0.000000000001-fold of the unit litre -- QUDT

OsmoticPressure
type: Class
comment: Measure of the tendency of a solution to take in pure solvent by osmosis.
EMMO 1f1b164d ec6a 4faa 8d5e 88bda62316cc: https://qudt.org/vocab/quantitykind/OsmoticPressure
EMMO 26bf1bef d192 4da6 b0eb d2209698fb54: https://www.wikidata.org/wiki/Q193135
EMMO 8de5d5bf db1c 40ac b698 095ba3b18578: 9-28
EMMO 967080e5 2f42 4eb2 a3a9 c58143e835f9: Measure of the tendency of a solution to take in pure solvent by osmosis.
EMMO fe015383 afb3 44a6 ae86 043628697aa2: https://doi.org/10.1351/goldbook.O04344

SerialWorkflow
type: Class
comment: A workflow whose tasks are tiles of a sequence.
EMMO 967080e5 2f42 4eb2 a3a9 c58143e835f9: A workflow whose tasks are tiles of a sequence.

NewtonPerSquareCentiMetre
type: Class
subclass of: Restriction
  has value: 10000.0
subclass of: Restriction
  has value: 0.0
comment: derived SI unit newton divided by the 0.0001-fold of the power of the SI base unit metre by exponent 2 -- QUDT
alternative label: Newton Per Square Centimetre
EMMO 1f1b164d ec6a 4faa 8d5e 88bda62316cc: http://qudt.org/vocab/unit/N-PER-CentiM2
EMMO 33ae2d07 5526 4555 a0b4 8f4c031b5652: N.cm-2
EMMO 7f1dec83 d85e 4e1b b7bd c9442d4f5a64: N/cm²
EMMO 967080e5 2f42 4eb2 a3a9 c58143e835f9: derived SI unit newton divided by the 0.0001-fold of the power of the SI base unit metre by exponent 2 -- QUDT

GasSolidSuspension
type: Class
comment: A coarse dispersion of solid in a gas continuum phase.
example: Dust, sand storm.
EMMO 967080e5 2f42 4eb2 a3a9 c58143e835f9: A coarse dispersion of solid in a gas continuum phase.

CubicMetrePerMole
type: Class
subclass of: Restriction
  has value: 1.0
subclass of: Restriction
  has value: 0.0
comment: The molar volume, symbol Vm, is the volume occupied by one mole of a substance (chemical element or chemical compound) at a given temperature and pressure. It is equal to the molar mass (M) divided by the mass density. It has the SI unit cubic metres per mole m3/mol, although it is more practical to use the units cubic decimetres per mole dm3/mol for gases and cubic centimetres per mole cm3/mol for liquids and solids. -- QUDT
alternative label: Cubic Metre per Mole
EMMO 1f1b164d ec6a 4faa 8d5e 88bda62316cc: http://qudt.org/vocab/unit/M3-PER-MOL
EMMO 33ae2d07 5526 4555 a0b4 8f4c031b5652: m3.mol-1
EMMO 33ae2d07 5526 4555 a0b4 8f4c031b5652: m3/mol
EMMO 7f1dec83 d85e 4e1b b7bd c9442d4f5a64: m³/mol
EMMO 967080e5 2f42 4eb2 a3a9 c58143e835f9: The molar volume, symbol Vm, is the volume occupied by one mole of a substance (chemical element or chemical compound) at a given temperature and pressure. It is equal to the molar mass (M) divided by the mass density. It has the SI unit cubic metres per mole m3/mol, although it is more practical to use the units cubic decimetres per mole dm3/mol for gases and cubic centimetres per mole cm3/mol for liquids and solids. -- QUDT

DataProcessing
type: Class
subclass of: Restriction
comment: A computation that provides a data output following the elaboration of some input data, using a data processing application.
EMMO 967080e5 2f42 4eb2 a3a9 c58143e835f9: A computation that provides a data output following the elaboration of some input data, using a data processing application.

DoseEquivalent
type: Class
subclass of: Restriction
comment: A dose quantity used in the International Commission on Radiological Protection (ICRP) system of radiological protection.
EMMO 1f1b164d ec6a 4faa 8d5e 88bda62316cc: http://qudt.org/vocab/quantitykind/DoseEquivalent
EMMO 8de5d5bf db1c 40ac b698 095ba3b18578: 10-83.1
EMMO 967080e5 2f42 4eb2 a3a9 c58143e835f9: A dose quantity used in the International Commission on Radiological Protection (ICRP) system of radiological protection.
EMMO fe015383 afb3 44a6 ae86 043628697aa2: https://doi.org/10.1351/goldbook.E02101

SquareMilliMetre
type: Class
subclass of: Restriction
  has value: 1e-06
subclass of: Restriction
  has value: 0.0
comment: 0.000001-fold of the power of the SI base unit metre with the exponent 2 -- QUDT
alternative label: Square Millimetre
EMMO 1f1b164d ec6a 4faa 8d5e 88bda62316cc: http://qudt.org/vocab/unit/MilliM2
EMMO 33ae2d07 5526 4555 a0b4 8f4c031b5652: mm2
EMMO 7f1dec83 d85e 4e1b b7bd c9442d4f5a64: mm²
EMMO 967080e5 2f42 4eb2 a3a9 c58143e835f9: 0.000001-fold of the power of the SI base unit metre with the exponent 2 -- QUDT

MicroVoltPerMetre
type: Class
subclass of: Restriction
  some values from: VoltPerMetre
subclass of: Restriction
  has value: 1e-06
subclass of: Restriction
  has value: 0.0
comment: 0.000001-fold of the SI derived unit volt divided by the SI base unit metre -- QUDT
alternative label: Microvolt Per Metre
EMMO 1f1b164d ec6a 4faa 8d5e 88bda62316cc: http://qudt.org/vocab/unit/MicroV-PER-M
EMMO 33ae2d07 5526 4555 a0b4 8f4c031b5652: uV.m-1
EMMO 7f1dec83 d85e 4e1b b7bd c9442d4f5a64: µV/m
EMMO 967080e5 2f42 4eb2 a3a9 c58143e835f9: 0.000001-fold of the SI derived unit volt divided by the SI base unit metre -- QUDT

MetallicMaterial
type: Class

Command
type: Class
comment: A command must be interpretable by the computer system.
comment: An instruction to a computer system to perform a given task.
example: From a bash shell would e.g. `ls` be a command. Another example of a shell command would be `/path/to/executable arg1 arg2`.
EMMO c7b62dd7 063a 4c2a 8504 42f7264ba83f: A command must be interpretable by the computer system.
EMMO c7b62dd7 063a 4c2a 8504 42f7264ba83f: Commands are typically performed from a shell or a shell script, but not limited to them.

NihoniumSymbol
type: Class
subclass of: Restriction
  has value: Nh
comment: The symbol that stands for the nihonium atom.
EMMO 967080e5 2f42 4eb2 a3a9 c58143e835f9: The symbol that stands for the nihonium atom.

NanoBecquerel
type: Class
subclass of: Restriction
  some values from: Becquerel
subclass of: Restriction
  has value: 1e-09
subclass of: Restriction
  has value: 0.0
EMMO 1f1b164d ec6a 4faa 8d5e 88bda62316cc: http://qudt.org/vocab/unit/NanoBQ
EMMO 7f1dec83 d85e 4e1b b7bd c9442d4f5a64: nBq

MathematicalOperator
type: Class
comment: A mapping that acts on elements of one space and produces elements of another space.
example: The algebraic operator '+' that acts on two real numbers and produces one real number.
example: The differential operator that acts on a C1 real function and produces another real function.
EMMO 967080e5 2f42 4eb2 a3a9 c58143e835f9: A mapping that acts on elements of one space and produces elements of another space.

HexBinaryData
type: Class
comment: Hexadecimal encoding of binary data, using the alphabet [0-9a-f].
EMMO 8a137e9f 579c 4e28 baca e8980eb0c3db: EquivalentTo: hasDataValue some xsd:hexBinary
EMMO 967080e5 2f42 4eb2 a3a9 c58143e835f9: Hexadecimal encoding of binary data, using the alphabet [0-9a-f].

FranciumSymbol
type: Class
subclass of: Restriction
  has value: Fr
comment: The symbol that stands for the francium atom.
EMMO 967080e5 2f42 4eb2 a3a9 c58143e835f9: The symbol that stands for the francium atom.

TemperaturePerPressureUnit
type: Class
subclass of: Restriction
  has value: T+2 L+1 M-1 I0 Θ+1 N0 J0
comment: The class of units with dimensionality 'TemperaturePerPressure'.
EMMO 967080e5 2f42 4eb2 a3a9 c58143e835f9: The class of units with dimensionality 'TemperaturePerPressure'.

Namer
type: Class
comment: An interpreter who assigns a name to an object without any motivations related to the object characters.
EMMO 967080e5 2f42 4eb2 a3a9 c58143e835f9: An interpreter who assigns a name to an object without any motivations related to the object characters.

GramPerSecond
type: Class
subclass of: Restriction
  has value: 0.001
subclass of: Restriction
  has value: 0.0
comment: 0,001fold of the SI base unit kilogram divided by the SI base unit second -- QUDT
alternative label: Gram Per Second
EMMO 1f1b164d ec6a 4faa 8d5e 88bda62316cc: http://qudt.org/vocab/unit/GM-PER-SEC
EMMO 33ae2d07 5526 4555 a0b4 8f4c031b5652: g.s-1
EMMO 7f1dec83 d85e 4e1b b7bd c9442d4f5a64: g/s
EMMO 967080e5 2f42 4eb2 a3a9 c58143e835f9: 0,001fold of the SI base unit kilogram divided by the SI base unit second -- QUDT

NeutronNumber
type: Class
comment: Atomic number (proton number) plus neutron number equals mass number.
comment: Number of neutrons in an atomic nucleus.
EMMO 26bf1bef d192 4da6 b0eb d2209698fb54: https://www.wikidata.org/wiki/Q970319
EMMO 50c298c2 55a2 4068 b3ac 4e948c33181f: https://www.electropedia.org/iev/iev.nsf/display
EMMO 8de5d5bf db1c 40ac b698 095ba3b18578: 10-1.2
EMMO 967080e5 2f42 4eb2 a3a9 c58143e835f9: Number of neutrons in an atomic nucleus.
EMMO c7b62dd7 063a 4c2a 8504 42f7264ba83f: Atomic number (proton number) plus neutron number equals mass number.
EMMO c84c6752 6d64 48cc 9500 e54a3c34898d: https://en.wikipedia.org/wiki/Neutron_number
EMMO fe015383 afb3 44a6 ae86 043628697aa2: https://doi.org/10.1351/goldbook.N04119

ChromiumSymbol
type: Class
subclass of: Restriction
  has value: Cr
comment: The symbol that stands for the chromium atom.
EMMO 967080e5 2f42 4eb2 a3a9 c58143e835f9: The symbol that stands for the chromium atom.

PhosphorusAtom
type: Class
subclass of: Restriction
subclass of: Restriction
  has value: 30.973761998
subclass of: Restriction
  has value: 15
comment: Atom subclass for phosphorus.
EMMO 967080e5 2f42 4eb2 a3a9 c58143e835f9: Atom subclass for phosphorus.

FranciumAtom
type: Class
subclass of: Restriction
subclass of: Restriction
  has value: 223.01974
subclass of: Restriction
  has value: 87
comment: Atom subclass for francium.
EMMO 967080e5 2f42 4eb2 a3a9 c58143e835f9: Atom subclass for francium.

SeaborgiumAtom
type: Class
subclass of: Restriction
subclass of: Restriction
  has value: 271.134
subclass of: Restriction
  has value: 106
comment: Atom subclass for seaborgium.
EMMO 967080e5 2f42 4eb2 a3a9 c58143e835f9: Atom subclass for seaborgium.

ProductionEngineering
type: Class

ProcessEngineeringProcess
type: Class
comment: Deals with entities that have a undefined shape. Undefined means that the actual shape of the entity that is produced is not relevant for the definition of the process. In fact, everything has a shape, but in process engineering this is not relevant. e.g. the fact that steel comes in sheets is not relevant for the definition of steel material generated in a steel-making process.
EMMO c7b62dd7 063a 4c2a 8504 42f7264ba83f: Deals with entities that have a undefined shape. Undefined means that the actual shape of the entity that is produced is not relevant for the definition of the process. In fact, everything has a shape, but in process engineering this is not relevant. e.g. the fact that steel comes in sheets is not relevant for the definition of steel material generated in a steel-making process.
EMMO c84c6752 6d64 48cc 9500 e54a3c34898d: https://de.wikipedia.org/wiki/Verfahrenstechnik

Division
type: Class
subclass of: Restriction
  has value: /

MegaPascalCubicMetrePerSecond
type: Class
subclass of: Restriction
  some values from: PascalCubicMetrePerSecond
subclass of: Restriction
  has value: 1000000.0
subclass of: Restriction
  has value: 0.0
comment: product out of the 1,000,000-fold of the SI derived unit pascal and the power of the SI base unit metre with the exponent 3 divided by the SI base unit second -- QUDT
alternative label: Megapascal Cubic Metre Per Second
EMMO 1f1b164d ec6a 4faa 8d5e 88bda62316cc: http://qudt.org/vocab/unit/MegaPA-M3-PER-SEC
EMMO 33ae2d07 5526 4555 a0b4 8f4c031b5652: MPa.m3.s-1
EMMO 7f1dec83 d85e 4e1b b7bd c9442d4f5a64: MPa⋅m³/s
EMMO 967080e5 2f42 4eb2 a3a9 c58143e835f9: product out of the 1,000,000-fold of the SI derived unit pascal and the power of the SI base unit metre with the exponent 3 divided by the SI base unit second -- QUDT

KiloVoltAmpere
type: Class
subclass of: Restriction
  some values from: VoltAmpere
subclass of: Restriction
  has value: 1000.0
subclass of: Restriction
  has value: 0.0
comment: 1 000-fold of the product of the SI derived unit volt and the SI base unit ampere -- QUDT
alternative label: Kilovolt Ampere
EMMO 1f1b164d ec6a 4faa 8d5e 88bda62316cc: http://qudt.org/vocab/unit/KiloV-A
EMMO 33ae2d07 5526 4555 a0b4 8f4c031b5652: kV.A
EMMO 7f1dec83 d85e 4e1b b7bd c9442d4f5a64: kV⋅A
EMMO 967080e5 2f42 4eb2 a3a9 c58143e835f9: 1 000-fold of the product of the SI derived unit volt and the SI base unit ampere -- QUDT

NewtonMetrePerAmpere
type: Class
subclass of: Restriction
  has value: 1.0
subclass of: Restriction
  has value: 0.0
comment: product of the SI derived unit newton and the SI base unit metre divided by the SI base unit ampere -- QUDT
alternative label: Newton Metre Per Ampere
EMMO 1f1b164d ec6a 4faa 8d5e 88bda62316cc: http://qudt.org/vocab/unit/N-M-PER-A
EMMO 33ae2d07 5526 4555 a0b4 8f4c031b5652: N.m.A-1
EMMO 7f1dec83 d85e 4e1b b7bd c9442d4f5a64: N⋅m/A
EMMO 967080e5 2f42 4eb2 a3a9 c58143e835f9: product of the SI derived unit newton and the SI base unit metre divided by the SI base unit ampere -- QUDT

ManufacturingDevice
type: Class
comment: A device that is designed to participate to a manufacturing process.
EMMO 967080e5 2f42 4eb2 a3a9 c58143e835f9: A device that is designed to participate to a manufacturing process.

Device
type: Class
comment: An object which is instrumental for reaching a particular purpose through its characteristic functioning process, with particular reference to mechanical or electronic equipment.
alternative label: Equipment
alternative label: Machine
EMMO 967080e5 2f42 4eb2 a3a9 c58143e835f9: An object which is instrumental for reaching a particular purpose through its characteristic functioning process, with particular reference to mechanical or electronic equipment.

SiliconSymbol
type: Class
subclass of: Restriction
  has value: Si
comment: The symbol that stands for the silicon atom.
EMMO 967080e5 2f42 4eb2 a3a9 c58143e835f9: The symbol that stands for the silicon atom.

Pictorial
type: Class
comment: A 'Graphical' that stands for a real world object that shows a recognizable pictorial pattern without being necessarily associated to a symbolic language.
example: A drawing of a cat. A circle on a paper sheet. The Mona Lisa.
EMMO 967080e5 2f42 4eb2 a3a9 c58143e835f9: A 'Graphical' that stands for a real world object that shows a recognizable pictorial pattern without being necessarily associated to a symbolic language.

AmountOfSubstance
type: Class
subclass of: Restriction
comment: "In the name “amount of substance”, the word “substance” will typically be replaced by words to specify the substance concerned in any particular application, for example “amount of hydrogen chloride, HCl”, or “amount of benzene, C6H6 ”. It is important to give a precise definition of the entity involved (as emphasized in the definition of the mole); this should preferably be done by specifying the molecular chemical formula of the material involved. Although the word “amount” has a more general dictionary definition, the abbreviation of the full name “amount of substance” to “amount” may be used for brevity." -- SI Brochure
comment: The number of elementary entities present.
EMMO 1f1b164d ec6a 4faa 8d5e 88bda62316cc: http://qudt.org/vocab/quantitykind/AmountOfSubstance
EMMO 8de5d5bf db1c 40ac b698 095ba3b18578: 9-2
EMMO 967080e5 2f42 4eb2 a3a9 c58143e835f9: The number of elementary entities present.
EMMO fe015383 afb3 44a6 ae86 043628697aa2: https://doi.org/10.1351/goldbook.A00297

ExposureRate
type: Class
subclass of: Restriction
comment: Time derivative of exposure.
EMMO 1f1b164d ec6a 4faa 8d5e 88bda62316cc: https://qudt.org/vocab/quantitykind/ExposureRate
EMMO 26bf1bef d192 4da6 b0eb d2209698fb54: https://www.wikidata.org/wiki/Q99720212
EMMO 50c298c2 55a2 4068 b3ac 4e948c33181f: https://www.electropedia.org/iev/iev.nsf/display
EMMO 8de5d5bf db1c 40ac b698 095ba3b18578: 10-89
EMMO 967080e5 2f42 4eb2 a3a9 c58143e835f9: Time derivative of exposure.

AmperePerJoule
type: Class
subclass of: Restriction
  has value: 1.0
subclass of: Restriction
  has value: 0.0
comment: The inverse measure of joule-per-ampere or weber. The measure for the reciprical of magnetic flux. -- QUDT
alternative label: Ampere per Joule
EMMO 1f1b164d ec6a 4faa 8d5e 88bda62316cc: http://qudt.org/vocab/unit/A-PER-J
EMMO 33ae2d07 5526 4555 a0b4 8f4c031b5652: A.J-1
EMMO 33ae2d07 5526 4555 a0b4 8f4c031b5652: A/J
EMMO 7f1dec83 d85e 4e1b b7bd c9442d4f5a64: A/J
EMMO 967080e5 2f42 4eb2 a3a9 c58143e835f9: The inverse measure of joule-per-ampere or weber. The measure for the reciprical of magnetic flux. -- QUDT

ElectricCurrentPerUnitEnergyUnit
type: Class
subclass of: Restriction
  has value: T+3 L-2 M-1 I+1 Θ0 N0 J0
comment: The class of units with dimensionality 'ElectricCurrentPerUnitEnergy'.
EMMO 967080e5 2f42 4eb2 a3a9 c58143e835f9: The class of units with dimensionality 'ElectricCurrentPerUnitEnergy'.

RadianPerSecond
type: Class
subclass of: Restriction
  has value: 1.0
subclass of: Restriction
  has value: 0.0
comment: "Radian per Second" is the SI unit of rotational speed (angular velocity), and, also the unit of angular frequency. The radian per second is defined as the change in the orientation of an object, in radians, every second. -- QUDT
alternative label: radian per second
EMMO 1f1b164d ec6a 4faa 8d5e 88bda62316cc: http://qudt.org/vocab/unit/RAD-PER-SEC
EMMO 33ae2d07 5526 4555 a0b4 8f4c031b5652: rad.s-1
EMMO 33ae2d07 5526 4555 a0b4 8f4c031b5652: rad/s
EMMO 7f1dec83 d85e 4e1b b7bd c9442d4f5a64: rad/s
EMMO 967080e5 2f42 4eb2 a3a9 c58143e835f9: "Radian per Second" is the SI unit of rotational speed (angular velocity), and, also the unit of angular frequency. The radian per second is defined as the change in the orientation of an object, in radians, every second. -- QUDT

Second
type: Class
subclass of: Restriction
  has value: s
comment: The second, symbol s, is the SI unit of time. It is defined by taking the fixed numerical value of the caesium frequency ∆νCs, the unperturbed ground-state hyperfine transition frequency of the caesium 133 atom, to be 9192631770 when expressed in the unit Hz, which is equal to s−1.
EMMO 0b1cbe60 d380 4787 b92e be26bdacf2c2: SEC
EMMO 1f1b164d ec6a 4faa 8d5e 88bda62316cc: http://qudt.org/vocab/unit/SEC
EMMO 33ae2d07 5526 4555 a0b4 8f4c031b5652: s
EMMO 6dd685dd 1895 46e4 b227 be9f7d643c25: http://dbpedia.org/resource/Second
EMMO 70fe84ff 99b6 4206 a9fc 9a8931836d84: The second, symbol s, is the SI unit of time. It is defined by taking the fixed numerical value of the caesium frequency ∆νCs, the unperturbed ground-state hyperfine transition frequency of the caesium 133 atom, to be 9192631770 when expressed in the unit Hz, which is equal to s−1.
EMMO c84c6752 6d64 48cc 9500 e54a3c34898d: http://en.wikipedia.org/wiki/Second
EMMO fe015383 afb3 44a6 ae86 043628697aa2: https://doi.org/10.1351/goldbook.S05513

KiloCoulomb
type: Class
subclass of: Restriction
  some values from: Coulomb
subclass of: Restriction
  has value: 1000.0
subclass of: Restriction
  has value: 0.0
EMMO 1f1b164d ec6a 4faa 8d5e 88bda62316cc: http://qudt.org/vocab/unit/KiloC
EMMO 33ae2d07 5526 4555 a0b4 8f4c031b5652: kC
EMMO 7f1dec83 d85e 4e1b b7bd c9442d4f5a64: kC

PerSquareKilogram
type: Class
subclass of: Restriction
  has value: 1.0
subclass of: Restriction
  has value: 0.0
comment: Per Square Kilogram is a denominator unit with dimensions /kg². -- QUDT
alternative label: ReciprocalSquareKilogram
EMMO 1f1b164d ec6a 4faa 8d5e 88bda62316cc: http://qudt.org/vocab/unit/PER-KiloGM2
EMMO 33ae2d07 5526 4555 a0b4 8f4c031b5652: kg-2
EMMO 7f1dec83 d85e 4e1b b7bd c9442d4f5a64: /kg²
EMMO 967080e5 2f42 4eb2 a3a9 c58143e835f9: Per Square Kilogram is a denominator unit with dimensions /kg². -- QUDT

InverseSquareMassUnit
type: Class
subclass of: Restriction
  has value: T0 L0 M-2 I0 Θ0 N0 J0
comment: The class of units with dimensionality 'InverseSquareMass'.
EMMO 967080e5 2f42 4eb2 a3a9 c58143e835f9: The class of units with dimensionality 'InverseSquareMass'.

ThermalInsulance
type: Class
subclass of: Restriction
comment: Reciprocal of the coefficient of heat transfer.
alternative label: CoefficientOfThermalInsulance
EMMO 1f1b164d ec6a 4faa 8d5e 88bda62316cc: https://qudt.org/vocab/quantitykind/ThermalInsulance
EMMO 26bf1bef d192 4da6 b0eb d2209698fb54: https://www.wikidata.org/wiki/Q2596212
EMMO 50c298c2 55a2 4068 b3ac 4e948c33181f: https://www.electropedia.org/iev/iev.nsf/display
EMMO 8de5d5bf db1c 40ac b698 095ba3b18578: 5-11
EMMO 967080e5 2f42 4eb2 a3a9 c58143e835f9: Reciprocal of the coefficient of heat transfer.

IsothermalCompressibility
type: Class
comment: Quantity characterising the relative variation of volume with pressure at constant thermodynamic temperature.
EMMO 1f1b164d ec6a 4faa 8d5e 88bda62316cc: https://qudt.org/vocab/quantitykind/IsothermalCompressibility
EMMO 26bf1bef d192 4da6 b0eb d2209698fb54: https://www.wikidata.org/wiki/Q2990696
EMMO 50c298c2 55a2 4068 b3ac 4e948c33181f: https://www.electropedia.org/iev/iev.nsf/display
EMMO 8de5d5bf db1c 40ac b698 095ba3b18578: 5-5.1
EMMO c7b62dd7 063a 4c2a 8504 42f7264ba83f: Quantity characterising the relative variation of volume with pressure at constant thermodynamic temperature.

RutherfordiumAtom
type: Class
subclass of: Restriction
subclass of: Restriction
  has value: 267.122
subclass of: Restriction
  has value: 104
comment: Atom subclass for rutherfordium.
EMMO 967080e5 2f42 4eb2 a3a9 c58143e835f9: Atom subclass for rutherfordium.

MeanEnergyImparted
type: Class
comment: Expectation value of the energy imparted.
EMMO 1f1b164d ec6a 4faa 8d5e 88bda62316cc: https://qudt.org/vocab/quantitykind/MeanEnergyImparted
EMMO 26bf1bef d192 4da6 b0eb d2209698fb54: https://www.wikidata.org/wiki/Q99526969
EMMO 50c298c2 55a2 4068 b3ac 4e948c33181f: https://www.electropedia.org/iev/iev.nsf/display
EMMO 8de5d5bf db1c 40ac b698 095ba3b18578: 10-80.2
EMMO 967080e5 2f42 4eb2 a3a9 c58143e835f9: Expectation value of the energy imparted.

PromethiumAtom
type: Class
subclass of: Restriction
subclass of: Restriction
  has value: 144.91276
subclass of: Restriction
  has value: 61
comment: Atom subclass for promethium.
EMMO 967080e5 2f42 4eb2 a3a9 c58143e835f9: Atom subclass for promethium.

ThermalConductivity
type: Class
subclass of: Restriction
comment: At a point fixed in a medium with a temperature field, scalar quantity λ characterizing the ability of the medium to transmit heat through a surface element containing that point: φ = −λ grad T, where φ is the density of heat flow rate and T is thermodynamic temperature.
comment: In an anisotropic medium, thermal conductivity is a tensor quantity.
EMMO 1f1b164d ec6a 4faa 8d5e 88bda62316cc: https://qudt.org/vocab/quantitykind/ThermalConductivity
EMMO 26bf1bef d192 4da6 b0eb d2209698fb54: https://www.wikidata.org/wiki/Q487005
EMMO 50c298c2 55a2 4068 b3ac 4e948c33181f: https://www.electropedia.org/iev/iev.nsf/display
EMMO 6dd685dd 1895 46e4 b227 be9f7d643c25: https://dbpedia.org/page/Thermal_conductivity
EMMO 8de5d5bf db1c 40ac b698 095ba3b18578: 5-9
EMMO 967080e5 2f42 4eb2 a3a9 c58143e835f9: At a point fixed in a medium with a temperature field, scalar quantity λ characterizing the ability of the medium to transmit heat through a surface element containing that point: φ = −λ grad T, where φ is the density of heat flow rate and T is thermodynamic temperature.

CubicMetrePerKilogramSquareSecond
type: Class
subclass of: Restriction
  has value: 1.0
subclass of: Restriction
  has value: 0.0
comment: Cubic metre per kilogram and square second.
EMMO 1f1b164d ec6a 4faa 8d5e 88bda62316cc: http://qudt.org/vocab/unit/M3-PER-KiloGM-SEC2
EMMO 33ae2d07 5526 4555 a0b4 8f4c031b5652: m3.(kg.s2)-1
EMMO 33ae2d07 5526 4555 a0b4 8f4c031b5652: m3.kg-1.s-2
EMMO 33ae2d07 5526 4555 a0b4 8f4c031b5652: m3/(kg.s2)
EMMO 7f1dec83 d85e 4e1b b7bd c9442d4f5a64: m³/(kg⋅s²)
EMMO 967080e5 2f42 4eb2 a3a9 c58143e835f9: Cubic metre per kilogram and square second.

GibbsEnergy
type: Class
comment: Type of thermodynamic potential; useful for calculating reversible work in certain systems.
alternative label: GibbsFreeEnergy
EMMO 26bf1bef d192 4da6 b0eb d2209698fb54: https://www.wikidata.org/wiki/Q334631
EMMO 50c298c2 55a2 4068 b3ac 4e948c33181f: https://www.electropedia.org/iev/iev.nsf/display
EMMO 8de5d5bf db1c 40ac b698 095ba3b18578: 5-20.5
EMMO 967080e5 2f42 4eb2 a3a9 c58143e835f9: Type of thermodynamic potential; useful for calculating reversible work in certain systems.
EMMO fe015383 afb3 44a6 ae86 043628697aa2: https://doi.org/10.1351/goldbook.G02629

SquareMilliMetrePerSecond
type: Class
subclass of: Restriction
  has value: 1e-06
subclass of: Restriction
  has value: 0.0
comment: 0.000001-fold of the power of the SI base unit metre with the exponent 2 divided by the SI base unit second -- QUDT
alternative label: Square Millimetre Per Second
EMMO 1f1b164d ec6a 4faa 8d5e 88bda62316cc: http://qudt.org/vocab/unit/MilliM2-PER-SEC
EMMO 33ae2d07 5526 4555 a0b4 8f4c031b5652: mm2.s-1
EMMO 7f1dec83 d85e 4e1b b7bd c9442d4f5a64: mm²/s
EMMO 967080e5 2f42 4eb2 a3a9 c58143e835f9: 0.000001-fold of the power of the SI base unit metre with the exponent 2 divided by the SI base unit second -- QUDT

MicroFarad
type: Class
subclass of: Restriction
  some values from: Farad
subclass of: Restriction
  has value: 1e-06
subclass of: Restriction
  has value: 0.0
comment: The "microfarad" (symbolized μ F) is a unit of capacitance, equivalent to 0.000001 (10 to the -6th power) farad. The microfarad is a moderate unit of capacitance. In utility alternating-current (AC) and audio-frequency (AF) circuits, capacitors with values on the order of 1 μ F or more are common. At radio frequencies (RF), a smaller unit, the picofarad (pF), is often used. -- QUDT
alternative label: microfarad
EMMO 1f1b164d ec6a 4faa 8d5e 88bda62316cc: http://qudt.org/vocab/unit/MicroFARAD
EMMO 33ae2d07 5526 4555 a0b4 8f4c031b5652: uF
EMMO 7f1dec83 d85e 4e1b b7bd c9442d4f5a64: µF
EMMO 967080e5 2f42 4eb2 a3a9 c58143e835f9: The "microfarad" (symbolized μ F) is a unit of capacitance, equivalent to 0.000001 (10 to the -6th power) farad. The microfarad is a moderate unit of capacitance. In utility alternating-current (AC) and audio-frequency (AF) circuits, capacitors with values on the order of 1 μ F or more are common. At radio frequencies (RF), a smaller unit, the picofarad (pF), is often used. -- QUDT

DiffusionArea
type: Class
subclass of: Restriction
comment: One-sixth of the mean square distance between the point where a neutron enters a specified class and the point where it leaves this class.
EMMO 1f1b164d ec6a 4faa 8d5e 88bda62316cc: https://qudt.org/vocab/quantitykind/DiffusionArea
EMMO 26bf1bef d192 4da6 b0eb d2209698fb54: https://www.wikidata.org/wiki/Q98966292
EMMO 8de5d5bf db1c 40ac b698 095ba3b18578: 10-72.2
EMMO 967080e5 2f42 4eb2 a3a9 c58143e835f9: One-sixth of the mean square distance between the point where a neutron enters a specified class and the point where it leaves this class.

BariumSymbol
type: Class
subclass of: Restriction
  has value: Ba
comment: The symbol that stands for the barium atom.
EMMO 967080e5 2f42 4eb2 a3a9 c58143e835f9: The symbol that stands for the barium atom.

YoctoPrefixedUnit
type: Class
subclass of: Restriction
subclass of: Restriction
  has value: 1e-24
comment: Superclass for all units prefixed with "yocto" (1e-24).
EMMO 967080e5 2f42 4eb2 a3a9 c58143e835f9: Superclass for all units prefixed with "yocto" (1e-24).

ZincAtom
type: Class
subclass of: Restriction
subclass of: Restriction
  has value: 65.38
subclass of: Restriction
  has value: 30
comment: Atom subclass for zinc.
EMMO 967080e5 2f42 4eb2 a3a9 c58143e835f9: Atom subclass for zinc.

MesoscopicSubstance
type: Class

Quetta
type: Class
subclass of: Restriction
  has value: Q
subclass of: Restriction
  has value: 1e+30
comment: SI prefix who's value is 1e30.
EMMO 967080e5 2f42 4eb2 a3a9 c58143e835f9: SI prefix who's value is 1e30.

JouleSecond
type: Class
subclass of: Restriction
  has value: 1.0
subclass of: Restriction
  has value: 0.0
comment: The joule-second is a unit equal to a joule multiplied by a second, used to measure action or angular momentum. The joule-second is the unit used for Planck's constant. -- QUDT
alternative label: Joule Second
EMMO 1f1b164d ec6a 4faa 8d5e 88bda62316cc: http://qudt.org/vocab/unit/J-SEC
EMMO 33ae2d07 5526 4555 a0b4 8f4c031b5652: J.s
EMMO 7f1dec83 d85e 4e1b b7bd c9442d4f5a64: J⋅s
EMMO 967080e5 2f42 4eb2 a3a9 c58143e835f9: The joule-second is a unit equal to a joule multiplied by a second, used to measure action or angular momentum. The joule-second is the unit used for Planck's constant. -- QUDT

MassEnergyTransferCoefficient
type: Class
subclass of: Restriction
comment: For ionizing uncharged particles of a given type and energy, the differential quotient of Rtr with respect to l. Where Rtr is the mean energy that is transferred to kinetic energy of charged particles by interactions of the uncharged particles of incident radiant energy R in traversing a distance l in the material of density rho, divided by rho and R
EMMO 1f1b164d ec6a 4faa 8d5e 88bda62316cc: https://qudt.org/vocab/quantitykind/MassEnergyTransferCoefficient
EMMO 26bf1bef d192 4da6 b0eb d2209698fb54: https://www.wikidata.org/wiki/Q99714619
EMMO 50c298c2 55a2 4068 b3ac 4e948c33181f: https://www.electropedia.org/iev/iev.nsf/display
EMMO 8de5d5bf db1c 40ac b698 095ba3b18578: 10-87
EMMO 967080e5 2f42 4eb2 a3a9 c58143e835f9: For ionizing uncharged particles of a given type and energy, the differential quotient of Rtr with respect to l. Where Rtr is the mean energy that is transferred to kinetic energy of charged particles by interactions of the uncharged particles of incident radiant energy R in traversing a distance l in the material of density rho, divided by rho and R

DegreeCelsiusPerMetre
type: Class
comment: Degree Celsius per metre unit.
EMMO 1f1b164d ec6a 4faa 8d5e 88bda62316cc: http://qudt.org/vocab/unit/DEG_C-PER-M
EMMO 33ae2d07 5526 4555 a0b4 8f4c031b5652: Cel.m-1
EMMO 7f1dec83 d85e 4e1b b7bd c9442d4f5a64: °C/m
EMMO 967080e5 2f42 4eb2 a3a9 c58143e835f9: Degree Celsius per metre unit.

ContinuumModel
type: Class
comment: A physics-based model based on a physics equation describing the behaviour of continuum volume.
EMMO 967080e5 2f42 4eb2 a3a9 c58143e835f9: A physics-based model based on a physics equation describing the behaviour of continuum volume.

BecquerelPerSquareMetre
type: Class
subclass of: Restriction
  has value: 1.0
subclass of: Restriction
  has value: 0.0
comment: Becquerel per square metre.
EMMO 1f1b164d ec6a 4faa 8d5e 88bda62316cc: http://qudt.org/vocab/unit/BQ-PER-M2
EMMO 33ae2d07 5526 4555 a0b4 8f4c031b5652: Bq.m-2
EMMO 33ae2d07 5526 4555 a0b4 8f4c031b5652: Bq/m2
EMMO 7f1dec83 d85e 4e1b b7bd c9442d4f5a64: Bq/m²
EMMO 967080e5 2f42 4eb2 a3a9 c58143e835f9: Becquerel per square metre.

MilliMolePerMole
type: Class
subclass of: Restriction
  has value: 0.001
subclass of: Restriction
  has value: 0.0
alternative label: Millimoles per mole
EMMO 1f1b164d ec6a 4faa 8d5e 88bda62316cc: http://qudt.org/vocab/unit/MilliMOL-PER-MOL
EMMO 33ae2d07 5526 4555 a0b4 8f4c031b5652: mmol.mol-1
EMMO 7f1dec83 d85e 4e1b b7bd c9442d4f5a64: mmol/mol

ProceduralAgent
type: Class

JoulePerCubicMetreKelvin
type: Class
subclass of: Restriction
  has value: 1.0
subclass of: Restriction
  has value: 0.0
comment: `Joule per Cubic Meter Kelvin` is a unit for 'Volumetric Heat Capacity' expressed as J/(m³ K). -- QUDT
alternative label: Joule per Cubic Metre Kelvin
EMMO 1f1b164d ec6a 4faa 8d5e 88bda62316cc: http://qudt.org/vocab/unit/J-PER-M3-K
EMMO 33ae2d07 5526 4555 a0b4 8f4c031b5652: J.m-3.K-1
EMMO 7f1dec83 d85e 4e1b b7bd c9442d4f5a64: J/(m³⋅K)
EMMO 967080e5 2f42 4eb2 a3a9 c58143e835f9: `Joule per Cubic Meter Kelvin` is a unit for 'Volumetric Heat Capacity' expressed as J/(m³ K). -- QUDT

MilliNewtonMetre
type: Class
subclass of: Restriction
  some values from: NewtonMetre
subclass of: Restriction
  has value: 0.001
subclass of: Restriction
  has value: 0.0
comment: 0.001-fold of the product of the SI derived unit newton and the SI base unit metre -- QUDT
alternative label: Millinewton Metre
EMMO 1f1b164d ec6a 4faa 8d5e 88bda62316cc: http://qudt.org/vocab/unit/MilliN-M
EMMO 33ae2d07 5526 4555 a0b4 8f4c031b5652: mN.m
EMMO 7f1dec83 d85e 4e1b b7bd c9442d4f5a64: mN⋅m
EMMO 967080e5 2f42 4eb2 a3a9 c58143e835f9: 0.001-fold of the product of the SI derived unit newton and the SI base unit metre -- QUDT

AmperePerRadian
type: Class
subclass of: Restriction
  has value: 1.0
subclass of: Restriction
  has value: 0.0
comment: `Ampere per Radian` is a derived unit for measuring the amount of current per unit measure of angle, expressed in ampere per radian. -- QUDT
alternative label: Ampere per Radian
EMMO 1f1b164d ec6a 4faa 8d5e 88bda62316cc: http://qudt.org/vocab/unit/A-PER-RAD
EMMO 33ae2d07 5526 4555 a0b4 8f4c031b5652: A.rad-1
EMMO 33ae2d07 5526 4555 a0b4 8f4c031b5652: A/rad
EMMO 7f1dec83 d85e 4e1b b7bd c9442d4f5a64: A/rad
EMMO 967080e5 2f42 4eb2 a3a9 c58143e835f9: `Ampere per Radian` is a derived unit for measuring the amount of current per unit measure of angle, expressed in ampere per radian. -- QUDT

DieCasting
type: Class

PorcelainOrCeramicCasting
type: Class

RoentgeniumSymbol
type: Class
subclass of: Restriction
  has value: Rg
comment: The symbol that stands for the roentgenium atom.
EMMO 967080e5 2f42 4eb2 a3a9 c58143e835f9: The symbol that stands for the roentgenium atom.

AtomicNumber
type: Class
subclass of: Restriction
comment: Number of protons in an atomic nucleus.
EMMO 1f1b164d ec6a 4faa 8d5e 88bda62316cc: http://qudt.org/vocab/quantitykind/AtomicNumber
EMMO 8de5d5bf db1c 40ac b698 095ba3b18578: 10-1.1
EMMO 967080e5 2f42 4eb2 a3a9 c58143e835f9: Number of protons in an atomic nucleus.
EMMO fe015383 afb3 44a6 ae86 043628697aa2: https://doi.org/10.1351/goldbook.A00499

KinematicViscosity
type: Class
subclass of: Restriction
comment: Quotient of dynamic viscosity and mass density of a fluid.
EMMO 1f1b164d ec6a 4faa 8d5e 88bda62316cc: https://qudt.org/vocab/quantitykind/KinematicViscosity
EMMO 26bf1bef d192 4da6 b0eb d2209698fb54: https://www.wikidata.org/wiki/Q15106259
EMMO 50c298c2 55a2 4068 b3ac 4e948c33181f: https://www.electropedia.org/iev/iev.nsf/display
EMMO 8de5d5bf db1c 40ac b698 095ba3b18578: 4-25
EMMO 967080e5 2f42 4eb2 a3a9 c58143e835f9: Quotient of dynamic viscosity and mass density of a fluid.
EMMO fe015383 afb3 44a6 ae86 043628697aa2: https://doi.org/10.1351/goldbook.K03395

MolybdenumAtom
type: Class
subclass of: Restriction
subclass of: Restriction
  has value: 95.95
subclass of: Restriction
  has value: 42
comment: Atom subclass for molybdenum.
EMMO 967080e5 2f42 4eb2 a3a9 c58143e835f9: Atom subclass for molybdenum.

RadialDistance
type: Class
comment: Distance, where one point is located on an axis or within a closed non self-intersecting curve or surface.
EMMO 1f1b164d ec6a 4faa 8d5e 88bda62316cc: https://qudt.org/vocab/quantitykind/RadialDistance
EMMO 26bf1bef d192 4da6 b0eb d2209698fb54: https://www.wikidata.org/wiki/Q1578234
EMMO 50c298c2 55a2 4068 b3ac 4e948c33181f: https://www.electropedia.org/iev/iev.nsf/display
EMMO 8de5d5bf db1c 40ac b698 095ba3b18578: 3-1.9
EMMO 967080e5 2f42 4eb2 a3a9 c58143e835f9: Distance, where one point is located on an axis or within a closed non self-intersecting curve or surface.

MentalAgency
type: Class
comment: An intentional agency caused by the agent’s mental states and events.
comment: Mental states are strictly connected to the definition of mind, which is traditionally connected to high cognitive skills, such as the one provided by human beings brains.
EMMO 967080e5 2f42 4eb2 a3a9 c58143e835f9: An intentional agency caused by the agent’s mental states and events.
EMMO c7b62dd7 063a 4c2a 8504 42f7264ba83f: Mental states are strictly connected to the definition of mind, which is traditionally connected to high cognitive skills, such as the one provided by human beings brains.

RelativePressureCoefficient
type: Class
subclass of: Restriction
comment: Relative change of pressure with temperature at constant volume.
EMMO 1f1b164d ec6a 4faa 8d5e 88bda62316cc: https://qudt.org/vocab/quantitykind/RelativePressureCoefficient
EMMO 26bf1bef d192 4da6 b0eb d2209698fb54: https://www.wikidata.org/wiki/Q74761852
EMMO 50c298c2 55a2 4068 b3ac 4e948c33181f: https://www.electropedia.org/iev/iev.nsf/display
EMMO 8de5d5bf db1c 40ac b698 095ba3b18578: 5-3.3
EMMO 967080e5 2f42 4eb2 a3a9 c58143e835f9: Relative change of pressure with temperature at constant volume.

PressureCoefficient
type: Class
subclass of: Restriction
comment: Change of pressure per change of temperature at constant volume.
EMMO 1f1b164d ec6a 4faa 8d5e 88bda62316cc: https://qudt.org/vocab/quantitykind/PressureCoefficient
EMMO 26bf1bef d192 4da6 b0eb d2209698fb54: https://www.wikidata.org/wiki/Q74762732
EMMO 50c298c2 55a2 4068 b3ac 4e948c33181f: https://www.electropedia.org/iev/iev.nsf/display
EMMO 8de5d5bf db1c 40ac b698 095ba3b18578: 5-4
EMMO 967080e5 2f42 4eb2 a3a9 c58143e835f9: Change of pressure per change of temperature at constant volume.

IronSymbol
type: Class
subclass of: Restriction
  has value: Fe
comment: The symbol that stands for the iron atom.
EMMO 967080e5 2f42 4eb2 a3a9 c58143e835f9: The symbol that stands for the iron atom.

MegaHertz
type: Class
subclass of: Restriction
  some values from: Hertz
subclass of: Restriction
  has value: 1000000.0
subclass of: Restriction
  has value: 0.0
comment: "Megahertz" is a C.G.S System unit for 'Frequency' expressed as MHz. -- QUDT
EMMO 1f1b164d ec6a 4faa 8d5e 88bda62316cc: http://qudt.org/vocab/unit/MegaHZ
EMMO 33ae2d07 5526 4555 a0b4 8f4c031b5652: MHz
EMMO 7f1dec83 d85e 4e1b b7bd c9442d4f5a64: MHz
EMMO 967080e5 2f42 4eb2 a3a9 c58143e835f9: "Megahertz" is a C.G.S System unit for 'Frequency' expressed as MHz. -- QUDT

Presses
type: Class

Hadron
type: Class
comment: Particles composed of two or more quarks.
EMMO 8a137e9f 579c 4e28 baca e8980eb0c3db: EquivalentTo: Baryon or Meson
EMMO 967080e5 2f42 4eb2 a3a9 c58143e835f9: Particles composed of two or more quarks.
EMMO c84c6752 6d64 48cc 9500 e54a3c34898d: https://en.wikipedia.org/wiki/Hadron

HenryPerKiloOhm
type: Class
subclass of: Restriction
  has value: 0.001
subclass of: Restriction
  has value: 0.0
comment: SI derived unit henry divided by the 1 000-fold of the SI derived unit ohm -- QUDT
alternative label: Henry Per Kiloohm
EMMO 1f1b164d ec6a 4faa 8d5e 88bda62316cc: http://qudt.org/vocab/unit/H-PER-KiloOHM
EMMO 33ae2d07 5526 4555 a0b4 8f4c031b5652: H.kOhm-1
EMMO 7f1dec83 d85e 4e1b b7bd c9442d4f5a64: H/kΩ
EMMO 967080e5 2f42 4eb2 a3a9 c58143e835f9: SI derived unit henry divided by the 1 000-fold of the SI derived unit ohm -- QUDT

DerivedQuantity
type: Class
comment: "Quantity, in a system of quantities, defined in terms of the base quantities of that system".
EMMO 967080e5 2f42 4eb2 a3a9 c58143e835f9: "Quantity, in a system of quantities, defined in terms of the base quantities of that system".
EMMO bb49844b 45d7 4f0d 8cae 8e552cbc20d6: derived quantity

PhysicalQuantiyByDefinition
type: Class

BaseQuantity
type: Class
comment: "Quantity in a conventionally chosen subset of a given system of quantities, where no quantity in the subset can be expressed in terms of the other quantities within that subset" ISO 80000-1
EMMO 967080e5 2f42 4eb2 a3a9 c58143e835f9: "Quantity in a conventionally chosen subset of a given system of quantities, where no quantity in the subset can be expressed in terms of the other quantities within that subset" ISO 80000-1
EMMO bb49844b 45d7 4f0d 8cae 8e552cbc20d6: base quantity

EnergyDistributionOfCrossSection
type: Class
subclass of: Restriction
comment: Differential quotient of the cross section for a process and the energy of the scattered particle.
EMMO 1f1b164d ec6a 4faa 8d5e 88bda62316cc: https://qudt.org/vocab/quantitykind/SpectralCrossSection
EMMO 26bf1bef d192 4da6 b0eb d2209698fb54: https://www.wikidata.org/wiki/Q98267245
EMMO 8de5d5bf db1c 40ac b698 095ba3b18578: 10-40
EMMO 967080e5 2f42 4eb2 a3a9 c58143e835f9: Differential quotient of the cross section for a process and the energy of the scattered particle.

LiquidGasSuspension
type: Class
comment: A coarse dispersion of gas in a liquid continuum phase.
example: Sparkling water
EMMO 967080e5 2f42 4eb2 a3a9 c58143e835f9: A coarse dispersion of gas in a liquid continuum phase.

SpecificEnthalpy
type: Class
comment: Enthalpy per unit mass.
EMMO 1f1b164d ec6a 4faa 8d5e 88bda62316cc: https://qudt.org/vocab/quantitykind/SpecificEnthalpy
EMMO 26bf1bef d192 4da6 b0eb d2209698fb54: https://www.wikidata.org/wiki/Q21572993
EMMO 8de5d5bf db1c 40ac b698 095ba3b18578: 5-21.3
EMMO 967080e5 2f42 4eb2 a3a9 c58143e835f9: Enthalpy per unit mass.
EMMO c84c6752 6d64 48cc 9500 e54a3c34898d: https://en.wikipedia.org/wiki/Enthalpy#Specific_enthalpy

KiloAmperePerSquareMetre
type: Class
subclass of: Restriction
  some values from: AmperePerSquareMetre
subclass of: Restriction
  has value: 1000.0
subclass of: Restriction
  has value: 0.0
comment: 1 000-fold of the SI base unit ampere divided by the power of the SI base unit metre with the exponent 2 -- QUDT
alternative label: Kiloampere Per Square Metre
EMMO 1f1b164d ec6a 4faa 8d5e 88bda62316cc: http://qudt.org/vocab/unit/KiloA-PER-M2
EMMO 33ae2d07 5526 4555 a0b4 8f4c031b5652: kA.m-2
EMMO 7f1dec83 d85e 4e1b b7bd c9442d4f5a64: kA/m²
EMMO 967080e5 2f42 4eb2 a3a9 c58143e835f9: 1 000-fold of the SI base unit ampere divided by the power of the SI base unit metre with the exponent 2 -- QUDT

Work
type: Class
comment: Product of force and displacement.
EMMO 1f1b164d ec6a 4faa 8d5e 88bda62316cc: http://qudt.org/vocab/quantitykind/Work
EMMO 8de5d5bf db1c 40ac b698 095ba3b18578: 4-28.4
EMMO 967080e5 2f42 4eb2 a3a9 c58143e835f9: Product of force and displacement.
EMMO fe015383 afb3 44a6 ae86 043628697aa2: https://doi.org/10.1351/goldbook.W06684

NonNumericalData
type: Class
comment: Data that are non-quantitatively interpreted (e.g., qualitative data, types).
EMMO 967080e5 2f42 4eb2 a3a9 c58143e835f9: Data that are non-quantitatively interpreted (e.g., qualitative data, types).

Heat
type: Class
comment: Heat is energy in transfer to or from a thermodynamic system, by mechanisms other than thermodynamic work or transfer of matter.
alternative label: AmountOfHeat
EMMO 1f1b164d ec6a 4faa 8d5e 88bda62316cc: http://qudt.org/vocab/quantitykind/Heat
EMMO 8de5d5bf db1c 40ac b698 095ba3b18578: 5-6.1
EMMO 967080e5 2f42 4eb2 a3a9 c58143e835f9: Heat is energy in transfer to or from a thermodynamic system, by mechanisms other than thermodynamic work or transfer of matter.
EMMO fe015383 afb3 44a6 ae86 043628697aa2: https://doi.org/10.1351/goldbook.H02752

PoloniumSymbol
type: Class
subclass of: Restriction
  has value: Po
comment: The symbol that stands for the polonium atom.
EMMO 967080e5 2f42 4eb2 a3a9 c58143e835f9: The symbol that stands for the polonium atom.

ElectricSusceptibility
type: Class
comment: Electric polarization divided by electric constant and electric field strength.
EMMO 1f1b164d ec6a 4faa 8d5e 88bda62316cc: https://qudt.org/vocab/quantitykind/ElectricSusceptibility
EMMO 26bf1bef d192 4da6 b0eb d2209698fb54: https://www.wikidata.org/wiki/Q598305
EMMO 50c298c2 55a2 4068 b3ac 4e948c33181f: https://www.electropedia.org/iev/iev.nsf/display
EMMO 8de5d5bf db1c 40ac b698 095ba3b18578: 6-16
EMMO 967080e5 2f42 4eb2 a3a9 c58143e835f9: Electric polarization divided by electric constant and electric field strength.
EMMO c84c6752 6d64 48cc 9500 e54a3c34898d: https://en.wikipedia.org/wiki/Electric_susceptibility

SquareMetreKelvinPerWatt
type: Class
subclass of: Restriction
  has value: 1.0
subclass of: Restriction
  has value: 0.0
comment: `Square Meter Kelvin per Watt` is a unit for 'Thermal Insulance' expressed as (K²)m/W. -- QUDT
alternative label: Square Metre Kelvin per Watt
EMMO 1f1b164d ec6a 4faa 8d5e 88bda62316cc: http://qudt.org/vocab/unit/M2-K-PER-W
EMMO 33ae2d07 5526 4555 a0b4 8f4c031b5652: m2.K.W-1
EMMO 7f1dec83 d85e 4e1b b7bd c9442d4f5a64: (K²)m/W
EMMO 967080e5 2f42 4eb2 a3a9 c58143e835f9: `Square Meter Kelvin per Watt` is a unit for 'Thermal Insulance' expressed as (K²)m/W. -- QUDT

DateData
type: Class
comment: A data representing a date.
EMMO 967080e5 2f42 4eb2 a3a9 c58143e835f9: A data representing a date.

MassAmountOfSubstanceUnit
type: Class
subclass of: Restriction
  has value: T0 L0 M+1 I0 Θ0 N+1 J0
comment: The class of units with dimensionality 'MassAmountOfSubstance'.
EMMO 967080e5 2f42 4eb2 a3a9 c58143e835f9: The class of units with dimensionality 'MassAmountOfSubstance'.

DysprosiumAtom
type: Class
subclass of: Restriction
subclass of: Restriction
  has value: 162.5
subclass of: Restriction
  has value: 66
comment: Atom subclass for dysprosium.
EMMO 967080e5 2f42 4eb2 a3a9 c58143e835f9: Atom subclass for dysprosium.

Micro
type: Class
subclass of: Restriction
  has value: μ
subclass of: Restriction
  has value: 1e-06
comment: SI prefix who's value is 1e-6.
EMMO 967080e5 2f42 4eb2 a3a9 c58143e835f9: SI prefix who's value is 1e-6.

SecondPerRadianCubicMetre
type: Class
subclass of: Restriction
  has value: 1.0
subclass of: Restriction
  has value: 0.0
comment: Second per radian and cubic metre unit.
EMMO 1f1b164d ec6a 4faa 8d5e 88bda62316cc: http://qudt.org/vocab/unit/SEC-PER-RAD-M3
EMMO 33ae2d07 5526 4555 a0b4 8f4c031b5652: s.rad-1.m-3
EMMO 7f1dec83 d85e 4e1b b7bd c9442d4f5a64: s/rad⋅m³
EMMO 967080e5 2f42 4eb2 a3a9 c58143e835f9: Second per radian and cubic metre unit.

IodineSymbol
type: Class
subclass of: Restriction
  has value: I
comment: The symbol that stands for the iodine atom.
EMMO 967080e5 2f42 4eb2 a3a9 c58143e835f9: The symbol that stands for the iodine atom.

IodineAtom
type: Class
subclass of: Restriction
subclass of: Restriction
  has value: 126.90447
subclass of: Restriction
  has value: 53
comment: Atom subclass for iodine.
EMMO 967080e5 2f42 4eb2 a3a9 c58143e835f9: Atom subclass for iodine.

ThermalResistanceUnit
type: Class
subclass of: Restriction
  has value: T+3 L-2 M-1 I0 Θ+1 N0 J0
comment: The class of units with dimensionality 'ThermalResistance'.
EMMO 967080e5 2f42 4eb2 a3a9 c58143e835f9: The class of units with dimensionality 'ThermalResistance'.

BooleanData
type: Class
comment: A data representing a boolean number.
EMMO 8a137e9f 579c 4e28 baca e8980eb0c3db: EquivalentTo: hasDataValue some xsd:boolean
EMMO 967080e5 2f42 4eb2 a3a9 c58143e835f9: A data representing a boolean number.

SquareMetreCubicHertz
type: Class
subclass of: Restriction
  has value: 1.0
subclass of: Restriction
  has value: 0.0
comment: Square metre and cubic Hertz.
EMMO 1f1b164d ec6a 4faa 8d5e 88bda62316cc: http://qudt.org/vocab/unit/M2-HZ3
EMMO 33ae2d07 5526 4555 a0b4 8f4c031b5652: m2.Hz3
EMMO 7f1dec83 d85e 4e1b b7bd c9442d4f5a64: m²⋅Hz³
EMMO 967080e5 2f42 4eb2 a3a9 c58143e835f9: Square metre and cubic Hertz.

MegaOhm
type: Class
subclass of: Restriction
  some values from: Ohm
subclass of: Restriction
  has value: 1000000.0
subclass of: Restriction
  has value: 0.0
comment: 1,000,000-fold of the derived unit ohm -- QUDT
EMMO 1f1b164d ec6a 4faa 8d5e 88bda62316cc: http://qudt.org/vocab/unit/MegaOHM
EMMO 33ae2d07 5526 4555 a0b4 8f4c031b5652: MOhm
EMMO 7f1dec83 d85e 4e1b b7bd c9442d4f5a64: MΩ
EMMO 967080e5 2f42 4eb2 a3a9 c58143e835f9: 1,000,000-fold of the derived unit ohm -- QUDT

PlasticModeling
type: Class

CurrentLinkage
type: Class
comment: For a closed path, scalar quantity equal to the electric current through any surface bounded by the path.
EMMO 1f1b164d ec6a 4faa 8d5e 88bda62316cc: https://qudt.org/vocab/quantitykind/CurrentLinkage
EMMO 26bf1bef d192 4da6 b0eb d2209698fb54: https://www.wikidata.org/wiki/Q77995703
EMMO 50c298c2 55a2 4068 b3ac 4e948c33181f: https://www.electropedia.org/iev/iev.nsf/display
EMMO 8de5d5bf db1c 40ac b698 095ba3b18578: 6-37.4
EMMO 967080e5 2f42 4eb2 a3a9 c58143e835f9: For a closed path, scalar quantity equal to the electric current through any surface bounded by the path.

ElectricFlux
type: Class
subclass of: Restriction
comment: Scalar quantity equal to the flux of the electric flux density D through a given directed surface S.
EMMO 1f1b164d ec6a 4faa 8d5e 88bda62316cc: https://qudt.org/vocab/quantitykind/ElectricFlux
EMMO 26bf1bef d192 4da6 b0eb d2209698fb54: https://www.wikidata.org/wiki/Q501267
EMMO 50c298c2 55a2 4068 b3ac 4e948c33181f: https://www.electropedia.org/iev/iev.nsf/display
EMMO 8de5d5bf db1c 40ac b698 095ba3b18578: 6-17
EMMO 967080e5 2f42 4eb2 a3a9 c58143e835f9: Scalar quantity equal to the flux of the electric flux density D through a given directed surface S.

KilogramPerCubicDeciMetre
type: Class
subclass of: Restriction
  has value: 1000.0
subclass of: Restriction
  has value: 0.0
comment: SI base unit kilogram divided by the 0.001-fold of the power of the SI base unit metre with the exponent 3 -- QUDT
alternative label: Kilogram Per Cubic Decimetre
EMMO 1f1b164d ec6a 4faa 8d5e 88bda62316cc: http://qudt.org/vocab/unit/KiloGM-PER-DeciM3
EMMO 33ae2d07 5526 4555 a0b4 8f4c031b5652: kg.dm-3
EMMO 7f1dec83 d85e 4e1b b7bd c9442d4f5a64: kg/dm³
EMMO 967080e5 2f42 4eb2 a3a9 c58143e835f9: SI base unit kilogram divided by the 0.001-fold of the power of the SI base unit metre with the exponent 3 -- QUDT

LossAngle
type: Class
comment: Arctan of the loss factor
EMMO 1f1b164d ec6a 4faa 8d5e 88bda62316cc: https://www.qudt.org/vocab/quantitykind/LossAngle
EMMO 26bf1bef d192 4da6 b0eb d2209698fb54: https://www.wikidata.org/wiki/Q20820438
EMMO 50c298c2 55a2 4068 b3ac 4e948c33181f: https://www.electropedia.org/iev/iev.nsf/display
EMMO 8de5d5bf db1c 40ac b698 095ba3b18578: 6-55
EMMO 967080e5 2f42 4eb2 a3a9 c58143e835f9: Arctan of the loss factor

SIAcceptedPrefixedUnit
type: Class
comment: Non-SI prefixed units that have been accepted by SI to be used together with the SI system.
EMMO 967080e5 2f42 4eb2 a3a9 c58143e835f9: Non-SI prefixed units that have been accepted by SI to be used together with the SI system.

NegativeIntegerData
type: Class
comment: A data representing an integer number < 0.
EMMO 8a137e9f 579c 4e28 baca e8980eb0c3db: EquivalentTo: hasDataValue some xsd:negativeInteger
EMMO 967080e5 2f42 4eb2 a3a9 c58143e835f9: A data representing an integer number < 0.

Sphere
type: Class
comment: A standard 2-manifold with no unconnected boundaries.
EMMO 967080e5 2f42 4eb2 a3a9 c58143e835f9: A standard 2-manifold with no unconnected boundaries.

LiquidLiquidSuspension
type: Class
comment: A coarse dispersion of liquid in a liquid continuum phase.
EMMO 967080e5 2f42 4eb2 a3a9 c58143e835f9: A coarse dispersion of liquid in a liquid continuum phase.

CubicMilliMetrePerCubicMetre
type: Class
subclass of: Restriction
  has value: 1e-09
subclass of: Restriction
  has value: 0.0
comment: volume ratio consisting of the 0.000000001-fold of the power of the SI base unit metre with the exponent 3 divided by the power of the SI base unit metre with the exponent 3 -- QUDT
alternative label: Cubic Millimetre Per Cubic Metre
EMMO 1f1b164d ec6a 4faa 8d5e 88bda62316cc: http://qudt.org/vocab/unit/MilliM3-PER-M3
EMMO 33ae2d07 5526 4555 a0b4 8f4c031b5652: mm3.m-3
EMMO 7f1dec83 d85e 4e1b b7bd c9442d4f5a64: mm³/m³
EMMO 967080e5 2f42 4eb2 a3a9 c58143e835f9: volume ratio consisting of the 0.000000001-fold of the power of the SI base unit metre with the exponent 3 divided by the power of the SI base unit metre with the exponent 3 -- QUDT

MicroWattPerSquareMetre
type: Class
subclass of: Restriction
  some values from: WattPerSquareMetre
subclass of: Restriction
  has value: 1e-06
subclass of: Restriction
  has value: 0.0
comment: 0.000001-fold of the SI derived unit watt divided by the power of the SI base unit metre with the exponent 2 -- QUDT
alternative label: Microwatt Per Square Metre
EMMO 1f1b164d ec6a 4faa 8d5e 88bda62316cc: http://qudt.org/vocab/unit/MicroW-PER-M2
EMMO 33ae2d07 5526 4555 a0b4 8f4c031b5652: uW.m-2
EMMO 7f1dec83 d85e 4e1b b7bd c9442d4f5a64: µW/m²
EMMO 967080e5 2f42 4eb2 a3a9 c58143e835f9: 0.000001-fold of the SI derived unit watt divided by the power of the SI base unit metre with the exponent 2 -- QUDT

JoulePerKelvin
type: Class
subclass of: Restriction
  has value: 1.0
subclass of: Restriction
  has value: 0.0
comment: Joule Per Kelvin (J/K) is a unit in the category of Entropy. It is also known as joules per kelvin, joule/kelvin. This unit is commonly used in the SI unit system. Joule Per Kelvin (J/K) has a dimension of ML²T⁻²Q⁻¹ where M is mass, L is length, T is time, and Q is temperature. This unit is the standard SI unit in this category. -- QUDT
alternative label: Joule per Kelvin
EMMO 1f1b164d ec6a 4faa 8d5e 88bda62316cc: http://qudt.org/vocab/unit/J-PER-K
EMMO 33ae2d07 5526 4555 a0b4 8f4c031b5652: J.K-1
EMMO 7f1dec83 d85e 4e1b b7bd c9442d4f5a64: J/K
EMMO 967080e5 2f42 4eb2 a3a9 c58143e835f9: Joule Per Kelvin (J/K) is a unit in the category of Entropy. It is also known as joules per kelvin, joule/kelvin. This unit is commonly used in the SI unit system. Joule Per Kelvin (J/K) has a dimension of ML²T⁻²Q⁻¹ where M is mass, L is length, T is time, and Q is temperature. This unit is the standard SI unit in this category. -- QUDT

QuinticMetre
type: Class
comment: Metre to the power of five.
EMMO 1f1b164d ec6a 4faa 8d5e 88bda62316cc: http://qudt.org/vocab/unit/M5
EMMO 7f1dec83 d85e 4e1b b7bd c9442d4f5a64: m⁵
EMMO 967080e5 2f42 4eb2 a3a9 c58143e835f9: Metre to the power of five.

GyromagneticRatioOfTheElectron
type: Class
comment: Proportionality constant between the magnetic dipole moment and the angular momentum of the electron.
alternative label: GyromagneticCoefficientOfTheElectron
alternative label: MagnetogyricRatioOfTheElectron
EMMO 26bf1bef d192 4da6 b0eb d2209698fb54: https://www.wikidata.org/wiki/Q97543076
EMMO 8de5d5bf db1c 40ac b698 095ba3b18578: 10-12.2
EMMO 967080e5 2f42 4eb2 a3a9 c58143e835f9: Proportionality constant between the magnetic dipole moment and the angular momentum of the electron.

GyromagneticRatio
type: Class
subclass of: Restriction
comment: Ratio of magnetic dipole moment to total angular momentum.
alternative label: GyromagneticCoefficient
alternative label: MagnetogyricRatio
EMMO 1f1b164d ec6a 4faa 8d5e 88bda62316cc: https://qudt.org/vocab/quantitykind/GyromagneticRatio
EMMO 26bf1bef d192 4da6 b0eb d2209698fb54: https://www.wikidata.org/wiki/Q634552
EMMO 8de5d5bf db1c 40ac b698 095ba3b18578: 10-12.1
EMMO 967080e5 2f42 4eb2 a3a9 c58143e835f9: Ratio of magnetic dipole moment to total angular momentum.
EMMO fe015383 afb3 44a6 ae86 043628697aa2: https://doi.org/10.1351/goldbook.M03693

HyperfineTransitionFrequencyOfCs
type: Class
comment: The frequency standard in the SI system in which the photon absorption by transitions between the two hyperfine ground states of caesium-133 atoms are used to control the output frequency. It defines the base unit second in the SI system.
EMMO 967080e5 2f42 4eb2 a3a9 c58143e835f9: The frequency standard in the SI system in which the photon absorption by transitions between the two hyperfine ground states of caesium-133 atoms are used to control the output frequency. It defines the base unit second in the SI system.

NucleonNumber
type: Class
comment: number of nucleons in an atomic nucleus
alternative label: MassNumber
EMMO 1f1b164d ec6a 4faa 8d5e 88bda62316cc: https://qudt.org/vocab/quantitykind/NucleonNumber
EMMO 26bf1bef d192 4da6 b0eb d2209698fb54: https://www.wikidata.org/wiki/Q101395
EMMO 50c298c2 55a2 4068 b3ac 4e948c33181f: https://www.electropedia.org/iev/iev.nsf/display
EMMO 6dd685dd 1895 46e4 b227 be9f7d643c25: https://dbpedia.org/page/Mass_number
EMMO 8de5d5bf db1c 40ac b698 095ba3b18578: 10-1.3
EMMO 967080e5 2f42 4eb2 a3a9 c58143e835f9: number of nucleons in an atomic nucleus
EMMO c84c6752 6d64 48cc 9500 e54a3c34898d: https://en.wikipedia.org/wiki/Mass_number
EMMO fe015383 afb3 44a6 ae86 043628697aa2: https://doi.org/10.1351/goldbook.M03726

PropagationCoefficient
type: Class
comment: Measure of the change of amplitude and phase angle of a plane wave propagating in a given direction.
EMMO 1f1b164d ec6a 4faa 8d5e 88bda62316cc: https://qudt.org/vocab/quantitykind/PropagationCoefficient.html
EMMO 26bf1bef d192 4da6 b0eb d2209698fb54: https://www.wikidata.org/wiki/Q1434913
EMMO 50c298c2 55a2 4068 b3ac 4e948c33181f: https://www.electropedia.org/iev/iev.nsf/display
EMMO 8de5d5bf db1c 40ac b698 095ba3b18578: 3-26.3
EMMO 967080e5 2f42 4eb2 a3a9 c58143e835f9: Measure of the change of amplitude and phase angle of a plane wave propagating in a given direction.

PrincipalQuantumNumber
type: Class
comment: Atomic quantum number related to the number n−1 of radial nodes of one-electron wave functions.
EMMO 1f1b164d ec6a 4faa 8d5e 88bda62316cc: https://qudt.org/vocab/quantitykind/PrincipalQuantumNumber
EMMO 26bf1bef d192 4da6 b0eb d2209698fb54: https://www.wikidata.org/wiki/Q867448
EMMO 8de5d5bf db1c 40ac b698 095ba3b18578: 10-13.2
EMMO 967080e5 2f42 4eb2 a3a9 c58143e835f9: Atomic quantum number related to the number n−1 of radial nodes of one-electron wave functions.

BecquerelPerKilogram
type: Class
subclass of: Restriction
  has value: 1.0
subclass of: Restriction
  has value: 0.0
comment: "Becquerel per Kilogram" is used to describe radioactivity, which is often expressed in becquerels per unit of volume or weight, to express how much radioactive material is contained in a sample. -- QUDT
alternative label: Becquerel per Kilogram
EMMO 1f1b164d ec6a 4faa 8d5e 88bda62316cc: http://qudt.org/vocab/unit/BQ-PER-KiloGM
EMMO 33ae2d07 5526 4555 a0b4 8f4c031b5652: Bq.kg-1
EMMO 33ae2d07 5526 4555 a0b4 8f4c031b5652: Bq/kg
EMMO 7f1dec83 d85e 4e1b b7bd c9442d4f5a64: Bq/kg
EMMO 967080e5 2f42 4eb2 a3a9 c58143e835f9: "Becquerel per Kilogram" is used to describe radioactivity, which is often expressed in becquerels per unit of volume or weight, to express how much radioactive material is contained in a sample. -- QUDT

FemtoMole
type: Class
subclass of: Restriction
  some values from: Mole
subclass of: Restriction
  has value: 1e-15
subclass of: Restriction
  has value: 0.0
EMMO 1f1b164d ec6a 4faa 8d5e 88bda62316cc: http://qudt.org/vocab/unit/FemtoMOL
EMMO 7f1dec83 d85e 4e1b b7bd c9442d4f5a64: fmol

PerSecondSquareMetre
type: Class
subclass of: Restriction
  has value: 1.0
subclass of: Restriction
  has value: 0.0
comment: `Per Second Square Meter` is a measure of flux with dimensions /sec-m². -- QUDT
alternative label: ReciprocalSecondSquareMetre
EMMO 1f1b164d ec6a 4faa 8d5e 88bda62316cc: http://qudt.org/vocab/unit/PER-SEC-M2
EMMO 33ae2d07 5526 4555 a0b4 8f4c031b5652: /(s1.m2)
EMMO 33ae2d07 5526 4555 a0b4 8f4c031b5652: s-1.m-2
EMMO 7f1dec83 d85e 4e1b b7bd c9442d4f5a64: /s⋅m²
EMMO 967080e5 2f42 4eb2 a3a9 c58143e835f9: `Per Second Square Meter` is a measure of flux with dimensions /sec-m². -- QUDT

PressureFractionUnit
type: Class
comment: Unit for quantities of dimension one that are the fraction of two pressures.
EMMO 967080e5 2f42 4eb2 a3a9 c58143e835f9: Unit for quantities of dimension one that are the fraction of two pressures.

BoronSymbol
type: Class
subclass of: Restriction
  has value: B
comment: The symbol that stands for the boron atom.
EMMO 967080e5 2f42 4eb2 a3a9 c58143e835f9: The symbol that stands for the boron atom.

Flanging
type: Class

MetreKilogram
type: Class
subclass of: Restriction
  has value: 1.0
subclass of: Restriction
  has value: 0.0
comment: Kilogram metre.
EMMO 1f1b164d ec6a 4faa 8d5e 88bda62316cc: http://qudt.org/vocab/unit/M-KiloGM
EMMO 33ae2d07 5526 4555 a0b4 8f4c031b5652: m.kg
EMMO 7f1dec83 d85e 4e1b b7bd c9442d4f5a64: m⋅kg
EMMO 967080e5 2f42 4eb2 a3a9 c58143e835f9: Kilogram metre.

NewtonPerMilliMetre
type: Class
subclass of: Restriction
  has value: 1000.0
subclass of: Restriction
  has value: 0.0
comment: SI derived unit newton divided by the 0.001-fold of the SI base unit metre -- QUDT
alternative label: Newton Per Millimetre
EMMO 1f1b164d ec6a 4faa 8d5e 88bda62316cc: http://qudt.org/vocab/unit/N-PER-MilliM
EMMO 33ae2d07 5526 4555 a0b4 8f4c031b5652: N.mm-1
EMMO 7f1dec83 d85e 4e1b b7bd c9442d4f5a64: N/mm
EMMO 967080e5 2f42 4eb2 a3a9 c58143e835f9: SI derived unit newton divided by the 0.001-fold of the SI base unit metre -- QUDT

DissociationConstant
type: Class
subclass of: Restriction
comment: Ratio of the number of dissociated molecules of a specified type to the total number of dissolved molecules of this type.
EMMO 26bf1bef d192 4da6 b0eb d2209698fb54: https://www.wikidata.org/wiki/Q898254
EMMO 50c298c2 55a2 4068 b3ac 4e948c33181f: https://www.electropedia.org/iev/iev.nsf/display
EMMO 967080e5 2f42 4eb2 a3a9 c58143e835f9: Ratio of the number of dissociated molecules of a specified type to the total number of dissolved molecules of this type.

PerWeber
type: Class
subclass of: Restriction
  has value: 1.0
subclass of: Restriction
  has value: 0.0
comment: Per Weber unit.
alternative label: ReciprocalWeber
EMMO 1f1b164d ec6a 4faa 8d5e 88bda62316cc: http://qudt.org/vocab/unit/PER-WB
EMMO 33ae2d07 5526 4555 a0b4 8f4c031b5652: Wb-1
EMMO 7f1dec83 d85e 4e1b b7bd c9442d4f5a64: /Wb
EMMO 967080e5 2f42 4eb2 a3a9 c58143e835f9: Per Weber unit.

PeltierCoefficient
type: Class
subclass of: Restriction
comment: Quotient of Peltier heat power developed at a junction, and the electric current flowing from substance a to substance b.
EMMO 1f1b164d ec6a 4faa 8d5e 88bda62316cc: https://qudt.org/vocab/quantitykind/PeltierCoefficient
EMMO 26bf1bef d192 4da6 b0eb d2209698fb54: https://www.wikidata.org/wiki/Q105801003
EMMO 8de5d5bf db1c 40ac b698 095ba3b18578: 12-22
EMMO 967080e5 2f42 4eb2 a3a9 c58143e835f9: Quotient of Peltier heat power developed at a junction, and the electric current flowing from substance a to substance b.

LiquidPhaseSintering
type: Class
see also: ISO 3252:2019 Powder metallurgy liquid-phase sintering: sintering of a powder or compact containing at least two constituents, under conditions such that a liquid phase is formed

ElectricImpedance
type: Class
comment: Measure of the opposition that a circuit presents to a current when a voltage is applied.
alternative label: Impedance
EMMO 1f1b164d ec6a 4faa 8d5e 88bda62316cc: http://qudt.org/vocab/quantitykind/Impedance
EMMO 26bf1bef d192 4da6 b0eb d2209698fb54: https://www.wikidata.org/wiki/Q179043
EMMO 50c298c2 55a2 4068 b3ac 4e948c33181f: https://www.electropedia.org/iev/iev.nsf/display
EMMO 8de5d5bf db1c 40ac b698 095ba3b18578: 6-51.1
EMMO 967080e5 2f42 4eb2 a3a9 c58143e835f9: Measure of the opposition that a circuit presents to a current when a voltage is applied.
EMMO c84c6752 6d64 48cc 9500 e54a3c34898d: https://en.wikipedia.org/wiki/Electrical_impedance

RestEnergy
type: Class
comment: E_0 = m_0 * c_0^2 where m_0 is the rest mass of that particle and c_0 is the speed of light in a vacuum.
comment: Product of the rest mass and the square of the speed of light in vacuum.
EMMO 26bf1bef d192 4da6 b0eb d2209698fb54: https://www.wikidata.org/wiki/Q11663629
EMMO 50c298c2 55a2 4068 b3ac 4e948c33181f: https://www.electropedia.org/iev/iev.nsf/display
EMMO 8de5d5bf db1c 40ac b698 095ba3b18578: 10-3
EMMO 967080e5 2f42 4eb2 a3a9 c58143e835f9: Product of the rest mass and the square of the speed of light in vacuum.
EMMO c7b62dd7 063a 4c2a 8504 42f7264ba83f: E_0 = m_0 * c_0^2 where m_0 is the rest mass of that particle and c_0 is the speed of light in a vacuum.
EMMO c84c6752 6d64 48cc 9500 e54a3c34898d: https://en.wikipedia.org/wiki/Invariant_mass#Rest_energy

PalladiumAtom
type: Class
subclass of: Restriction
subclass of: Restriction
  has value: 106.42
subclass of: Restriction
  has value: 46
comment: Atom subclass for palladium.
EMMO 967080e5 2f42 4eb2 a3a9 c58143e835f9: Atom subclass for palladium.

SiemensPerCentiMetre
type: Class
subclass of: Restriction
  has value: 100.0
subclass of: Restriction
  has value: 0.0
comment: SI derived unit Siemens divided by the 0.01-fold of the SI base unit metre -- QUDT
alternative label: Siemens Per Centimetre
EMMO 1f1b164d ec6a 4faa 8d5e 88bda62316cc: http://qudt.org/vocab/unit/S-PER-CentiM
EMMO 33ae2d07 5526 4555 a0b4 8f4c031b5652: S.cm-1
EMMO 7f1dec83 d85e 4e1b b7bd c9442d4f5a64: S/cm
EMMO 967080e5 2f42 4eb2 a3a9 c58143e835f9: SI derived unit Siemens divided by the 0.01-fold of the SI base unit metre -- QUDT

PhaseHeterogeneousMixture
type: Class
subclass of: Restriction
comment: A mixture in which more than one phases of matter cohexists.
comment: Phase heterogeneous mixture may share the same state of matter. For example, immiscibile liquid phases (e.g. oil and water) constitute a mixture whose phases are clearly separated but share the same state of matter.
EMMO 967080e5 2f42 4eb2 a3a9 c58143e835f9: A mixture in which more than one phases of matter cohexists.
EMMO c7b62dd7 063a 4c2a 8504 42f7264ba83f: Phase heterogeneous mixture may share the same state of matter. For example, immiscibile liquid phases (e.g. oil and water) constitute a mixture whose phases are clearly separated but share the same state of matter.

DarmastadtiumSymbol
type: Class
subclass of: Restriction
  has value: Ds
comment: The symbol that stands for the darmastadtium atom.
EMMO 967080e5 2f42 4eb2 a3a9 c58143e835f9: The symbol that stands for the darmastadtium atom.

SurfaceMassDensity
type: Class
subclass of: Restriction
comment: at a given point on a two-dimensional domain of quasi-infinitesimal area dA, scalar quantity equal to the mass dm within the domain divided by the area dA, thus ρA = dm/dA.
alternative label: AreicMass
alternative label: SurfaceDensity
EMMO 26bf1bef d192 4da6 b0eb d2209698fb54: https://www.wikidata.org/wiki/Q1907514
EMMO 50c298c2 55a2 4068 b3ac 4e948c33181f: https://www.electropedia.org/iev/iev.nsf/display
EMMO 8de5d5bf db1c 40ac b698 095ba3b18578: 4-5
EMMO 967080e5 2f42 4eb2 a3a9 c58143e835f9: at a given point on a two-dimensional domain of quasi-infinitesimal area dA, scalar quantity equal to the mass dm within the domain divided by the area dA, thus ρA = dm/dA.
EMMO fe015383 afb3 44a6 ae86 043628697aa2: https://doi.org/10.1351/goldbook.S06167

Yotta
type: Class
subclass of: Restriction
  has value: Y
subclass of: Restriction
  has value: 1e+24
comment: SI prefix who's value is 1e24.
EMMO 967080e5 2f42 4eb2 a3a9 c58143e835f9: SI prefix who's value is 1e24.

AmperePerCentiMetre
type: Class
subclass of: Restriction
  has value: 100.0
subclass of: Restriction
  has value: 0.0
comment: SI base unit ampere divided by the 0.01-fold of the SI base unit metre -- QUDT
alternative label: Ampere Per Centimetre
EMMO 1f1b164d ec6a 4faa 8d5e 88bda62316cc: http://qudt.org/vocab/unit/A-PER-CentiM
EMMO 33ae2d07 5526 4555 a0b4 8f4c031b5652: A.cm-1
EMMO 7f1dec83 d85e 4e1b b7bd c9442d4f5a64: A/cm
EMMO 967080e5 2f42 4eb2 a3a9 c58143e835f9: SI base unit ampere divided by the 0.01-fold of the SI base unit metre -- QUDT

EmpiricalSimulationSoftware
type: Class
comment: A computational application that uses an empiric equation to predict the behaviour of a system without relying on the knowledge of the actual physical phenomena occurring in the object.
EMMO 967080e5 2f42 4eb2 a3a9 c58143e835f9: A computational application that uses an empiric equation to predict the behaviour of a system without relying on the knowledge of the actual physical phenomena occurring in the object.

Hardening
type: Class
comment: Heat treatment process that generally produces martensite in the matrix.
EMMO c7b62dd7 063a 4c2a 8504 42f7264ba83f: Heat treatment process that generally produces martensite in the matrix.

CapacitancePerLengthUnit
type: Class
subclass of: Restriction
  has value: T+4 L-1 M-1 I+2 Θ0 N0 J0
comment: The class of units with dimensionality 'CapacitancePerLength'.
EMMO 967080e5 2f42 4eb2 a3a9 c58143e835f9: The class of units with dimensionality 'CapacitancePerLength'.

FemtoCoulomb
type: Class
subclass of: Restriction
  some values from: Coulomb
subclass of: Restriction
  has value: 1e-15
subclass of: Restriction
  has value: 0.0
comment: A FemtoCoulomb is 10⁻¹⁵ C. -- QUDT
EMMO 1f1b164d ec6a 4faa 8d5e 88bda62316cc: http://qudt.org/vocab/unit/FemtoC
EMMO 33ae2d07 5526 4555 a0b4 8f4c031b5652: fC
EMMO 7f1dec83 d85e 4e1b b7bd c9442d4f5a64: fC
EMMO 967080e5 2f42 4eb2 a3a9 c58143e835f9: A FemtoCoulomb is 10⁻¹⁵ C. -- QUDT

JouleSecondPerMole
type: Class
subclass of: Restriction
  has value: 1.0
subclass of: Restriction
  has value: 0.0
comment: `Joule Second per Mole` is a unit for 'Molar Angular Momentum' expressed as J s mol⁻¹. -- QUDT
alternative label: Joule Second per Mole
EMMO 1f1b164d ec6a 4faa 8d5e 88bda62316cc: http://qudt.org/vocab/unit/J-SEC-PER-MOL
EMMO 33ae2d07 5526 4555 a0b4 8f4c031b5652: J.s.mol-1
EMMO 7f1dec83 d85e 4e1b b7bd c9442d4f5a64: J⋅s/mol
EMMO 967080e5 2f42 4eb2 a3a9 c58143e835f9: `Joule Second per Mole` is a unit for 'Molar Angular Momentum' expressed as J s mol⁻¹. -- QUDT

EnergyTimePerAmountUnit
type: Class
subclass of: Restriction
  has value: T-1 L+2 M+1 I0 Θ0 N-1 J0
comment: The class of units with dimensionality 'EnergyTimePerAmount'.
EMMO 967080e5 2f42 4eb2 a3a9 c58143e835f9: The class of units with dimensionality 'EnergyTimePerAmount'.

MicroMolePerGram
type: Class
subclass of: Restriction
  has value: 0.001
subclass of: Restriction
  has value: 0.0
comment: 0.000001-fold of the SI base unit mol divided by the 0.001-fold of the SI base unit kilogram -- QUDT
alternative label: Micromoles per gram
EMMO 1f1b164d ec6a 4faa 8d5e 88bda62316cc: http://qudt.org/vocab/unit/MicroMOL-PER-GM
EMMO 33ae2d07 5526 4555 a0b4 8f4c031b5652: umol.g-1
EMMO 33ae2d07 5526 4555 a0b4 8f4c031b5652: umol/g
EMMO 7f1dec83 d85e 4e1b b7bd c9442d4f5a64: µmol/g
EMMO 967080e5 2f42 4eb2 a3a9 c58143e835f9: 0.000001-fold of the SI base unit mol divided by the 0.001-fold of the SI base unit kilogram -- QUDT

SquareCentiMetreSecond
type: Class
subclass of: Restriction
  has value: 0.0001
subclass of: Restriction
  has value: 0.0
comment: "Square Centimeter Second" is a C.G.S System unit for 'Area Time' expressed as cm² . s. -- QUDT
alternative label: Square Centimetre Second
EMMO 1f1b164d ec6a 4faa 8d5e 88bda62316cc: http://qudt.org/vocab/unit/CentiM2-SEC
EMMO 33ae2d07 5526 4555 a0b4 8f4c031b5652: cm2.s
EMMO 7f1dec83 d85e 4e1b b7bd c9442d4f5a64: cm²⋅s
EMMO 967080e5 2f42 4eb2 a3a9 c58143e835f9: "Square Centimeter Second" is a C.G.S System unit for 'Area Time' expressed as cm² . s. -- QUDT

MilliNewton
type: Class
subclass of: Restriction
  some values from: Newton
subclass of: Restriction
  has value: 0.001
subclass of: Restriction
  has value: 0.0
comment: 0.001-fold of the SI derived unit newton -- QUDT
EMMO 1f1b164d ec6a 4faa 8d5e 88bda62316cc: http://qudt.org/vocab/unit/MilliN
EMMO 33ae2d07 5526 4555 a0b4 8f4c031b5652: mN
EMMO 7f1dec83 d85e 4e1b b7bd c9442d4f5a64: mN
EMMO 967080e5 2f42 4eb2 a3a9 c58143e835f9: 0.001-fold of the SI derived unit newton -- QUDT

MicroSievert
type: Class
subclass of: Restriction
  some values from: Sievert
subclass of: Restriction
  has value: 1e-06
subclass of: Restriction
  has value: 0.0
comment: Although the sievert has the same dimensions as the gray (i.e. joules per kilogram), it measures a different quantity. To avoid any risk of confusion between the absorbed dose and the equivalent dose, the corresponding special units, namely the gray instead of the joule per kilogram for absorbed dose and the sievert instead of the joule per kilogram for the dose equivalent, should be used. 0.000001-fold of the SI derived unit sievert. -- QUDT
EMMO 1f1b164d ec6a 4faa 8d5e 88bda62316cc: http://qudt.org/vocab/unit/MicroSV
EMMO 33ae2d07 5526 4555 a0b4 8f4c031b5652: uSv
EMMO 7f1dec83 d85e 4e1b b7bd c9442d4f5a64: µSv
EMMO 967080e5 2f42 4eb2 a3a9 c58143e835f9: Although the sievert has the same dimensions as the gray (i.e. joules per kilogram), it measures a different quantity. To avoid any risk of confusion between the absorbed dose and the equivalent dose, the corresponding special units, namely the gray instead of the joule per kilogram for absorbed dose and the sievert instead of the joule per kilogram for the dose equivalent, should be used. 0.000001-fold of the SI derived unit sievert. -- QUDT
EMMO c84c6752 6d64 48cc 9500 e54a3c34898d: http://en.wikipedia.org/wiki/Sievert

ApparentPower
type: Class
comment: RMS value voltage multiplied by rms value of electric current.
EMMO 1f1b164d ec6a 4faa 8d5e 88bda62316cc: https://qudt.org/vocab/quantitykind/ApparentPower
EMMO 26bf1bef d192 4da6 b0eb d2209698fb54: https://www.wikidata.org/wiki/Q1930258
EMMO 50c298c2 55a2 4068 b3ac 4e948c33181f: https://www.electropedia.org/iev/iev.nsf/display
EMMO 8de5d5bf db1c 40ac b698 095ba3b18578: 6-57
EMMO 967080e5 2f42 4eb2 a3a9 c58143e835f9: RMS value voltage multiplied by rms value of electric current.

CoulombPerMole
type: Class
subclass of: Restriction
  has value: 1.0
subclass of: Restriction
  has value: 0.0
comment: (C/mol) is a unit in the category of Molar electric charge. It is also known as coulombs/mol. Coulomb Per Mol has a dimension of TN{-1}I where T is time, N is amount of substance, and I is electric current. This unit is the standard SI unit in this category. -- QUDT
alternative label: Coulomb per Mole
EMMO 1f1b164d ec6a 4faa 8d5e 88bda62316cc: http://qudt.org/vocab/unit/C-PER-MOL
EMMO 33ae2d07 5526 4555 a0b4 8f4c031b5652: C.mol-1
EMMO 33ae2d07 5526 4555 a0b4 8f4c031b5652: C/mol
EMMO 7f1dec83 d85e 4e1b b7bd c9442d4f5a64: c/mol
EMMO 967080e5 2f42 4eb2 a3a9 c58143e835f9: (C/mol) is a unit in the category of Molar electric charge. It is also known as coulombs/mol. Coulomb Per Mol has a dimension of TN{-1}I where T is time, N is amount of substance, and I is electric current. This unit is the standard SI unit in this category. -- QUDT

GadoliniumSymbol
type: Class
subclass of: Restriction
  has value: Gd
comment: The symbol that stands for the gadolinium atom.
EMMO 967080e5 2f42 4eb2 a3a9 c58143e835f9: The symbol that stands for the gadolinium atom.

FluorineAtom
type: Class
subclass of: Restriction
subclass of: Restriction
  has value: 18.998403163
subclass of: Restriction
  has value: 9
comment: Atom subclass for fluorine.
EMMO 967080e5 2f42 4eb2 a3a9 c58143e835f9: Atom subclass for fluorine.

Luminance
type: Class
subclass of: Restriction
comment: A photometric measure of the luminous intensity per unit area of light travelling in a given direction.
comment: Measured in cd/m². Not to confuse with Illuminance, which is measured in lux (cd sr/m²).
EMMO 1f1b164d ec6a 4faa 8d5e 88bda62316cc: http://qudt.org/vocab/quantitykind/Luminance
EMMO 967080e5 2f42 4eb2 a3a9 c58143e835f9: A photometric measure of the luminous intensity per unit area of light travelling in a given direction.
EMMO fe015383 afb3 44a6 ae86 043628697aa2: https://doi.org/10.1351/goldbook.L03640

KilogramPerKiloMole
type: Class
subclass of: Restriction
  has value: 0.001
subclass of: Restriction
  has value: 0.0
comment: SI base unit kilogram divided by the 1 000-fold of the SI base unit mol -- QUDT
alternative label: Kilogram Per Kilomole
EMMO 1f1b164d ec6a 4faa 8d5e 88bda62316cc: http://qudt.org/vocab/unit/KiloGM-PER-KiloMOL
EMMO 33ae2d07 5526 4555 a0b4 8f4c031b5652: kg.kmol-1
EMMO 7f1dec83 d85e 4e1b b7bd c9442d4f5a64: kg/kmol
EMMO 967080e5 2f42 4eb2 a3a9 c58143e835f9: SI base unit kilogram divided by the 1 000-fold of the SI base unit mol -- QUDT

CelsiusTemperature
type: Class
subclass of: Restriction
comment: An objective comparative measure of hot or cold. Temperature is a relative quantity that can be used to express temperature differences. Unlike ThermodynamicTemperature, it cannot express absolute temperatures.
EMMO 1f1b164d ec6a 4faa 8d5e 88bda62316cc: http://qudt.org/vocab/quantitykind/CelciusTemperature
EMMO 8de5d5bf db1c 40ac b698 095ba3b18578: 5-2
EMMO 967080e5 2f42 4eb2 a3a9 c58143e835f9: An objective comparative measure of hot or cold. Temperature is a relative quantity that can be used to express temperature differences. Unlike ThermodynamicTemperature, it cannot express absolute temperatures.
EMMO fe015383 afb3 44a6 ae86 043628697aa2: https://doi.org/10.1351/goldbook.T06261

AnalogData
type: Class
comment: Data that are decoded retaining its continuous variations characteristic.
comment: The fact that there may be a finite granularity in the variations of the material basis (e.g. the smallest peak in a vynil that can be recognized by the piezo-electric transducer) does not prevent a data to be analog. It means only that the focus on such data encoding is on a scale that makes such variations negligible, making them practically a continuum.
example: A vynil contain continuous information about the recorded sound.
EMMO 967080e5 2f42 4eb2 a3a9 c58143e835f9: Data that are decoded retaining its continuous variations characteristic.
EMMO c7b62dd7 063a 4c2a 8504 42f7264ba83f: The fact that there may be a finite granularity in the variations of the material basis (e.g. the smallest peak in a vynil that can be recognized by the piezo-electric transducer) does not prevent a data to be analog. It means only that the focus on such data encoding is on a scale that makes such variations negligible, making them practically a continuum.

ResidualResistivity
type: Class
comment: For metals, the resistivity extrapolated to zero thermodynamic temperature.
EMMO 1f1b164d ec6a 4faa 8d5e 88bda62316cc: https://qudt.org/vocab/quantitykind/ResidualResistivity
EMMO 26bf1bef d192 4da6 b0eb d2209698fb54: https://www.wikidata.org/wiki/Q25098876
EMMO 50c298c2 55a2 4068 b3ac 4e948c33181f: https://www.electropedia.org/iev/iev.nsf/display
EMMO 8de5d5bf db1c 40ac b698 095ba3b18578: 12-17
EMMO 967080e5 2f42 4eb2 a3a9 c58143e835f9: For metals, the resistivity extrapolated to zero thermodynamic temperature.

SiemensSquareMetrePerMole
type: Class
subclass of: Restriction
  has value: 1.0
subclass of: Restriction
  has value: 0.0
comment: Siemens square metre per mole.
EMMO 1f1b164d ec6a 4faa 8d5e 88bda62316cc: http://qudt.org/vocab/unit/S-M2-PER-MOL
EMMO 33ae2d07 5526 4555 a0b4 8f4c031b5652: S.m2.mol-1
EMMO 7f1dec83 d85e 4e1b b7bd c9442d4f5a64: S⋅m²/mol
EMMO 967080e5 2f42 4eb2 a3a9 c58143e835f9: Siemens square metre per mole.

AmountConductivityUnit
type: Class
subclass of: Restriction
  has value: T+3 L0 M-1 I+2 Θ0 N-1 J0
comment: The class of units with dimensionality 'AmountConductivity'.
EMMO 967080e5 2f42 4eb2 a3a9 c58143e835f9: The class of units with dimensionality 'AmountConductivity'.

CollectiveAgent
type: Class

MolePerKilogram
type: Class
subclass of: Restriction
  has value: 1.0
subclass of: Restriction
  has value: 0.0
comment: Mole Per Kilogram (mol/kg) is a unit of Molality -- QUDT
alternative label: Mole per Kilogram
EMMO 1f1b164d ec6a 4faa 8d5e 88bda62316cc: http://qudt.org/vocab/unit/MOL-PER-KiloGM
EMMO 33ae2d07 5526 4555 a0b4 8f4c031b5652: mol.kg-1
EMMO 33ae2d07 5526 4555 a0b4 8f4c031b5652: mol/kg
EMMO 7f1dec83 d85e 4e1b b7bd c9442d4f5a64: mol/kg
EMMO 967080e5 2f42 4eb2 a3a9 c58143e835f9: Mole Per Kilogram (mol/kg) is a unit of Molality -- QUDT

RutheniumAtom
type: Class
subclass of: Restriction
subclass of: Restriction
  has value: 101.07
subclass of: Restriction
  has value: 44
comment: Atom subclass for ruthenium.
EMMO 967080e5 2f42 4eb2 a3a9 c58143e835f9: Atom subclass for ruthenium.

MeasuringInstrument
type: Class
comment: A measuring instrument that can be used alone is a measuring system.
comment: Device used for making measurements, alone or in conjunction with one or more supplementary devices. -- VIM
EMMO 967080e5 2f42 4eb2 a3a9 c58143e835f9: Device used for making measurements, alone or in conjunction with one or more supplementary devices. -- VIM
EMMO bb49844b 45d7 4f0d 8cae 8e552cbc20d6: measuring instrument

Ruby
type: Class

HectoPascal
type: Class
subclass of: Restriction
  some values from: Pascal
subclass of: Restriction
  has value: 100.0
subclass of: Restriction
  has value: 0.0
comment: Hectopascal is a unit of pressure. 1 Pa is approximately the pressure exerted by a 10-g mass resting on a 1-cm2 area. 1013 hPa = 1 atm. There are 100 pascals in 1 hectopascal. -- QUDT
EMMO 1f1b164d ec6a 4faa 8d5e 88bda62316cc: http://qudt.org/vocab/unit/HectoPA
EMMO 33ae2d07 5526 4555 a0b4 8f4c031b5652: hPa
EMMO 7f1dec83 d85e 4e1b b7bd c9442d4f5a64: hPa
EMMO 967080e5 2f42 4eb2 a3a9 c58143e835f9: Hectopascal is a unit of pressure. 1 Pa is approximately the pressure exerted by a 10-g mass resting on a 1-cm2 area. 1013 hPa = 1 atm. There are 100 pascals in 1 hectopascal. -- QUDT

KiloWeber
type: Class
subclass of: Restriction
  some values from: Weber
subclass of: Restriction
  has value: 1000.0
subclass of: Restriction
  has value: 0.0
EMMO 1f1b164d ec6a 4faa 8d5e 88bda62316cc: http://qudt.org/vocab/unit/KiloWB
EMMO 7f1dec83 d85e 4e1b b7bd c9442d4f5a64: kWb

ThermalUtilizationFactor
type: Class
comment: In an infinite medium, the quotient of the number of thermal neutrons absorbed in a fissionable nuclide or in a nuclear fuel, as specified, and the total number of thermal neutrons absorbed.
EMMO 1f1b164d ec6a 4faa 8d5e 88bda62316cc: https://qudt.org/vocab/quantitykind/ThermalUtilizationFactor
EMMO 26bf1bef d192 4da6 b0eb d2209698fb54: https://www.wikidata.org/wiki/Q99197650
EMMO 8de5d5bf db1c 40ac b698 095ba3b18578: 10-76
EMMO 967080e5 2f42 4eb2 a3a9 c58143e835f9: In an infinite medium, the quotient of the number of thermal neutrons absorbed in a fissionable nuclide or in a nuclear fuel, as specified, and the total number of thermal neutrons absorbed.

HartreeEnergy
type: Class
comment: Energy of the electron in a hydrogen atom in its ground state
EMMO 1f1b164d ec6a 4faa 8d5e 88bda62316cc: https://qudt.org/vocab/unit/E_h.html
EMMO 26bf1bef d192 4da6 b0eb d2209698fb54: https://www.wikidata.org/wiki/Q476572
EMMO 6dd685dd 1895 46e4 b227 be9f7d643c25: https://dbpedia.org/page/Hartree
EMMO 8de5d5bf db1c 40ac b698 095ba3b18578: 10-8
EMMO 967080e5 2f42 4eb2 a3a9 c58143e835f9: Energy of the electron in a hydrogen atom in its ground state
EMMO c84c6752 6d64 48cc 9500 e54a3c34898d: https://en.wikipedia.org/wiki/Hartree
EMMO fe015383 afb3 44a6 ae86 043628697aa2: https://doi.org/10.1351/goldbook.H02748

CoperniciumSymbol
type: Class
subclass of: Restriction
  has value: Cn
comment: The symbol that stands for the copernicium atom.
EMMO 967080e5 2f42 4eb2 a3a9 c58143e835f9: The symbol that stands for the copernicium atom.

StaticFrictionCoefficient
type: Class
alternative label: CoefficientOfStaticFriction
alternative label: StaticFrictionFactor
EMMO 26bf1bef d192 4da6 b0eb d2209698fb54: https://www.wikidata.org/wiki/Q73695673
EMMO 50c298c2 55a2 4068 b3ac 4e948c33181f: https://www.electropedia.org/iev/iev.nsf/display
EMMO 8de5d5bf db1c 40ac b698 095ba3b18578: 4-23.1

AngularReciprocalLatticeVector
type: Class
comment: Vector whose scalar products with all fundamental lattice vectors are integral multiples of 2pi.
EMMO 1f1b164d ec6a 4faa 8d5e 88bda62316cc: https://qudt.org/vocab/quantitykind/AngularReciprocalLatticeVector
EMMO 26bf1bef d192 4da6 b0eb d2209698fb54: https://www.wikidata.org/wiki/Q105475278
EMMO 8de5d5bf db1c 40ac b698 095ba3b18578: 12-2.1
EMMO 967080e5 2f42 4eb2 a3a9 c58143e835f9: Vector whose scalar products with all fundamental lattice vectors are integral multiples of 2pi.

SolidSol
type: Class
comment: A type of sol in the form of one solid dispersed in another continuous solid.
EMMO 967080e5 2f42 4eb2 a3a9 c58143e835f9: A type of sol in the form of one solid dispersed in another continuous solid.

NewtonPerCubicMetre
type: Class
subclass of: Restriction
  has value: 1.0
subclass of: Restriction
  has value: 0.0
comment: Newton per cubic metre.
EMMO 1f1b164d ec6a 4faa 8d5e 88bda62316cc: http://qudt.org/vocab/unit/N-PER-M3
EMMO 33ae2d07 5526 4555 a0b4 8f4c031b5652: N.m-3
EMMO 7f1dec83 d85e 4e1b b7bd c9442d4f5a64: N/m³
EMMO 967080e5 2f42 4eb2 a3a9 c58143e835f9: Newton per cubic metre.

KilogramPerMetre
type: Class
subclass of: Restriction
  has value: 1.0
subclass of: Restriction
  has value: 0.0
comment: Kilogram Per Meter (kg/m) is a unit in the category of Linear mass density. It is also known as kilogram/meter, kilogram/metre, kilograms per meter, kilogram per metre, kilograms per metre. This unit is commonly used in the SI unit system. Kilogram Per Meter (kg/m) has a dimension of ML-1 where M is mass, and L is length. This unit is the standard SI unit in this category. -- QUDT
alternative label: Kilogram per Metre
EMMO 1f1b164d ec6a 4faa 8d5e 88bda62316cc: http://qudt.org/vocab/unit/KiloGM-PER-M
EMMO 33ae2d07 5526 4555 a0b4 8f4c031b5652: kg.m-1
EMMO 33ae2d07 5526 4555 a0b4 8f4c031b5652: kg/m
EMMO 7f1dec83 d85e 4e1b b7bd c9442d4f5a64: kg/m
EMMO 967080e5 2f42 4eb2 a3a9 c58143e835f9: Kilogram Per Meter (kg/m) is a unit in the category of Linear mass density. It is also known as kilogram/meter, kilogram/metre, kilograms per meter, kilogram per metre, kilograms per metre. This unit is commonly used in the SI unit system. Kilogram Per Meter (kg/m) has a dimension of ML-1 where M is mass, and L is length. This unit is the standard SI unit in this category. -- QUDT

MagneticVectorPotential
type: Class
subclass of: Restriction
comment: Vector potential of the magnetic flux density.
EMMO 1f1b164d ec6a 4faa 8d5e 88bda62316cc: https://qudt.org/vocab/quantitykind/MagneticVectorPotential
EMMO 26bf1bef d192 4da6 b0eb d2209698fb54: https://www.wikidata.org/wiki/Q2299100
EMMO 50c298c2 55a2 4068 b3ac 4e948c33181f: https://www.electropedia.org/iev/iev.nsf/display
EMMO 8de5d5bf db1c 40ac b698 095ba3b18578: 6-32
EMMO 967080e5 2f42 4eb2 a3a9 c58143e835f9: Vector potential of the magnetic flux density.

SimulationLanguage
type: Class
comment: A computer language used to describe simulations.
EMMO 967080e5 2f42 4eb2 a3a9 c58143e835f9: A computer language used to describe simulations.
EMMO c84c6752 6d64 48cc 9500 e54a3c34898d: https://en.wikipedia.org/wiki/Simulation_language

KiloAmpere
type: Class
subclass of: Restriction
  some values from: Ampere
subclass of: Restriction
  has value: 1000.0
subclass of: Restriction
  has value: 0.0
comment: A kiloampere is 1000 A
alternative label: kiloampere
EMMO 1f1b164d ec6a 4faa 8d5e 88bda62316cc: http://qudt.org/vocab/unit/KiloA
EMMO 33ae2d07 5526 4555 a0b4 8f4c031b5652: kA
EMMO 7f1dec83 d85e 4e1b b7bd c9442d4f5a64: kA
EMMO 967080e5 2f42 4eb2 a3a9 c58143e835f9: A kiloampere is 1000 A

NanoGramPerCubicMetre
type: Class
subclass of: Restriction
  some values from: GramPerCubicMetre
subclass of: Restriction
  has value: 1e-12
subclass of: Restriction
  has value: 0.0
comment: 0.000000000001-fold of the SI base unit kilogram divided by the power of the SI base unit metre with the exponent 3 -- QUDT
alternative label: Nanogram Per Cubic Metre
EMMO 1f1b164d ec6a 4faa 8d5e 88bda62316cc: http://qudt.org/vocab/unit/NanoGM-PER-M3
EMMO 33ae2d07 5526 4555 a0b4 8f4c031b5652: ng.m-3
EMMO 7f1dec83 d85e 4e1b b7bd c9442d4f5a64: ng/m³
EMMO 967080e5 2f42 4eb2 a3a9 c58143e835f9: 0.000000000001-fold of the SI base unit kilogram divided by the power of the SI base unit metre with the exponent 3 -- QUDT

PerCubicMetre
type: Class
subclass of: Restriction
  has value: 1.0
subclass of: Restriction
  has value: 0.0
comment: "Per Cubic Meter" is a denominator unit with dimensions /m³. -- QUDT
alternative label: Reciprocal Cubic Metre
EMMO 1f1b164d ec6a 4faa 8d5e 88bda62316cc: http://qudt.org/vocab/unit/PER-M3
EMMO 33ae2d07 5526 4555 a0b4 8f4c031b5652: /m3
EMMO 33ae2d07 5526 4555 a0b4 8f4c031b5652: m-3
EMMO 7f1dec83 d85e 4e1b b7bd c9442d4f5a64: /m³
EMMO 967080e5 2f42 4eb2 a3a9 c58143e835f9: "Per Cubic Meter" is a denominator unit with dimensions /m³. -- QUDT

MolecularFormula
type: Class
subclass of: Restriction
comment: An expression that provides information about the element types that constiture a molecule or a molecular substance and their number.
example: Hydrogen peroxide is H2O2
EMMO 967080e5 2f42 4eb2 a3a9 c58143e835f9: An expression that provides information about the element types that constiture a molecule or a molecular substance and their number.

ScientificTheory
type: Class
comment: A scientific theory is a description, objective and observed, produced with scientific methodology.
EMMO 967080e5 2f42 4eb2 a3a9 c58143e835f9: A scientific theory is a description, objective and observed, produced with scientific methodology.

ChipboardManufacturing
type: Class

MilliMolePerSquareMetre
type: Class
subclass of: Restriction
  some values from: MolePerSquareMetre
subclass of: Restriction
  has value: 0.001
subclass of: Restriction
  has value: 0.0
comment: Unavailable. -- QUDT
alternative label: Millimoles per square metre
EMMO 1f1b164d ec6a 4faa 8d5e 88bda62316cc: http://qudt.org/vocab/unit/MilliMOL-PER-M2
EMMO 33ae2d07 5526 4555 a0b4 8f4c031b5652: mmol.m-2
EMMO 7f1dec83 d85e 4e1b b7bd c9442d4f5a64: mmol/m²
EMMO 967080e5 2f42 4eb2 a3a9 c58143e835f9: Unavailable. -- QUDT

IUPACName
type: Class

AreaTimeTemperatureUnit
type: Class
subclass of: Restriction
  has value: T+1 L+2 M0 I0 Θ+1 N0 J0
comment: The class of units with dimensionality 'AreaTimeTemperature'.
EMMO 967080e5 2f42 4eb2 a3a9 c58143e835f9: The class of units with dimensionality 'AreaTimeTemperature'.

KelvinPerWatt
type: Class
subclass of: Restriction
  has value: 1.0
subclass of: Restriction
  has value: 0.0
comment: Thermal resistance is a heat property and a measure of a temperature difference by which an object or material resists a heat flow (heat per time unit or thermal resistance). Thermal resistance is the reciprocal thermal conductance. Absolute thermal resistance is the temperature difference across a structure when a unit of heat energy flows through it in unit time. It is the reciprocal of thermal conductance. The SI units of thermal resistance are kelvins per watt or the equivalent degrees Celsius per watt (the two are the same since as intervals). -- QUDT
alternative label: Kelvin per Watt
EMMO 1f1b164d ec6a 4faa 8d5e 88bda62316cc: http://qudt.org/vocab/unit/K-PER-W
EMMO 33ae2d07 5526 4555 a0b4 8f4c031b5652: K.W-1
EMMO 33ae2d07 5526 4555 a0b4 8f4c031b5652: K/W
EMMO 7f1dec83 d85e 4e1b b7bd c9442d4f5a64: K/W
EMMO 967080e5 2f42 4eb2 a3a9 c58143e835f9: Thermal resistance is a heat property and a measure of a temperature difference by which an object or material resists a heat flow (heat per time unit or thermal resistance). Thermal resistance is the reciprocal thermal conductance. Absolute thermal resistance is the temperature difference across a structure when a unit of heat energy flows through it in unit time. It is the reciprocal of thermal conductance. The SI units of thermal resistance are kelvins per watt or the equivalent degrees Celsius per watt (the two are the same since as intervals). -- QUDT

MilliWatt
type: Class
subclass of: Restriction
  some values from: Watt
subclass of: Restriction
  has value: 0.001
subclass of: Restriction
  has value: 0.0
comment: A milliwatt 0.01 N.
alternative label: milliwatt
EMMO 1f1b164d ec6a 4faa 8d5e 88bda62316cc: http://qudt.org/vocab/unit/MilliW
EMMO 33ae2d07 5526 4555 a0b4 8f4c031b5652: mW
EMMO 7f1dec83 d85e 4e1b b7bd c9442d4f5a64: mW
EMMO 967080e5 2f42 4eb2 a3a9 c58143e835f9: A milliwatt 0.01 N.

MilliSievert
type: Class
subclass of: Restriction
  some values from: Sievert
subclass of: Restriction
  has value: 0.001
subclass of: Restriction
  has value: 0.0
comment: 0.001-fold of the SI derived unit sievert -- QUDT
EMMO 1f1b164d ec6a 4faa 8d5e 88bda62316cc: http://qudt.org/vocab/unit/MilliSV
EMMO 33ae2d07 5526 4555 a0b4 8f4c031b5652: mSv
EMMO 7f1dec83 d85e 4e1b b7bd c9442d4f5a64: mSv
EMMO 967080e5 2f42 4eb2 a3a9 c58143e835f9: 0.001-fold of the SI derived unit sievert -- QUDT

PowerPerAreaVolumeUnit
type: Class
subclass of: Restriction
  has value: T-3 L-3 M+1 I0 Θ0 N0 J0
comment: The class of units with dimensionality 'PowerPerAreaVolume'.
EMMO 967080e5 2f42 4eb2 a3a9 c58143e835f9: The class of units with dimensionality 'PowerPerAreaVolume'.

RheniumSymbol
type: Class
subclass of: Restriction
  has value: Re
comment: The symbol that stands for the rhenium atom.
EMMO 967080e5 2f42 4eb2 a3a9 c58143e835f9: The symbol that stands for the rhenium atom.

GramPerSquareCentiMetre
type: Class
subclass of: Restriction
  has value: 10.0
subclass of: Restriction
  has value: 0.0
comment: 0,001-fold of the SI base unit kilogram divided by the 0.0001-fold of the power of the SI base unit metre and exponent 2 -- QUDT
alternative label: Gram Per Square Centimetre
EMMO 1f1b164d ec6a 4faa 8d5e 88bda62316cc: http://qudt.org/vocab/unit/GM-PER-CentiM2
EMMO 33ae2d07 5526 4555 a0b4 8f4c031b5652: g.cm-2
EMMO 33ae2d07 5526 4555 a0b4 8f4c031b5652: g/cm2
EMMO 7f1dec83 d85e 4e1b b7bd c9442d4f5a64: g/cm²
EMMO 967080e5 2f42 4eb2 a3a9 c58143e835f9: 0,001-fold of the SI base unit kilogram divided by the 0.0001-fold of the power of the SI base unit metre and exponent 2 -- QUDT

MicroAmpere
type: Class
subclass of: Restriction
  some values from: Ampere
subclass of: Restriction
  has value: 1e-06
subclass of: Restriction
  has value: 0.0
alternative label: microampere
EMMO 1f1b164d ec6a 4faa 8d5e 88bda62316cc: http://qudt.org/vocab/unit/MicroA
EMMO 33ae2d07 5526 4555 a0b4 8f4c031b5652: uA
EMMO 7f1dec83 d85e 4e1b b7bd c9442d4f5a64: µA

MilliGram
type: Class
subclass of: Restriction
  some values from: Gram
subclass of: Restriction
  has value: 1e-06
subclass of: Restriction
  has value: 0.0
comment: 0.000001-fold of the SI base unit kilogram -- QUDT
EMMO 1f1b164d ec6a 4faa 8d5e 88bda62316cc: http://qudt.org/vocab/unit/MilliGM
EMMO 33ae2d07 5526 4555 a0b4 8f4c031b5652: mg
EMMO 7f1dec83 d85e 4e1b b7bd c9442d4f5a64: mg
EMMO 967080e5 2f42 4eb2 a3a9 c58143e835f9: 0.000001-fold of the SI base unit kilogram -- QUDT

MagneticPolarisation
type: Class
comment: Vector quantity equal to the product of the magnetization M and the magnetic constant μ0.
EMMO 1f1b164d ec6a 4faa 8d5e 88bda62316cc: https://qudt.org/vocab/quantitykind/MagneticPolarization
EMMO 26bf1bef d192 4da6 b0eb d2209698fb54: https://www.wikidata.org/wiki/Q856711
EMMO 50c298c2 55a2 4068 b3ac 4e948c33181f: https://www.electropedia.org/iev/iev.nsf/display
EMMO 8de5d5bf db1c 40ac b698 095ba3b18578: 6-29
EMMO 967080e5 2f42 4eb2 a3a9 c58143e835f9: Vector quantity equal to the product of the magnetization M and the magnetic constant μ0.

MegaSiemensPerMetre
type: Class
subclass of: Restriction
  some values from: SiemensPerMetre
subclass of: Restriction
  has value: 1000000.0
subclass of: Restriction
  has value: 0.0
comment: 1,000,000-fold of the SI derived unit siemens divided by the SI base unit metre -- QUDT
alternative label: Megasiemens Per Metre
EMMO 1f1b164d ec6a 4faa 8d5e 88bda62316cc: http://qudt.org/vocab/unit/MegaS-PER-M
EMMO 33ae2d07 5526 4555 a0b4 8f4c031b5652: MS.m-1
EMMO 7f1dec83 d85e 4e1b b7bd c9442d4f5a64: MS/m
EMMO 967080e5 2f42 4eb2 a3a9 c58143e835f9: 1,000,000-fold of the SI derived unit siemens divided by the SI base unit metre -- QUDT

GalliumAtom
type: Class
subclass of: Restriction
subclass of: Restriction
  has value: 69.723
subclass of: Restriction
  has value: 31
comment: Atom subclass for gallium.
EMMO 967080e5 2f42 4eb2 a3a9 c58143e835f9: Atom subclass for gallium.

ThuliumSymbol
type: Class
subclass of: Restriction
  has value: Tm
comment: The symbol that stands for the thulium atom.
EMMO 967080e5 2f42 4eb2 a3a9 c58143e835f9: The symbol that stands for the thulium atom.

EnergyFluence
type: Class
subclass of: Restriction
comment: In nuclear physics, incident radiant energy per cross-sectional area.
EMMO 1f1b164d ec6a 4faa 8d5e 88bda62316cc: https://qudt.org/vocab/quantitykind/EnergyFluence
EMMO 26bf1bef d192 4da6 b0eb d2209698fb54: https://www.wikidata.org/wiki/Q98538612
EMMO 50c298c2 55a2 4068 b3ac 4e948c33181f: https://www.electropedia.org/iev/iev.nsf/display
EMMO 8de5d5bf db1c 40ac b698 095ba3b18578: 10-46
EMMO 967080e5 2f42 4eb2 a3a9 c58143e835f9: In nuclear physics, incident radiant energy per cross-sectional area.

ElectronMass
type: Class
comment: The rest mass of an electron.
EMMO 1f1b164d ec6a 4faa 8d5e 88bda62316cc: http://qudt.org/vocab/constant/ElectronMass
EMMO fe015383 afb3 44a6 ae86 043628697aa2: https://doi.org/10.1351/goldbook.E02008

KilogramPerSecondPerSquareMetre
type: Class
subclass of: Restriction
  has value: 1.0
subclass of: Restriction
  has value: 0.0
comment: SI base unit kilogram divided by the product of the power of the SI base unit metre with the exponent 2 and the SI base unit second -- QUDT
alternative label: Kilogram Per Second Per Square Metre
EMMO 1f1b164d ec6a 4faa 8d5e 88bda62316cc: http://qudt.org/vocab/unit/KiloGM-PER-SEC-M2
EMMO 33ae2d07 5526 4555 a0b4 8f4c031b5652: kg.(s.m2)-1
EMMO 33ae2d07 5526 4555 a0b4 8f4c031b5652: kg.s-1.m-2
EMMO 33ae2d07 5526 4555 a0b4 8f4c031b5652: kg/(s.m2)
EMMO 7f1dec83 d85e 4e1b b7bd c9442d4f5a64: kg/(s⋅m²)
EMMO 967080e5 2f42 4eb2 a3a9 c58143e835f9: SI base unit kilogram divided by the product of the power of the SI base unit metre with the exponent 2 and the SI base unit second -- QUDT

Smoke
type: Class
comment: Smoke is a solid aerosol made of particles emitted when a material undergoes combustion or pyrolysis.
EMMO 967080e5 2f42 4eb2 a3a9 c58143e835f9: Smoke is a solid aerosol made of particles emitted when a material undergoes combustion or pyrolysis.

MicroOhm
type: Class
subclass of: Restriction
  has value: 1e-06
subclass of: Restriction
  has value: 0.0
comment: 0.000001-fold of the SI derived unit ohm -- QUDT
EMMO 1f1b164d ec6a 4faa 8d5e 88bda62316cc: http://qudt.org/vocab/unit/MicroOHM
EMMO 33ae2d07 5526 4555 a0b4 8f4c031b5652: uOhm
EMMO 7f1dec83 d85e 4e1b b7bd c9442d4f5a64: μΩ
EMMO 967080e5 2f42 4eb2 a3a9 c58143e835f9: 0.000001-fold of the SI derived unit ohm -- QUDT

HolmiumSymbol
type: Class
subclass of: Restriction
  has value: Ho
comment: The symbol that stands for the holmium atom.
EMMO 967080e5 2f42 4eb2 a3a9 c58143e835f9: The symbol that stands for the holmium atom.

KilogramPerSquareMetre
type: Class
subclass of: Restriction
  has value: 1.0
subclass of: Restriction
  has value: 0.0
comment: Kilogram Per Square Meter (kg/m2) is a unit in the category of Surface density. It is also known as kilograms per square meter, kilogram per square metre, kilograms per square metre, kilogram/square meter, kilogram/square metre. This unit is commonly used in the SI unit system. Kilogram Per Square Meter (kg/m2) has a dimension of ML-2 where M is mass, and L is length. This unit is the standard SI unit in this category. -- QUDT
alternative label: Kilogram per Square Metre
EMMO 1f1b164d ec6a 4faa 8d5e 88bda62316cc: http://qudt.org/vocab/unit/KiloGM-PER-M2
EMMO 33ae2d07 5526 4555 a0b4 8f4c031b5652: kg.m-2
EMMO 33ae2d07 5526 4555 a0b4 8f4c031b5652: kg/m2
EMMO 7f1dec83 d85e 4e1b b7bd c9442d4f5a64: kg/m²
EMMO 967080e5 2f42 4eb2 a3a9 c58143e835f9: Kilogram Per Square Meter (kg/m2) is a unit in the category of Surface density. It is also known as kilograms per square meter, kilogram per square metre, kilograms per square metre, kilogram/square meter, kilogram/square metre. This unit is commonly used in the SI unit system. Kilogram Per Square Meter (kg/m2) has a dimension of ML-2 where M is mass, and L is length. This unit is the standard SI unit in this category. -- QUDT

LengthTimeCurrentUnit
type: Class
subclass of: Restriction
  has value: T+1 L+1 M0 I+1 Θ0 N0 J0
comment: The class of units with dimensionality 'LengthTimeCurrent'.
EMMO 967080e5 2f42 4eb2 a3a9 c58143e835f9: The class of units with dimensionality 'LengthTimeCurrent'.

VacuumMagneticPermeability
type: Class
comment: The DBpedia and UIPAC Gold Book definitions (http://dbpedia.org/page/Vacuum_permeability, https://doi.org/10.1351/goldbook.P04504) are outdated since May 20, 2019. It is now a measured constant.
comment: The value of magnetic permeability in a classical vacuum.
alternative label: PermeabilityOfVacuum
EMMO 1f1b164d ec6a 4faa 8d5e 88bda62316cc: http://qudt.org/vocab/constant/ElectromagneticPermeabilityOfVacuum
EMMO 8de5d5bf db1c 40ac b698 095ba3b18578: 6-26.1
EMMO 967080e5 2f42 4eb2 a3a9 c58143e835f9: The value of magnetic permeability in a classical vacuum.

YoctoCoulomb
type: Class
subclass of: Restriction
  some values from: Coulomb
subclass of: Restriction
  has value: 1e-24
subclass of: Restriction
  has value: 0.0
comment: A YoctoCoulomb is 10⁻²⁴ C. -- QUDT
EMMO 1f1b164d ec6a 4faa 8d5e 88bda62316cc: http://qudt.org/vocab/unit/YoctoC
EMMO 33ae2d07 5526 4555 a0b4 8f4c031b5652: yC
EMMO 7f1dec83 d85e 4e1b b7bd c9442d4f5a64: yC
EMMO 967080e5 2f42 4eb2 a3a9 c58143e835f9: A YoctoCoulomb is 10⁻²⁴ C. -- QUDT

NickelSymbol
type: Class
subclass of: Restriction
  has value: Ni
comment: The symbol that stands for the nickel atom.
EMMO 967080e5 2f42 4eb2 a3a9 c58143e835f9: The symbol that stands for the nickel atom.

DeciBel
type: Class
subclass of: Restriction
  some values from: Bel
subclass of: Restriction
  has value: 0.1
subclass of: Restriction
  has value: 0.0
comment: A customary logarithmic measure most commonly used (in various ways) for measuring sound.Sound is measured on a logarithmic scale. Informally, if one sound is 1 bel (10 decibels) "louder" than another, this means the louder sound is 10 times louder than the fainter one. A difference of 20 decibels corresponds to an increase of 10 x 10 or 100 times in intensity. The beginning of the scale, 0 decibels, can be set in different ways, depending on exactly the aspect of sound being measured. For sound intensity (the power of the sound waves per unit of area) 0 decibel is equal to 1 picoWatts per Metre Squared. This corresponds approximately to the faintest sound that can be detected by a person who has good hearing. For sound pressure (the pressure exerted by the sound waves) 0 decibels equals 20 micropascals RMS, and for sound power 0 decibels sometimes equals 1 picoWatt. In all cases, one decibel equals ≈ 0.115129 neper. -- QUDT
EMMO 1f1b164d ec6a 4faa 8d5e 88bda62316cc: http://qudt.org/vocab/unit/DeciB
EMMO 33ae2d07 5526 4555 a0b4 8f4c031b5652: dB
EMMO 7f1dec83 d85e 4e1b b7bd c9442d4f5a64: dB
EMMO 967080e5 2f42 4eb2 a3a9 c58143e835f9: A customary logarithmic measure most commonly used (in various ways) for measuring sound.Sound is measured on a logarithmic scale. Informally, if one sound is 1 bel (10 decibels) "louder" than another, this means the louder sound is 10 times louder than the fainter one. A difference of 20 decibels corresponds to an increase of 10 x 10 or 100 times in intensity. The beginning of the scale, 0 decibels, can be set in different ways, depending on exactly the aspect of sound being measured. For sound intensity (the power of the sound waves per unit of area) 0 decibel is equal to 1 picoWatts per Metre Squared. This corresponds approximately to the faintest sound that can be detected by a person who has good hearing. For sound pressure (the pressure exerted by the sound waves) 0 decibels equals 20 micropascals RMS, and for sound power 0 decibels sometimes equals 1 picoWatt. In all cases, one decibel equals ≈ 0.115129 neper. -- QUDT
EMMO c84c6752 6d64 48cc 9500 e54a3c34898d: http://en.wikipedia.org/wiki/Decibel

JosephsonConstantUnit
type: Class
subclass of: Restriction
  has value: T+4 L-2 M-1 I+1 Θ0 N0 J0
comment: The class of units with dimensionality 'JosephsonConstant'.
EMMO 967080e5 2f42 4eb2 a3a9 c58143e835f9: The class of units with dimensionality 'JosephsonConstant'.

Proton
type: Class
comment: A positive charged subatomic particle found in the atomic nucleus.
EMMO 967080e5 2f42 4eb2 a3a9 c58143e835f9: A positive charged subatomic particle found in the atomic nucleus.
EMMO c84c6752 6d64 48cc 9500 e54a3c34898d: https://en.wikipedia.org/wiki/Proton

SeebeckCoefficient
type: Class
subclass of: Restriction
comment: Measure of voltage induced by change of temperature.
EMMO 1f1b164d ec6a 4faa 8d5e 88bda62316cc: https://qudt.org/vocab/quantitykind/SeebeckCoefficient
EMMO 26bf1bef d192 4da6 b0eb d2209698fb54: https://www.wikidata.org/wiki/Q1091448
EMMO 8de5d5bf db1c 40ac b698 095ba3b18578: 12-21
EMMO 967080e5 2f42 4eb2 a3a9 c58143e835f9: Measure of voltage induced by change of temperature.

SpontaneousProcess
type: Class
comment: A process that has no identifiable agent driving its occurence.
alternative label: NaturalProcess
EMMO 967080e5 2f42 4eb2 a3a9 c58143e835f9: A process that has no identifiable agent driving its occurence.

EinsteiniumSymbol
type: Class
subclass of: Restriction
  has value: Es
comment: The symbol that stands for the einsteinium atom.
EMMO 967080e5 2f42 4eb2 a3a9 c58143e835f9: The symbol that stands for the einsteinium atom.

ArgonAtom
type: Class
subclass of: Restriction
subclass of: Restriction
  has value: 39.948
subclass of: Restriction
  has value: 18
comment: Atom subclass for argon.
EMMO 967080e5 2f42 4eb2 a3a9 c58143e835f9: Atom subclass for argon.

SolidFoam
type: Class
comment: A foam of trapped gas in a solid.
example: Aerogel
EMMO 967080e5 2f42 4eb2 a3a9 c58143e835f9: A foam of trapped gas in a solid.

Tera
type: Class
subclass of: Restriction
  has value: T
subclass of: Restriction
  has value: 1000000000000.0
comment: SI prefix who's value is 1e12.
EMMO 967080e5 2f42 4eb2 a3a9 c58143e835f9: SI prefix who's value is 1e12.

NanoFaradPerMetre
type: Class
subclass of: Restriction
  some values from: FaradPerMetre
subclass of: Restriction
  has value: 1e-09
subclass of: Restriction
  has value: 0.0
comment: 0.000000001-fold of the SI derived unit farad divided by the SI base unit metre -- QUDT
alternative label: Nanofarad Per Metre
EMMO 1f1b164d ec6a 4faa 8d5e 88bda62316cc: http://qudt.org/vocab/unit/NanoFARAD-PER-M
EMMO 33ae2d07 5526 4555 a0b4 8f4c031b5652: nF.m-1
EMMO 7f1dec83 d85e 4e1b b7bd c9442d4f5a64: nF/m
EMMO 967080e5 2f42 4eb2 a3a9 c58143e835f9: 0.000000001-fold of the SI derived unit farad divided by the SI base unit metre -- QUDT

EquilibriumPositionVector
type: Class
subclass of: Restriction
comment: In condensed matter physics, position vector of an atom or ion in equilibrium.
EMMO 1f1b164d ec6a 4faa 8d5e 88bda62316cc: https://qudt.org/vocab/quantitykind/EquilibriumPositionVectorOfIon
EMMO 26bf1bef d192 4da6 b0eb d2209698fb54: https://www.wikidata.org/wiki/Q105533477
EMMO 8de5d5bf db1c 40ac b698 095ba3b18578: 12-7.2
EMMO 967080e5 2f42 4eb2 a3a9 c58143e835f9: In condensed matter physics, position vector of an atom or ion in equilibrium.

PerMetreSteradian
type: Class
subclass of: Restriction
  has value: 1.0
subclass of: Restriction
  has value: 0.0
comment: Per metre and steradian.
alternative label: ReciprocalMetreSteradian
EMMO 1f1b164d ec6a 4faa 8d5e 88bda62316cc: http://qudt.org/vocab/unit/PER-M-SR
EMMO 33ae2d07 5526 4555 a0b4 8f4c031b5652: m-1.sr-1
EMMO 7f1dec83 d85e 4e1b b7bd c9442d4f5a64: /(m⋅sr)
EMMO 967080e5 2f42 4eb2 a3a9 c58143e835f9: Per metre and steradian.

KiloHertzMetre
type: Class
subclass of: Restriction
  some values from: HertzMetre
subclass of: Restriction
  has value: 1000.0
subclass of: Restriction
  has value: 0.0
comment: product of the 1 000-fold of the SI derived unit hertz and the SI base unit metre -- QUDT
alternative label: Kilohertz Metre
EMMO 1f1b164d ec6a 4faa 8d5e 88bda62316cc: http://qudt.org/vocab/unit/KiloHZ-M
EMMO 33ae2d07 5526 4555 a0b4 8f4c031b5652: kHz.m
EMMO 7f1dec83 d85e 4e1b b7bd c9442d4f5a64: kHz⋅m
EMMO 967080e5 2f42 4eb2 a3a9 c58143e835f9: product of the 1 000-fold of the SI derived unit hertz and the SI base unit metre -- QUDT

KelvinPascalPerSecond
type: Class
subclass of: Restriction
  has value: 1.0
subclass of: Restriction
  has value: 0.0
comment: Kelvin Pascal per second.
EMMO 1f1b164d ec6a 4faa 8d5e 88bda62316cc: http://qudt.org/vocab/unit/K-PA-PER-SEC
EMMO 33ae2d07 5526 4555 a0b4 8f4c031b5652: K.Pa.s-1
EMMO 7f1dec83 d85e 4e1b b7bd c9442d4f5a64: K⋅Pa/s
EMMO 967080e5 2f42 4eb2 a3a9 c58143e835f9: Kelvin Pascal per second.

InspectionDevice
type: Class

LanthanumSymbol
type: Class
subclass of: Restriction
  has value: La
comment: The symbol that stands for the lanthanum atom.
EMMO 967080e5 2f42 4eb2 a3a9 c58143e835f9: The symbol that stands for the lanthanum atom.

CubicMetre
type: Class
subclass of: Restriction
  has value: 1.0
subclass of: Restriction
  has value: 0.0
comment: The SI unit of volume, equal to 1.0e6 cm3, 1000 liters, 35.3147 ft3, or 1.30795 yd3. A cubic meter holds about 264.17 U.S. liquid gallons or 219.99 British Imperial gallons. -- QUDT
EMMO 0b1cbe60 d380 4787 b92e be26bdacf2c2: MTQ
EMMO 1f1b164d ec6a 4faa 8d5e 88bda62316cc: http://qudt.org/vocab/unit/M3
EMMO 209ba1b3 149f 4ff0 b672 941610eafd72: http://www.ontology-of-units-of-measure.org/resource/om-2/cubicMetre
EMMO 33ae2d07 5526 4555 a0b4 8f4c031b5652: m3
EMMO 6dd685dd 1895 46e4 b227 be9f7d643c25: http://dbpedia.org/resource/Cubic_metre
EMMO 7f1dec83 d85e 4e1b b7bd c9442d4f5a64: m³
EMMO 967080e5 2f42 4eb2 a3a9 c58143e835f9: The SI unit of volume, equal to 1.0e6 cm3, 1000 liters, 35.3147 ft3, or 1.30795 yd3. A cubic meter holds about 264.17 U.S. liquid gallons or 219.99 British Imperial gallons. -- QUDT
EMMO c84c6752 6d64 48cc 9500 e54a3c34898d: http://en.wikipedia.org/wiki/Cubic_metre

Torus
type: Class
comment: The simplest 2-manifold with genus 1.
EMMO 967080e5 2f42 4eb2 a3a9 c58143e835f9: The simplest 2-manifold with genus 1.

MilliGramPerMetre
type: Class
subclass of: Restriction
  some values from: GramPerMetre
subclass of: Restriction
  has value: 1e-06
subclass of: Restriction
  has value: 0.0
comment: 0.000001-fold of the SI base unit kilogram divided by the SI base unit metre -- QUDT
alternative label: Milligram Per Metre
EMMO 1f1b164d ec6a 4faa 8d5e 88bda62316cc: http://qudt.org/vocab/unit/MilliGM-PER-M
EMMO 33ae2d07 5526 4555 a0b4 8f4c031b5652: mg.m-1
EMMO 7f1dec83 d85e 4e1b b7bd c9442d4f5a64: mg/m
EMMO 967080e5 2f42 4eb2 a3a9 c58143e835f9: 0.000001-fold of the SI base unit kilogram divided by the SI base unit metre -- QUDT

MilliNewtonPerMetre
type: Class
subclass of: Restriction
  some values from: NewtonPerMetre
subclass of: Restriction
  has value: 0.001
subclass of: Restriction
  has value: 0.0
comment: 0.001-fold of the SI derived unit newton divided by the SI base unit metre -- QUDT
alternative label: Millinewton Per Metre
EMMO 1f1b164d ec6a 4faa 8d5e 88bda62316cc: http://qudt.org/vocab/unit/MilliN-PER-M
EMMO 33ae2d07 5526 4555 a0b4 8f4c031b5652: mN.m-1
EMMO 7f1dec83 d85e 4e1b b7bd c9442d4f5a64: mN/m
EMMO 967080e5 2f42 4eb2 a3a9 c58143e835f9: 0.001-fold of the SI derived unit newton divided by the SI base unit metre -- QUDT

LevelWidth
type: Class
comment: In nuclear physics, quotient of the reduced Planck constant and the mean duration of life of an unstable particle or an excited state.
EMMO 1f1b164d ec6a 4faa 8d5e 88bda62316cc: https://qudt.org/vocab/quantitykind/LevelWidth
EMMO 26bf1bef d192 4da6 b0eb d2209698fb54: https://www.wikidata.org/wiki/Q98082340
EMMO 8de5d5bf db1c 40ac b698 095ba3b18578: 10-26
EMMO 967080e5 2f42 4eb2 a3a9 c58143e835f9: In nuclear physics, quotient of the reduced Planck constant and the mean duration of life of an unstable particle or an excited state.
EMMO fe015383 afb3 44a6 ae86 043628697aa2: https://doi.org/10.1351/goldbook.L03507

PoissonNumber
type: Class
comment: Ratio of transverse strain to axial strain.
alternative label: PoissonsRatio
EMMO 26bf1bef d192 4da6 b0eb d2209698fb54: https://www.wikidata.org/wiki/Q190453
EMMO 50c298c2 55a2 4068 b3ac 4e948c33181f: https://www.electropedia.org/iev/iev.nsf/display
EMMO 8de5d5bf db1c 40ac b698 095ba3b18578: 4-18
EMMO 967080e5 2f42 4eb2 a3a9 c58143e835f9: Ratio of transverse strain to axial strain.

Molality
type: Class
subclass of: Restriction
comment: quotient of the amount of substance nB of solute B by the mass m of the solvent: bB = nB / m.
alternative label: AmountPerMass
EMMO 26bf1bef d192 4da6 b0eb d2209698fb54: https://www.wikidata.org/wiki/Q172623
EMMO 50c298c2 55a2 4068 b3ac 4e948c33181f: https://www.electropedia.org/iev/iev.nsf/display
EMMO 8de5d5bf db1c 40ac b698 095ba3b18578: 9-15
EMMO 967080e5 2f42 4eb2 a3a9 c58143e835f9: quotient of the amount of substance nB of solute B by the mass m of the solvent: bB = nB / m.
EMMO fe015383 afb3 44a6 ae86 043628697aa2: https://doi.org/10.1351/goldbook.M03970

AttoCoulomb
type: Class
subclass of: Restriction
  some values from: Coulomb
subclass of: Restriction
  has value: 1e-18
subclass of: Restriction
  has value: 0.0
comment: An AttoColomb is 10⁻¹⁸ C. -- QUDT
EMMO 1f1b164d ec6a 4faa 8d5e 88bda62316cc: http://qudt.org/vocab/unit/AttoC
EMMO 33ae2d07 5526 4555 a0b4 8f4c031b5652: aC
EMMO 7f1dec83 d85e 4e1b b7bd c9442d4f5a64: aC
EMMO 967080e5 2f42 4eb2 a3a9 c58143e835f9: An AttoColomb is 10⁻¹⁸ C. -- QUDT

ArsenicAtom
type: Class
subclass of: Restriction
subclass of: Restriction
  has value: 74.921595
subclass of: Restriction
  has value: 33
comment: Atom subclass for arsenic.
EMMO 967080e5 2f42 4eb2 a3a9 c58143e835f9: Atom subclass for arsenic.

Rolling
type: Class
comment: Continuous or stepwise pressure forming with one or more rotating tools (rollers), without or with additional tools, e.g. plugs or mandrels, rods, guide tools
alternative label: Walzen

MilliGramPerCubicMetre
type: Class
subclass of: Restriction
  some values from: GramPerCubicMetre
subclass of: Restriction
  has value: 1e-06
subclass of: Restriction
  has value: 0.0
comment: 0.000001-fold of the SI base unit kilogram divided by the power of the SI base unit metre with the exponent 3 -- QUDT
alternative label: Milligram Per Cubic Metre
EMMO 1f1b164d ec6a 4faa 8d5e 88bda62316cc: http://qudt.org/vocab/unit/MilliGM-PER-M3
EMMO 33ae2d07 5526 4555 a0b4 8f4c031b5652: mg.m-3
EMMO 33ae2d07 5526 4555 a0b4 8f4c031b5652: mg/m3
EMMO 7f1dec83 d85e 4e1b b7bd c9442d4f5a64: mg/m³
EMMO 967080e5 2f42 4eb2 a3a9 c58143e835f9: 0.000001-fold of the SI base unit kilogram divided by the power of the SI base unit metre with the exponent 3 -- QUDT

ParticleSourceDensity
type: Class
subclass of: Restriction
comment: Quotient of the mean rate of production of particles in a volume, and that volume.
EMMO 1f1b164d ec6a 4faa 8d5e 88bda62316cc: https://qudt.org/vocab/quantitykind/ParticleSourceDensity
EMMO 26bf1bef d192 4da6 b0eb d2209698fb54: https://www.wikidata.org/wiki/Q98915762
EMMO 8de5d5bf db1c 40ac b698 095ba3b18578: 10-66
EMMO 967080e5 2f42 4eb2 a3a9 c58143e835f9: Quotient of the mean rate of production of particles in a volume, and that volume.

MendeleviumSymbol
type: Class
subclass of: Restriction
  has value: Md
comment: The symbol that stands for the mendelevium atom.
EMMO 967080e5 2f42 4eb2 a3a9 c58143e835f9: The symbol that stands for the mendelevium atom.

BohrRadius
type: Class
comment: Radius of the electron orbital in the hydrogen atom in its ground state in the Bohr model of the atom.
EMMO 1f1b164d ec6a 4faa 8d5e 88bda62316cc: https://qudt.org/vocab/constant/BohrRadius
EMMO 26bf1bef d192 4da6 b0eb d2209698fb54: https://www.wikidata.org/wiki/Q652571
EMMO 8de5d5bf db1c 40ac b698 095ba3b18578: 10-6
EMMO 967080e5 2f42 4eb2 a3a9 c58143e835f9: Radius of the electron orbital in the hydrogen atom in its ground state in the Bohr model of the atom.
EMMO fe015383 afb3 44a6 ae86 043628697aa2: https://doi.org/10.1351/goldbook.B00693

MaterialRelationComputation
type: Class

AttoJoule
type: Class
subclass of: Restriction
  some values from: Joule
subclass of: Restriction
  has value: 1e-18
subclass of: Restriction
  has value: 0.0
comment: 0,000 000 000 000 000 001-fold of the derived SI unit joule -- QUDT
EMMO 1f1b164d ec6a 4faa 8d5e 88bda62316cc: http://qudt.org/vocab/unit/AttoJ
EMMO 33ae2d07 5526 4555 a0b4 8f4c031b5652: aJ
EMMO 7f1dec83 d85e 4e1b b7bd c9442d4f5a64: aJ
EMMO 967080e5 2f42 4eb2 a3a9 c58143e835f9: 0,000 000 000 000 000 001-fold of the derived SI unit joule -- QUDT

MigrationLength
type: Class
comment: Square root of the migration area, M^2.
EMMO 1f1b164d ec6a 4faa 8d5e 88bda62316cc: https://qudt.org/vocab/quantitykind/MigrationLength
EMMO 26bf1bef d192 4da6 b0eb d2209698fb54: https://www.wikidata.org/wiki/Q98998318
EMMO 8de5d5bf db1c 40ac b698 095ba3b18578: 10-73.3
EMMO 967080e5 2f42 4eb2 a3a9 c58143e835f9: Square root of the migration area, M^2.

MassFractionOfWater
type: Class
comment: Quantity of dimension 1 equal to u/(1 + u), where u is mass ratio of water to dry matter.
EMMO 1f1b164d ec6a 4faa 8d5e 88bda62316cc: https://qudt.org/vocab/quantitykind/MassFractionOfWater
EMMO 26bf1bef d192 4da6 b0eb d2209698fb54: https://www.wikidata.org/wiki/Q76379025
EMMO 50c298c2 55a2 4068 b3ac 4e948c33181f: https://www.electropedia.org/iev/iev.nsf/display
EMMO 8de5d5bf db1c 40ac b698 095ba3b18578: 5-31
EMMO 967080e5 2f42 4eb2 a3a9 c58143e835f9: Quantity of dimension 1 equal to u/(1 + u), where u is mass ratio of water to dry matter.

MassFraction
type: Class
comment: Mass of a constituent divided by the total mass of all constituents in the mixture.
EMMO 1f1b164d ec6a 4faa 8d5e 88bda62316cc: http://qudt.org/vocab/quantitykind/MassFraction
EMMO 8de5d5bf db1c 40ac b698 095ba3b18578: 9-11
EMMO 967080e5 2f42 4eb2 a3a9 c58143e835f9: Mass of a constituent divided by the total mass of all constituents in the mixture.
EMMO fe015383 afb3 44a6 ae86 043628697aa2: https://doi.org/10.1351/goldbook.M03722

NewtonMetreSecondPerRadian
type: Class
subclass of: Restriction
  has value: 1.0
subclass of: Restriction
  has value: 0.0
comment: Newton metre seconds measured per radian -- QUDT
alternative label: Newton metre seconds per radian
EMMO 1f1b164d ec6a 4faa 8d5e 88bda62316cc: http://qudt.org/vocab/unit/N-M-SEC-PER-RAD
EMMO 7f1dec83 d85e 4e1b b7bd c9442d4f5a64: N⋅m⋅s/rad
EMMO 967080e5 2f42 4eb2 a3a9 c58143e835f9: Newton metre seconds measured per radian -- QUDT

PermanentLiquidPhaseSintering
type: Class

Gluing
type: Class
comment: Process for joining two (base) materials by means of an adhesive polymer material
alternative label: Kleben

MicroHenry
type: Class
subclass of: Restriction
  some values from: Henry
subclass of: Restriction
  has value: 1e-06
subclass of: Restriction
  has value: 0.0
comment: The SI derived unit for inductance is the henry. 1 henry is equal to 1000000 microhenry. -- QUDT
EMMO 1f1b164d ec6a 4faa 8d5e 88bda62316cc: http://qudt.org/vocab/unit/MicroH
EMMO 33ae2d07 5526 4555 a0b4 8f4c031b5652: uH
EMMO 7f1dec83 d85e 4e1b b7bd c9442d4f5a64: µH
EMMO 967080e5 2f42 4eb2 a3a9 c58143e835f9: The SI derived unit for inductance is the henry. 1 henry is equal to 1000000 microhenry. -- QUDT

Volume
type: Class
subclass of: Restriction
comment: Extent of an object in space.
EMMO 1f1b164d ec6a 4faa 8d5e 88bda62316cc: http://qudt.org/vocab/quantitykind/Volume
EMMO 26bf1bef d192 4da6 b0eb d2209698fb54: https://www.wikidata.org/wiki/Q39297
EMMO 50c298c2 55a2 4068 b3ac 4e948c33181f: https://www.electropedia.org/iev/iev.nsf/display
EMMO 6dd685dd 1895 46e4 b227 be9f7d643c25: https://dbpedia.org/page/Volume
EMMO 8de5d5bf db1c 40ac b698 095ba3b18578: 3-4
EMMO 967080e5 2f42 4eb2 a3a9 c58143e835f9: Extent of an object in space.

DataByNature
type: Class

HyperfineStructureQuantumNumber
type: Class
comment: Quantum number of an atom describing the inclination of the nuclear spin with respect to a quantization axis given by the magnetic field produced by the orbital electrons.
EMMO 1f1b164d ec6a 4faa 8d5e 88bda62316cc: https://qudt.org/vocab/quantitykind/HyperfineStructureQuantumNumber
EMMO 26bf1bef d192 4da6 b0eb d2209698fb54: https://www.wikidata.org/wiki/Q97577449
EMMO 8de5d5bf db1c 40ac b698 095ba3b18578: 10-13.8
EMMO 967080e5 2f42 4eb2 a3a9 c58143e835f9: Quantum number of an atom describing the inclination of the nuclear spin with respect to a quantization axis given by the magnetic field produced by the orbital electrons.

IsobaricHeatCapacity
type: Class
comment: Heat capacity at constant pressure.
alternative label: HeatCapacityAtConstantPressure
EMMO 26bf1bef d192 4da6 b0eb d2209698fb54: https://www.wikidata.org/wiki/Q112187490
EMMO 50c298c2 55a2 4068 b3ac 4e948c33181f: https://www.electropedia.org/iev/iev.nsf/display
EMMO 8de5d5bf db1c 40ac b698 095ba3b18578: 5-16.2
EMMO 967080e5 2f42 4eb2 a3a9 c58143e835f9: Heat capacity at constant pressure.

MassFractionOfDryMatter
type: Class
comment: Quantity wd = 1 − wH2O, where wH2O is mass fraction of water.
EMMO 1f1b164d ec6a 4faa 8d5e 88bda62316cc: https://qudt.org/vocab/quantitykind/MassFractionOfDryMatter
EMMO 26bf1bef d192 4da6 b0eb d2209698fb54: https://www.wikidata.org/wiki/Q76379189
EMMO 50c298c2 55a2 4068 b3ac 4e948c33181f: https://www.electropedia.org/iev/iev.nsf/display
EMMO 8de5d5bf db1c 40ac b698 095ba3b18578: 5-32
EMMO 967080e5 2f42 4eb2 a3a9 c58143e835f9: Quantity wd = 1 − wH2O, where wH2O is mass fraction of water.

LanthanumAtom
type: Class
subclass of: Restriction
subclass of: Restriction
  has value: 138.90547
subclass of: Restriction
  has value: 57
comment: Atom subclass for lanthanum.
EMMO 967080e5 2f42 4eb2 a3a9 c58143e835f9: Atom subclass for lanthanum.

ElementaryElectron
type: Class
comment: An elementary charged fermionic particle that belongs to the first generation of the lepton particle family.
EMMO 967080e5 2f42 4eb2 a3a9 c58143e835f9: An elementary charged fermionic particle that belongs to the first generation of the lepton particle family.

PicoMolePerKilogram
type: Class
subclass of: Restriction
  has value: 1e-12
subclass of: Restriction
  has value: 0.0
alternative label: Picomoles per kilogram
EMMO 1f1b164d ec6a 4faa 8d5e 88bda62316cc: http://qudt.org/vocab/unit/PicoMOL-PER-KiloGM
EMMO 33ae2d07 5526 4555 a0b4 8f4c031b5652: pmol.kg-1
EMMO 7f1dec83 d85e 4e1b b7bd c9442d4f5a64: pmol/kg

MilliMolePerCubicMetre
type: Class
subclass of: Restriction
  some values from: MolePerCubicMetre
subclass of: Restriction
  has value: 0.001
subclass of: Restriction
  has value: 0.0
comment: Unavailable. -- QUDT
alternative label: Millimoles per cubic metre
EMMO 1f1b164d ec6a 4faa 8d5e 88bda62316cc: http://qudt.org/vocab/unit/MilliMOL-PER-M3
EMMO 33ae2d07 5526 4555 a0b4 8f4c031b5652: mmol.m-3
EMMO 7f1dec83 d85e 4e1b b7bd c9442d4f5a64: mmol/m³
EMMO 967080e5 2f42 4eb2 a3a9 c58143e835f9: Unavailable. -- QUDT

NobeliumSymbol
type: Class
subclass of: Restriction
  has value: No
comment: The symbol that stands for the nobelium atom.
EMMO 967080e5 2f42 4eb2 a3a9 c58143e835f9: The symbol that stands for the nobelium atom.

AmountFraction
type: Class
comment: The amount of a constituent divided by the total amount of all constituents in a mixture.
alternative label: MoleFraction
EMMO 1f1b164d ec6a 4faa 8d5e 88bda62316cc: http://qudt.org/vocab/quantitykind/MoleFraction
EMMO 967080e5 2f42 4eb2 a3a9 c58143e835f9: The amount of a constituent divided by the total amount of all constituents in a mixture.
EMMO fe015383 afb3 44a6 ae86 043628697aa2: https://doi.org/10.1351/goldbook.A00296

Database
type: Class
comment: A structured collection of data held in a computer system that has a well-defined interface.
example: - A database covering nine million chemical compositions. - A thermodynamic database.
EMMO 967080e5 2f42 4eb2 a3a9 c58143e835f9: A structured collection of data held in a computer system that has a well-defined interface.

ScandiumAtom
type: Class
subclass of: Restriction
subclass of: Restriction
  has value: 44.955908
subclass of: Restriction
  has value: 21
comment: Atom subclass for scandium.
EMMO 967080e5 2f42 4eb2 a3a9 c58143e835f9: Atom subclass for scandium.

DegreeCelsiusPerKelvin
type: Class
comment: unit with the name Degree Celsius divided by the SI base unit kelvin -- QUDT
alternative label: Degree Celsius Per Kelvin
EMMO 1f1b164d ec6a 4faa 8d5e 88bda62316cc: http://qudt.org/vocab/unit/DEG_C-PER-K
EMMO 33ae2d07 5526 4555 a0b4 8f4c031b5652: Cel.K-1
EMMO 33ae2d07 5526 4555 a0b4 8f4c031b5652: Cel/K
EMMO 7f1dec83 d85e 4e1b b7bd c9442d4f5a64: °C/K
EMMO 967080e5 2f42 4eb2 a3a9 c58143e835f9: unit with the name Degree Celsius divided by the SI base unit kelvin -- QUDT

DoseEquivalentQualityFactor
type: Class
comment: Factor taking into account health effects in the determination of the dose equivalent.
EMMO 1f1b164d ec6a 4faa 8d5e 88bda62316cc: https://qudt.org/vocab/quantitykind/DoseEquivalentQualityFactor
EMMO 26bf1bef d192 4da6 b0eb d2209698fb54: https://www.wikidata.org/wiki/Q2122099
EMMO 50c298c2 55a2 4068 b3ac 4e948c33181f: https://www.electropedia.org/iev/iev.nsf/display
EMMO 8de5d5bf db1c 40ac b698 095ba3b18578: 10-82
EMMO 967080e5 2f42 4eb2 a3a9 c58143e835f9: Factor taking into account health effects in the determination of the dose equivalent.

DegreeCelsiusPerSecond
type: Class
comment: `Degree Celsius per Second` is a unit for 'Temperature Per Time' expressed as degC / s. -- QUDT
alternative label: Degree Celsius per Second
EMMO 1f1b164d ec6a 4faa 8d5e 88bda62316cc: http://qudt.org/vocab/unit/DEG_C-PER-SEC
EMMO 33ae2d07 5526 4555 a0b4 8f4c031b5652: Cel.s-1
EMMO 33ae2d07 5526 4555 a0b4 8f4c031b5652: Cel/s
EMMO 7f1dec83 d85e 4e1b b7bd c9442d4f5a64: °C/s
EMMO 967080e5 2f42 4eb2 a3a9 c58143e835f9: `Degree Celsius per Second` is a unit for 'Temperature Per Time' expressed as degC / s. -- QUDT

GrueneisenParamter
type: Class
comment: Describes the effect that changing the volume of a crystal lattice has on its vibrational properties, and, as a consequence, the effect that changing temperature has on the size or dynamics of the lattice.
EMMO 26bf1bef d192 4da6 b0eb d2209698fb54: https://www.wikidata.org/wiki/Q444656
EMMO 8de5d5bf db1c 40ac b698 095ba3b18578: 12-14
EMMO 967080e5 2f42 4eb2 a3a9 c58143e835f9: Describes the effect that changing the volume of a crystal lattice has on its vibrational properties, and, as a consequence, the effect that changing temperature has on the size or dynamics of the lattice.

FemtoMolePerKilogram
type: Class
subclass of: Restriction
  has value: 1e-15
subclass of: Restriction
  has value: 0.0
comment: A 10**15 part quantity of substance of the measurand per kilogram mass of matrix. -- QUDT
alternative label: Femtomoles per kilogram
EMMO 1f1b164d ec6a 4faa 8d5e 88bda62316cc: http://qudt.org/vocab/unit/FemtoMOL-PER-KiloGM
EMMO 33ae2d07 5526 4555 a0b4 8f4c031b5652: fmol.kg-1
EMMO 7f1dec83 d85e 4e1b b7bd c9442d4f5a64: fmol/kg
EMMO 967080e5 2f42 4eb2 a3a9 c58143e835f9: A 10**15 part quantity of substance of the measurand per kilogram mass of matrix. -- QUDT

ConstitutiveProcess
type: Class
subclass of: Restriction
comment: A constitutive process is a process that is holistically relevant for the definition of the whole.
comment: A process which is an holistic spatial part of an object.
example: Blood circulation in a human body.
EMMO 967080e5 2f42 4eb2 a3a9 c58143e835f9: A process which is an holistic spatial part of an object.
EMMO c7b62dd7 063a 4c2a 8504 42f7264ba83f: A constitutive process is a process that is holistically relevant for the definition of the whole.

MobiusStrip
type: Class
comment: A 2-manifold with one unconnected boundary and one "face".
EMMO 967080e5 2f42 4eb2 a3a9 c58143e835f9: A 2-manifold with one unconnected boundary and one "face".

HoleDensity
type: Class
comment: Number of holes in valence band per volume.
EMMO 1f1b164d ec6a 4faa 8d5e 88bda62316cc: https://qudt.org/vocab/quantitykind/HoleDensity
EMMO 26bf1bef d192 4da6 b0eb d2209698fb54: https://www.wikidata.org/wiki/Q105971101
EMMO 8de5d5bf db1c 40ac b698 095ba3b18578: 12-29.2
EMMO 967080e5 2f42 4eb2 a3a9 c58143e835f9: Number of holes in valence band per volume.

PraseodymiumAtom
type: Class
subclass of: Restriction
subclass of: Restriction
  has value: 140.90766
subclass of: Restriction
  has value: 59
comment: Atom subclass for praseodymium.
EMMO 967080e5 2f42 4eb2 a3a9 c58143e835f9: Atom subclass for praseodymium.

KryptonAtom
type: Class
subclass of: Restriction
subclass of: Restriction
  has value: 83.798
subclass of: Restriction
  has value: 36
comment: Atom subclass for krypton.
EMMO 967080e5 2f42 4eb2 a3a9 c58143e835f9: Atom subclass for krypton.

ResonanceEnergy
type: Class
comment: Resonance in a nuclear reaction, determined by the kinetic energy of an incident particle in the reference frame of the target particle.
EMMO 1f1b164d ec6a 4faa 8d5e 88bda62316cc: https://qudt.org/vocab/quantitykind/ResonanceEnergy
EMMO 26bf1bef d192 4da6 b0eb d2209698fb54: https://www.wikidata.org/wiki/Q98165187
EMMO 8de5d5bf db1c 40ac b698 095ba3b18578: 10-37.2
EMMO 967080e5 2f42 4eb2 a3a9 c58143e835f9: Resonance in a nuclear reaction, determined by the kinetic energy of an incident particle in the reference frame of the target particle.

YttriumAtom
type: Class
subclass of: Restriction
subclass of: Restriction
  has value: 88.90584
subclass of: Restriction
  has value: 39
comment: Atom subclass for yttrium.
EMMO 967080e5 2f42 4eb2 a3a9 c58143e835f9: Atom subclass for yttrium.

SquareMetrePerHertz
type: Class
subclass of: Restriction
  has value: 1.0
subclass of: Restriction
  has value: 0.0
comment: Square metre per Hertz.
EMMO 1f1b164d ec6a 4faa 8d5e 88bda62316cc: http://qudt.org/vocab/unit/M2-PER-HZ
EMMO 33ae2d07 5526 4555 a0b4 8f4c031b5652: m2.Hz-1
EMMO 7f1dec83 d85e 4e1b b7bd c9442d4f5a64: m²/Hz
EMMO 967080e5 2f42 4eb2 a3a9 c58143e835f9: Square metre per Hertz.

MilliRadian
type: Class
subclass of: Restriction
  some values from: Radian
subclass of: Restriction
  has value: 0.001
subclass of: Restriction
  has value: 0.0
alternative label: milliradian
EMMO 1f1b164d ec6a 4faa 8d5e 88bda62316cc: http://qudt.org/vocab/unit/MilliRAD
EMMO 33ae2d07 5526 4555 a0b4 8f4c031b5652: mrad
EMMO 7f1dec83 d85e 4e1b b7bd c9442d4f5a64: mrad

ElementaryPhoton
type: Class
comment: A boson with spin of 1 that carries electromagnetism.
EMMO 967080e5 2f42 4eb2 a3a9 c58143e835f9: A boson with spin of 1 that carries electromagnetism.

GramDegreeCelsius
type: Class
comment: `Gram Degree Celsius` is a C.G.S System unit for 'Mass Temperature' expressed as g · degC. -- QUDT
alternative label: Gram Degree Celsius
EMMO 1f1b164d ec6a 4faa 8d5e 88bda62316cc: http://qudt.org/vocab/unit/GM-PER-DEG_C
EMMO 33ae2d07 5526 4555 a0b4 8f4c031b5652: d.Cel-1
EMMO 7f1dec83 d85e 4e1b b7bd c9442d4f5a64: g/°C
EMMO 967080e5 2f42 4eb2 a3a9 c58143e835f9: `Gram Degree Celsius` is a C.G.S System unit for 'Mass Temperature' expressed as g · degC. -- QUDT

C
type: Class

MolePerSquareMetrePerSecondPerMetre
type: Class
subclass of: Restriction
  has value: 1.0
subclass of: Restriction
  has value: 0.0
comment: Moles per square metre and second and metre.
EMMO 1f1b164d ec6a 4faa 8d5e 88bda62316cc: http://qudt.org/vocab/unit/MOL-PER-M2-SEC-M
EMMO 33ae2d07 5526 4555 a0b4 8f4c031b5652: mol.m-2.s-1.m-1
EMMO 7f1dec83 d85e 4e1b b7bd c9442d4f5a64: mol/(m²⋅s⋅m)
EMMO 967080e5 2f42 4eb2 a3a9 c58143e835f9: Moles per square metre and second and metre.

DragCoefficient
type: Class
comment: Dimensionless parameter to quantify fluid resistance.
alternative label: DragFactor
EMMO 1f1b164d ec6a 4faa 8d5e 88bda62316cc: https://qudt.org/vocab/quantitykind/DragCoefficient
EMMO 26bf1bef d192 4da6 b0eb d2209698fb54: https://www.wikidata.org/wiki/Q1778961
EMMO 8de5d5bf db1c 40ac b698 095ba3b18578: 4-23.4
EMMO 967080e5 2f42 4eb2 a3a9 c58143e835f9: Dimensionless parameter to quantify fluid resistance.

PalladiumSymbol
type: Class
subclass of: Restriction
  has value: Pd
comment: The symbol that stands for the palladium atom.
EMMO 967080e5 2f42 4eb2 a3a9 c58143e835f9: The symbol that stands for the palladium atom.

PerPascalSecond
type: Class
subclass of: Restriction
  has value: 1.0
subclass of: Restriction
  has value: 0.0
comment: Per Pascal and Second.
EMMO 1f1b164d ec6a 4faa 8d5e 88bda62316cc: http://qudt.org/vocab/unit/PER-PA-SEC
EMMO 33ae2d07 5526 4555 a0b4 8f4c031b5652: Pa-1.s-1
EMMO 7f1dec83 d85e 4e1b b7bd c9442d4f5a64: /(Pa⋅s)
EMMO 967080e5 2f42 4eb2 a3a9 c58143e835f9: Per Pascal and Second.

TantalumSymbol
type: Class
subclass of: Restriction
  has value: Ta
comment: The symbol that stands for the tantalum atom.
EMMO 967080e5 2f42 4eb2 a3a9 c58143e835f9: The symbol that stands for the tantalum atom.

ThermomechanicalTreatment
type: Class

Nailing
type: Class
comment: Nailing is joining by hammering or pressing nails (wire pins) as auxiliary parts into the solid material. Several parts are joined by pressing them together (from: DIN 8593 part 3/09.85).
alternative label: Nageln

TemporalSequence
type: Class
comment: A tessellation of temporal slices.
alternative label: Sequence
EMMO 967080e5 2f42 4eb2 a3a9 c58143e835f9: A tessellation of temporal slices.

DiffusionCoefficientForFluenceRate
type: Class
comment: Proportionality constant between the particle current density J and the gradient of the particle fluence rate.
EMMO 1f1b164d ec6a 4faa 8d5e 88bda62316cc: https://qudt.org/vocab/quantitykind/DiffusionCoefficientForFluenceRate
EMMO 26bf1bef d192 4da6 b0eb d2209698fb54: https://www.wikidata.org/wiki/Q98876254
EMMO 8de5d5bf db1c 40ac b698 095ba3b18578: 10-65
EMMO 967080e5 2f42 4eb2 a3a9 c58143e835f9: Proportionality constant between the particle current density J and the gradient of the particle fluence rate.

ParallelWorkflow
type: Class
comment: A workflow can be seen as a direct acyclic graph, whose nodes are tasks and edges are asymmetric causal relations. A parallel graph occurs when the topological order of such graph if not unique, meaning that there is at least one portion of the workflow in which at least two tasks are running concurrently. Concurrent tasks may or may not communicate. Communication is represented as a symmetric causality relation, superimposing the direct acyclic graph structure of the workflow.
comment: A workflow with some tasks running concurrently.
EMMO 31252f35 c767 4b97 a877 1235076c3e13: A workflow can be seen as a direct acyclic graph, whose nodes are tasks and edges are asymmetric causal relations. A parallel graph occurs when the topological order of such graph if not unique, meaning that there is at least one portion of the workflow in which at least two tasks are running concurrently. Concurrent tasks may or may not communicate. Communication is represented as a symmetric causality relation, superimposing the direct acyclic graph structure of the workflow.
EMMO 967080e5 2f42 4eb2 a3a9 c58143e835f9: A workflow with some tasks running concurrently.

MicroSiemens
type: Class
subclass of: Restriction
  has value: 1e-06
subclass of: Restriction
  has value: 0.0
comment: 0.000001-fold of the SI derived unit siemens -- QUDT
EMMO 1f1b164d ec6a 4faa 8d5e 88bda62316cc: http://qudt.org/vocab/unit/MicroS
EMMO 33ae2d07 5526 4555 a0b4 8f4c031b5652: uS
EMMO 7f1dec83 d85e 4e1b b7bd c9442d4f5a64: μS
EMMO 967080e5 2f42 4eb2 a3a9 c58143e835f9: 0.000001-fold of the SI derived unit siemens -- QUDT

LivermoriumAtom
type: Class
subclass of: Restriction
subclass of: Restriction
  has value: 293.204
subclass of: Restriction
  has value: 116
comment: Atom subclass for livermorium.
EMMO 967080e5 2f42 4eb2 a3a9 c58143e835f9: Atom subclass for livermorium.

JoulePerKilogramKelvinCubicMetre
type: Class
subclass of: Restriction
  has value: 1.0
subclass of: Restriction
  has value: 0.0
comment: Joule per kilogram and Kelvin and cubic metre.
EMMO 1f1b164d ec6a 4faa 8d5e 88bda62316cc: http://qudt.org/vocab/unit/J-PER-KiloGM-K-M3
EMMO 33ae2d07 5526 4555 a0b4 8f4c031b5652: J.kg-1.K.m-3
EMMO 7f1dec83 d85e 4e1b b7bd c9442d4f5a64: J/(kg⋅K⋅m³)
EMMO 967080e5 2f42 4eb2 a3a9 c58143e835f9: Joule per kilogram and Kelvin and cubic metre.

ExtentOfReaction
type: Class
subclass of: Restriction
comment: Difference between equilibrium and initial amount of a substance, divided by its stoichiometric number.
EMMO 1f1b164d ec6a 4faa 8d5e 88bda62316cc: https://qudt.org/vocab/quantitykind/ExtentOfReaction
EMMO 26bf1bef d192 4da6 b0eb d2209698fb54: https://www.wikidata.org/wiki/Q899046
EMMO 8de5d5bf db1c 40ac b698 095ba3b18578: 9-31
EMMO 967080e5 2f42 4eb2 a3a9 c58143e835f9: Difference between equilibrium and initial amount of a substance, divided by its stoichiometric number.
EMMO fe015383 afb3 44a6 ae86 043628697aa2: https://doi.org/10.1351/goldbook.E02283

ProceduralData
type: Class

QueryLanguage
type: Class
comment: A construction language used to make queries in databases and information systems.
example: SQL, SPARQL
EMMO 967080e5 2f42 4eb2 a3a9 c58143e835f9: A construction language used to make queries in databases and information systems.
EMMO c84c6752 6d64 48cc 9500 e54a3c34898d: https://en.wikipedia.org/wiki/Query_language

MolePerSquareMetre
type: Class
subclass of: Restriction
  has value: 1.0
subclass of: Restriction
  has value: 0.0
comment: SI unit of quantity of matter per SI unit area. -- QUDT
alternative label: Moles per square metre
EMMO 1f1b164d ec6a 4faa 8d5e 88bda62316cc: http://qudt.org/vocab/unit/MOL-PER-M2
EMMO 33ae2d07 5526 4555 a0b4 8f4c031b5652: mol.m-2
EMMO 7f1dec83 d85e 4e1b b7bd c9442d4f5a64: mol/m²
EMMO 967080e5 2f42 4eb2 a3a9 c58143e835f9: SI unit of quantity of matter per SI unit area. -- QUDT

MagneticReluctance
type: Class
subclass of: Restriction
comment: Magnetic tension divided by magnetic flux.
alternative label: Reluctance
EMMO 1f1b164d ec6a 4faa 8d5e 88bda62316cc: https://qudt.org/vocab/quantitykind/Reluctance
EMMO 26bf1bef d192 4da6 b0eb d2209698fb54: https://www.wikidata.org/wiki/Q863390
EMMO 50c298c2 55a2 4068 b3ac 4e948c33181f: https://www.electropedia.org/iev/iev.nsf/display
EMMO 8de5d5bf db1c 40ac b698 095ba3b18578: 6-39
EMMO 967080e5 2f42 4eb2 a3a9 c58143e835f9: Magnetic tension divided by magnetic flux.

PerSteradian
type: Class
subclass of: Restriction
  has value: 1.0
subclass of: Restriction
  has value: 0.0
comment: Per steradian.
alternative label: ReciprocalSteradian
EMMO 1f1b164d ec6a 4faa 8d5e 88bda62316cc: http://qudt.org/vocab/unit/PER-SR
EMMO 33ae2d07 5526 4555 a0b4 8f4c031b5652: sr-1
EMMO 7f1dec83 d85e 4e1b b7bd c9442d4f5a64: /sr
EMMO 967080e5 2f42 4eb2 a3a9 c58143e835f9: Per steradian.

NumberOfTurnsInAWinding
type: Class
comment: Number of turns in a winding.
EMMO 26bf1bef d192 4da6 b0eb d2209698fb54: https://www.wikidata.org/wiki/Q77995997
EMMO 8de5d5bf db1c 40ac b698 095ba3b18578: 6-38
EMMO 967080e5 2f42 4eb2 a3a9 c58143e835f9: Number of turns in a winding.

MegaNewtonMetre
type: Class
subclass of: Restriction
  some values from: NewtonMetre
subclass of: Restriction
  has value: 1000000.0
subclass of: Restriction
  has value: 0.0
comment: 1,000,000-fold of the product of the SI derived unit newton and the SI base unit metre -- QUDT
alternative label: Meganewton Metre
EMMO 1f1b164d ec6a 4faa 8d5e 88bda62316cc: http://qudt.org/vocab/unit/MegaN-M
EMMO 33ae2d07 5526 4555 a0b4 8f4c031b5652: MN.m
EMMO 7f1dec83 d85e 4e1b b7bd c9442d4f5a64: MN⋅m
EMMO 967080e5 2f42 4eb2 a3a9 c58143e835f9: 1,000,000-fold of the product of the SI derived unit newton and the SI base unit metre -- QUDT

Cylinder
type: Class
comment: A 2-manifold with one unconnected boundary and two "faces".
EMMO 967080e5 2f42 4eb2 a3a9 c58143e835f9: A 2-manifold with one unconnected boundary and two "faces".

HybridMatter
type: Class
comment: Matter composed of both matter and antimatter fundamental particles.
EMMO 967080e5 2f42 4eb2 a3a9 c58143e835f9: Matter composed of both matter and antimatter fundamental particles.

Dust
type: Class
comment: A suspension of fine particles in the atmosphere.
EMMO 967080e5 2f42 4eb2 a3a9 c58143e835f9: A suspension of fine particles in the atmosphere.

PhysicsEquationSolution
type: Class
comment: A function solution of a physics equation that provides a methods for the prediction of some quantitiative properties of an object.
comment: This must be a mathematical function v(t), x(t). A dataset as solution is a conventional sign.
example: A parabolic function is a prediction of the trajectory of a falling object in a gravitational field. While it has predictive capabilities it lacks of an analogical character, since it does not show the law behind that trajectory.
EMMO 967080e5 2f42 4eb2 a3a9 c58143e835f9: A function solution of a physics equation that provides a methods for the prediction of some quantitiative properties of an object.

RhodiumAtom
type: Class
subclass of: Restriction
subclass of: Restriction
  has value: 102.9055
subclass of: Restriction
  has value: 45
comment: Atom subclass for rhodium.
EMMO 967080e5 2f42 4eb2 a3a9 c58143e835f9: Atom subclass for rhodium.

MechanicalMobilityUnit
type: Class
subclass of: Restriction
  has value: T+1 L0 M-1 I0 Θ0 N0 J0
comment: The class of units with dimensionality 'MechanicalMobility'.
EMMO 967080e5 2f42 4eb2 a3a9 c58143e835f9: The class of units with dimensionality 'MechanicalMobility'.

TransferMolding
type: Class

FiberboardManufacturing
type: Class

Plasma
type: Class
comment: A fluid in which a gas is ionized to a level where its electrical conductivity allows long-range electric and magnetic fields to dominate its behaviour.
EMMO 967080e5 2f42 4eb2 a3a9 c58143e835f9: A fluid in which a gas is ionized to a level where its electrical conductivity allows long-range electric and magnetic fields to dominate its behaviour.

Deca
type: Class
subclass of: Restriction
  has value: da
subclass of: Restriction
  has value: 10.0
comment: SI prefix who's value is 10.
alternative label: Deka
EMMO 967080e5 2f42 4eb2 a3a9 c58143e835f9: SI prefix who's value is 10.

DecayConstant
type: Class
subclass of: Restriction
comment: Disintegrations per unit time dN/dt for an atomic nucleus divided by the number of nuclei N existing at the same time t.
alternative label: DisintegrationConstant
EMMO 1f1b164d ec6a 4faa 8d5e 88bda62316cc: https://qudt.org/vocab/quantitykind/DecayConstant
EMMO 26bf1bef d192 4da6 b0eb d2209698fb54: https://www.wikidata.org/wiki/Q11477200
EMMO 50c298c2 55a2 4068 b3ac 4e948c33181f: https://www.electropedia.org/iev/iev.nsf/display
EMMO 8de5d5bf db1c 40ac b698 095ba3b18578: 10-24
EMMO 967080e5 2f42 4eb2 a3a9 c58143e835f9: Disintegrations per unit time dN/dt for an atomic nucleus divided by the number of nuclei N existing at the same time t.
EMMO fe015383 afb3 44a6 ae86 043628697aa2: https://doi.org/10.1351/goldbook.D01538

VoltPerMicroSecond
type: Class
subclass of: Restriction
  has value: 1000000.0
subclass of: Restriction
  has value: 0.0
comment: SI derived unit volt divided by the 0.000001-fold of the SI base unit second -- QUDT
alternative label: Volt Per Microsecond
EMMO 1f1b164d ec6a 4faa 8d5e 88bda62316cc: http://qudt.org/vocab/unit/V-PER-MicroSEC
EMMO 33ae2d07 5526 4555 a0b4 8f4c031b5652: V.us-1
EMMO 7f1dec83 d85e 4e1b b7bd c9442d4f5a64: V/µs
EMMO 967080e5 2f42 4eb2 a3a9 c58143e835f9: SI derived unit volt divided by the 0.000001-fold of the SI base unit second -- QUDT

SulfurAtom
type: Class
subclass of: Restriction
subclass of: Restriction
  has value: 32.06
subclass of: Restriction
  has value: 16
comment: Atom subclass for sulfur.
EMMO 967080e5 2f42 4eb2 a3a9 c58143e835f9: Atom subclass for sulfur.

Ronto
type: Class
subclass of: Restriction
  has value: r
subclass of: Restriction
  has value: 1e-27
comment: SI prefix who's value is 1e-27.
EMMO 967080e5 2f42 4eb2 a3a9 c58143e835f9: SI prefix who's value is 1e-27.

SeleniumSymbol
type: Class
subclass of: Restriction
  has value: Se
comment: The symbol that stands for the selenium atom.
EMMO 967080e5 2f42 4eb2 a3a9 c58143e835f9: The symbol that stands for the selenium atom.

AmperePerDegreeCelsius
type: Class
subclass of: Restriction
  has value: 57.29578
subclass of: Restriction
  has value: 0.0
comment: A measure used to express how a current is subject to temperature. Originally used in Wien's Law to describe phenomena related to filaments. One use today is to express how a current generator derates with temperature. -- QUDT
alternative label: Ampere per Degree Celsius
EMMO 1f1b164d ec6a 4faa 8d5e 88bda62316cc: http://qudt.org/vocab/unit/A-PER-DEG_C
EMMO 33ae2d07 5526 4555 a0b4 8f4c031b5652: A.Cel-1
EMMO 33ae2d07 5526 4555 a0b4 8f4c031b5652: A/Cel
EMMO 7f1dec83 d85e 4e1b b7bd c9442d4f5a64: A/°C
EMMO 967080e5 2f42 4eb2 a3a9 c58143e835f9: A measure used to express how a current is subject to temperature. Originally used in Wien's Law to describe phenomena related to filaments. One use today is to express how a current generator derates with temperature. -- QUDT

FormingFromIonised
type: Class

SpecificationLanguage
type: Class
comment: A language used to describe what a computer system should do.
example: ACSL, VDM, LOTUS, MML, ...
EMMO 967080e5 2f42 4eb2 a3a9 c58143e835f9: A language used to describe what a computer system should do.
EMMO c84c6752 6d64 48cc 9500 e54a3c34898d: https://en.wikipedia.org/wiki/Specification_language

PicoPascalPerKiloMetre
type: Class
subclass of: Restriction
  has value: 1e-15
subclass of: Restriction
  has value: 0.0
comment: 0.000000000001-fold of the SI derived unit pascal divided by the 1 000-fold of the SI base unit metre -- QUDT
alternative label: Picopascal Per Kilometre
EMMO 1f1b164d ec6a 4faa 8d5e 88bda62316cc: http://qudt.org/vocab/unit/PicoPA-PER-KiloM
EMMO 33ae2d07 5526 4555 a0b4 8f4c031b5652: pPa.km-1
EMMO 7f1dec83 d85e 4e1b b7bd c9442d4f5a64: pPa/km
EMMO 967080e5 2f42 4eb2 a3a9 c58143e835f9: 0.000000000001-fold of the SI derived unit pascal divided by the 1 000-fold of the SI base unit metre -- QUDT

SquareCentiMetrePerGram
type: Class
subclass of: Restriction
  has value: 0.1
subclass of: Restriction
  has value: 0.0

MegaVolt
type: Class
subclass of: Restriction
  has value: 1000000.0
subclass of: Restriction
  has value: 0.0
comment: 1,000,000-fold of the derived unit volt -- QUDT
EMMO 1f1b164d ec6a 4faa 8d5e 88bda62316cc: http://qudt.org/vocab/unit/MegaV
EMMO 33ae2d07 5526 4555 a0b4 8f4c031b5652: MV
EMMO 7f1dec83 d85e 4e1b b7bd c9442d4f5a64: MV
EMMO 967080e5 2f42 4eb2 a3a9 c58143e835f9: 1,000,000-fold of the derived unit volt -- QUDT

ArsenicSymbol
type: Class
subclass of: Restriction
  has value: As
comment: The symbol that stands for the arsenic atom.
EMMO 967080e5 2f42 4eb2 a3a9 c58143e835f9: The symbol that stands for the arsenic atom.

RatioOfSpecificHeatCapacities
type: Class
comment: Ratio of specific heat capacity at constant pressure cp to specific heat capacity at constant volume cV, thus γ = cp/cV.
EMMO 1f1b164d ec6a 4faa 8d5e 88bda62316cc: https://qudt.org/vocab/quantitykind/HeatCapacityRatio
EMMO 26bf1bef d192 4da6 b0eb d2209698fb54: https://www.wikidata.org/wiki/Q503869
EMMO 50c298c2 55a2 4068 b3ac 4e948c33181f: https://www.electropedia.org/iev/iev.nsf/display
EMMO 8de5d5bf db1c 40ac b698 095ba3b18578: 5-17.1
EMMO 967080e5 2f42 4eb2 a3a9 c58143e835f9: Ratio of specific heat capacity at constant pressure cp to specific heat capacity at constant volume cV, thus γ = cp/cV.

KelvinPerSecond
type: Class
subclass of: Restriction
  has value: 1.0
subclass of: Restriction
  has value: 0.0
comment: `Kelvin per Second` is a unit for 'Temperature Per Time' expressed as K / s. -- QUDT
alternative label: Kelvin per Second
EMMO 1f1b164d ec6a 4faa 8d5e 88bda62316cc: http://qudt.org/vocab/unit/K-PER-SEC
EMMO 33ae2d07 5526 4555 a0b4 8f4c031b5652: K.s-1
EMMO 33ae2d07 5526 4555 a0b4 8f4c031b5652: K/s
EMMO 7f1dec83 d85e 4e1b b7bd c9442d4f5a64: K/s
EMMO 967080e5 2f42 4eb2 a3a9 c58143e835f9: `Kelvin per Second` is a unit for 'Temperature Per Time' expressed as K / s. -- QUDT

MathematicalConstruct
type: Class
equivalent class: Class
subclass of: Restriction
comment: A construct of two or more mathematical symbols.
EMMO 967080e5 2f42 4eb2 a3a9 c58143e835f9: A construct of two or more mathematical symbols.

WattPerSquareMetrePerNanoMetre
type: Class
subclass of: Restriction
  has value: 1000000000.0
subclass of: Restriction
  has value: 0.0
comment: Watt per square metre and nanometre.
EMMO 1f1b164d ec6a 4faa 8d5e 88bda62316cc: http://qudt.org/vocab/unit/W-PER-M2-NanoM
EMMO 33ae2d07 5526 4555 a0b4 8f4c031b5652: W.m-2.nm-1
EMMO 7f1dec83 d85e 4e1b b7bd c9442d4f5a64: W/m²⋅nm
EMMO 967080e5 2f42 4eb2 a3a9 c58143e835f9: Watt per square metre and nanometre.

ModulusOfCompression
type: Class
subclass of: Restriction
comment: Measure of how resistant to compressibility a substance is.
alternative label: BulkModulus
EMMO 1f1b164d ec6a 4faa 8d5e 88bda62316cc: https://qudt.org/vocab/quantitykind/BulkModulus
EMMO 26bf1bef d192 4da6 b0eb d2209698fb54: https://www.wikidata.org/wiki/Q900371
EMMO 50c298c2 55a2 4068 b3ac 4e948c33181f: https://www.electropedia.org/iev/iev.nsf/display
EMMO 8de5d5bf db1c 40ac b698 095ba3b18578: 4-19.3
EMMO 967080e5 2f42 4eb2 a3a9 c58143e835f9: Measure of how resistant to compressibility a substance is.