reference context
type: ObjectProperty

Annotation
type: Class
subclass of: Restriction
  on property:
    inverse of: item
  on class: Annotation Set
  qualified cardinality: 1

Predicate Model for Ontologies (PreMOn) - Core ontology module
type: Ontology
issued: 2015-10-28
modified: 2018-02-15
version info: 2018a
creator: Francesco Corcoglioniti
creator: Marco Rospocher <https://dkm.fbk.eu/rospocher>
description: ### Semantic Classes and Roles The *PreMOn Ontology Core Module* extends *lemon* by introducing classes [pmo:SemanticClass](http://premon.fbk.eu/ontology/core#SemanticClass) and [pmo:SemanticRole](http://premon.fbk.eu/ontology/core#SemanticRole). [pmo:SemanticClass](http://premon.fbk.eu/ontology/core#SemanticClass) homogeneously represents the semantic classes from the various predicate models. That is, individuals of this class correspond to rolesets in PB and NB (e.g., *pm:nb10-seller.01* and *pm:pb17-sell.01*), verb classes in VN (e.g., *pm:vn32-give-13.1-1*), and frames in FN (e.g., *pm:fn15-commerce sell*). An instance of [pmo:SemanticClass](http://premon.fbk.eu/ontology/core#SemanticClass) typically has (via property [pmo:semRole](http://premon.fbk.eu/ontology/core#semRole)) a number of [pmo:SemanticRole](http://premon.fbk.eu/ontology/core#SemanticRole)s, representing, from a semantic point of view, the roles the arguments of that [pmo:SemanticClass](http://premon.fbk.eu/ontology/core#SemanticClass) can play. Semantic roles are defined locally to semantic classes, so VN *agent* is represented as multiple semantic roles, one for each verb class it occurs in, and with each semantic role linked to its specific selectional restrictions (if any). Note that [pmo:SemanticClass](http://premon.fbk.eu/ontology/core#SemanticClass) is defined as subclass of [ontolex:LexicalConcept](https://www.w3.org/community/ontolex/wiki/Final_Model_Specification#Lexical_Concept), as we see [pmo:SemanticClass](http://premon.fbk.eu/ontology/core#SemanticClass)es as essentially informal concepts rather than well defined concepts of a formal ontology (although an ontology can be derived from them, cf., FrameBase and ESO). In particular, being [ontolex:LexicalConcept](https://www.w3.org/community/ontolex/wiki/Final_Model_Specification#Lexical_Concept)s, [pmo:SemanticClass](http://premon.fbk.eu/ontology/core#SemanticClass)es inherit the link to lexical entries. Properties [pmo:classRel](http…
publisher: DKM, Fondazione Bruno Kessler <http://dkm.fbk.eu/>
comment: The [PreMOn Ontology](http://premon.fbk.eu) is an extension of [lemon](https://www.w3.org/community/ontolex/wiki/Final_Model_Specification) (W3C Ontology Lexicon Community Group, 2015) for representing *predicate models* and their *mappings*. The Core Module of the PreMOn Ontology defines the main abstractions for modelling *semantic classes* with their *semantic roles*, *mappings* between different predicate models, and *annotations*.
rights: This ontology is licensed under CC-BY-SA <http://creativecommons.org/licenses/by-sa/4.0/>
preferred namespace uri: http://premon.fbk.eu/ontology/core#
preferred namespace prefix: pmo
license: http://creativecommons.org/licenses/by-sa/4.0/
imports: ontolex

semantic class relation
type: ObjectProperty
domain: Semantic Class
range: Semantic Class

Semantic Class
type: Class
comment: SemanticClass homogeneously represents the semantic classes from the various predicate models. That is, individuals of this class correspond to rolesets in PB and NB (e.g., pm:nb10-seller.01 and pm:pb17-sell.01), verb classes in VN (e.g., pm:vn32-give-13.1-1), and frames in FN (e.g., pm:fn15-commerce sell).
subclass of: LexicalConcept

evoked concept
type: ObjectProperty
type: FunctionalProperty
domain: Conceptualization
range: LexicalConcept
sub property of: topObjectProperty

Conceptualization
type: Class
comment: Structurally, it can be seen as the reification of the ontolex:evokes relation between ontolex:LexicalEntry and ontolex:LexicalConcept. Semantically, it can be seen as a very specific intensional concept (among many, in case of polysemy) evoked by a single ontolex:LexicalEntry, which can be generalized to a ontolex:LexicalConcept when multiple entries are considered but with a possible loss of information that prevents precise alignments to be represented.
subclass of: Concept
subclass of: Restriction
  on property: evoked concept
  on class: LexicalConcept
  qualified cardinality: 1
subclass of: Restriction
  on property: evoking entry
  on class: LexicalEntry
  qualified cardinality: 1

evoking entry
type: ObjectProperty
type: FunctionalProperty
domain: Conceptualization
range: LexicalEntry

first
type: ObjectProperty
comment: first, item, next are used to model set-like construct
sub property of: item

item
type: ObjectProperty
comment: first, item, next are used to model set-like construct
property chain axiom: item
property chain axiom: next

next
type: ObjectProperty
comment: first, item, next are used to model set-like construct

semantic role relation
type: ObjectProperty
domain: Semantic Role
range: Semantic Role

Semantic Role
type: Class
comment: SemanticRoles tepresent the roles the arguments of a SemanticClass can play. Semantic roles are defined locally to semantic classes, so VN agent is represented as multiple semantic roles, one for each verb class it occurs in, and with each semantic role linked to its specific selectional restrictions (if any).
subclass of: Concept

semantic role
type: ObjectProperty
domain: Semantic Class
range: Semantic Role

semantic role mapping
type: ObjectProperty
comment: relates a mapping between semantic roles to the corresponding mapping between semantic classes and/or conceptualizations
domain: Class
  union of: Conceptualization Mapping
  union of: Semantic Class Mapping
range: Semantic Role Mapping

Semantic Role Mapping
type: Class
comment: An individual of this class represents a mapping between SemanticRoles
subclass of: Mapping
subclass of: Restriction
  on property:
    inverse of: semantic role mapping
  some values from: Thing
subclass of: Restriction
  on property: item
  all values from: Semantic Role

Conceptualization Mapping
type: Class
comment: An individual of this class represents a mapping between Conceptualizations
subclass of: Mapping
subclass of: Restriction
  on property: item
  all values from: Conceptualization

Semantic Class Mapping
type: Class
comment: An individual of this class represents a mapping between SemanticClasses
subclass of: Mapping
subclass of: Restriction
  on property: item
  all values from: Semantic Class

value
type: ObjectProperty
comment: generic property to associate an object value to an instance

ontology (exact) match
type: ObjectProperty
comment: PreMOn generic property to associate a SKOS concept to an ontological entity
domain: Concept
range: Resource

abbreviation
type: DatatypeProperty
range: string
sub property of: topDataProperty

valueDt
type: DatatypeProperty
comment: generic property to associate an data value to an instance
comment: value

Annotation Set
type: Class
comment: Represent each annotation of a semantic class, togheter with its semantic roles, in an example
subclass of: Restriction
  on property: item
  all values from: Annotation
subclass of: Restriction
  on property: item
  on class: Annotation
  min qualified cardinality: 1

Mapping
type: Class
comment: An individual of this class represents a mapping between skos:Concepts
subclass of: Restriction
  on property: item
  on class: Concept
  min qualified cardinality: 2
subclass of: Class
  union of: Restriction
    on property: item
    all values from: Conceptualization
  union of: Restriction
    on property: item
    all values from: Semantic Class
  union of: Restriction
    on property: item
    all values from: Semantic Role

Example
type: Class
comment: Represent the text associated to an example
subclass of: Context
subclass of: Restriction
  on property:
    inverse of: reference context
  all values from: Markable

Markable
type: Class
comment: Represent a piece of text to which some annotation is attached to
subclass of: RFC5147String
subclass of: Restriction
  on property: reference context
  on class: Example
  qualified cardinality: 1
subclass of: Restriction
  on property: reference context
  all values from: Example